{"text_format":"1","workbook":"xlsx","n_sheets":3,"sheets":["Project Summary Sheet","References","Savings Check"],"not_rendered":{"charts":0,"images":5,"macros":1,"external_links":1,"defined_names":2,"comments":0,"pivot_tables":0},"unopened":[],"bounds":{"document_bytes":16777216,"sheet_cells":100000,"rows_first":2000,"rows_last":500,"rows_between":2000,"halvings":0,"cell_chars":16384,"cell_head_chars":4096},"cells_cut":0,"cells_raw":0,"read":"whole","date_system":"1900"}

{"sheet":"Project Summary Sheet","index":0,"n_rows":61,"n_cols":13,"rows_kept":61,"cut":false,"hidden":false,"merged":[[59,0,59,4],[60,0,60,4],[53,0,53,2],[54,0,54,2],[55,0,55,2],[56,0,56,2],[57,0,57,2],[58,0,58,2],[52,0,52,2],[41,0,41,2],[42,0,42,2],[43,0,43,2],[44,0,44,2],[45,0,45,2],[46,0,46,2],[47,0,47,2],[48,0,48,2],[49,0,49,2],[50,0,50,2],[51,0,51,2],[40,0,40,2],[29,0,29,2],[30,0,30,2],[31,0,31,2],[32,0,32,2],[33,0,33,2],[34,0,34,2],[35,0,35,2],[36,0,36,2],[37,0,37,2],[38,0,38,2],[39,0,39,2],[14,0,14,2],[15,0,15,2],[28,0,28,2],[17,0,17,2],[18,0,18,2],[19,0,19,2],[20,0,20,2],[21,0,21,2],[22,0,22,2],[23,0,23,2],[24,0,24,2],[25,0,25,2],[26,0,26,2],[27,0,27,2],[16,0,16,2],[7,11,8,11],[7,12,8,12],[9,0,9,2],[7,7,8,7],[7,8,8,8],[11,0,11,2],[12,0,12,2],[13,0,13,2],[6,0,6,12],[0,0,0,12],[1,10,1,11],[2,10,2,11],[3,10,3,11],[4,10,4,11],[10,0,10,2],[7,0,8,2],[7,3,8,3],[7,4,8,4],[7,5,7,6],[7,9,8,9],[7,10,8,10]]}
["BASELINE ENERGY SUMMARY"]
[null,"Electric \n(kWh)","Natural Gas (therms)","#2 Oil (gallons)","#4 Oil (gallons)","#6 Oil (gallons)","Steam \n(lbs.)","Propane (gallons)","Coal \n(tons)","Other \n(MMBtu)","Total Baseline Use (MMBtu)"]
["Baseline Energy Use",null,null,null,null,null,null,null,null,null,{"$f":"$B$3*References!$I$4+$C$3*References!$I$5+$D$3*References!$I$6+$E$3*References!$I$7+$F$3*References!$I$8+$G$3*References!$I$9+$H$3*References!$I$10+$I$3*References!$I$11+$J$3","v":0}]
["Average Utility Rate",null,null,null,null,null,null,null,null,null,"Total Annual Cost ($)"]
[" Baseline Annual Cost",null,null,null,null,null,null,null,null,null,{"$f":"SUM(B5:J5)","v":0}]
[]
["ENERGY SAVINGS SUMMARY"]
["Measure Description",null,null,"Measure Status 1","Fuel Savings Type 2","Electric",null,"Fuel Savings\n(MMBtu)","Energy Savings \nto Total Baseline Use (%) 3","Annual Cost Savings","Cost Savings \nto Total Annual Cost (%) 4","Project Cost","Simple Payback\n(Years)"]
[null,null,null,null,null,"Supply Savings\n(kWh)","Demand Savings\n(kW)"]
[null,null,null,null,null,null,null,null,{"$f":"IF(AND(F10=\"\",H10=\"\"),\"\",(F10*References!$I$4+H10)/$K$3)","v":""},null,{"$f":"IF(J10=\"\",\"\",J10/$K$5)","v":""},null,{"$f":"IFERROR(L10/J10,\"\")","v":""}]
[null,null,null,null,null,null,null,null,{"$f":"IF(AND(F11=\"\",H11=\"\"),\"\",(F11*References!$I$4+H11)/$K$3)","v":""},null,"",null,{"$f":"IFERROR(L11/J11,\"\")","v":""}]
[null,null,null,null,null,null,null,null,{"$f":"IF(AND(F12=\"\",H12=\"\"),\"\",(F12*References!$I$4+H12)/$K$3)","v":""},null,"",null,""]
[null,null,null,null,null,null,null,null,{"$f":"IF(AND(F13=\"\",H13=\"\"),\"\",(F13*References!$I$4+H13)/$K$3)","v":""},null,"",null,""]
[null,null,null,null,null,null,null,null,{"$f":"IF(AND(F14=\"\",H14=\"\"),\"\",(F14*References!$I$4+H14)/$K$3)","v":""},null,"",null,""]
[null,null,null,null,null,null,null,null,{"$f":"IF(AND(F15=\"\",H15=\"\"),\"\",(F15*References!$I$4+H15)/$K$3)","v":""},null,"",null,""]
[null,null,null,null,null,null,null,null,{"$f":"IF(AND(F16=\"\",H16=\"\"),\"\",(F16*References!$I$4+H16)/$K$3)","v":""},null,"",null,""]
[null,null,null,null,null,null,null,null,{"$f":"IF(AND(F17=\"\",H17=\"\"),\"\",(F17*References!$I$4+H17)/$K$3)","v":""},null,"",null,""]
[null,null,null,null,null,null,null,null,{"$f":"IF(AND(F18=\"\",H18=\"\"),\"\",(F18*References!$I$4+H18)/$K$3)","v":""},null,"",null,""]
[null,null,null,null,null,null,null,null,{"$f":"IF(AND(F19=\"\",H19=\"\"),\"\",(F19*References!$I$4+H19)/$K$3)","v":""},null,"",null,""]
[null,null,null,null,null,null,null,null,{"$f":"IF(AND(F20=\"\",H20=\"\"),\"\",(F20*References!$I$4+H20)/$K$3)","v":""},null,"",null,""]
[null,null,null,null,null,null,null,null,{"$f":"IF(AND(F21=\"\",H21=\"\"),\"\",(F21*References!$I$4+H21)/$K$3)","v":""},null,"",null,""]
[null,null,null,null,null,null,null,null,{"$f":"IF(AND(F22=\"\",H22=\"\"),\"\",(F22*References!$I$4+H22)/$K$3)","v":""},null,"",null,""]
[null,null,null,null,null,null,null,null,{"$f":"IF(AND(F23=\"\",H23=\"\"),\"\",(F23*References!$I$4+H23)/$K$3)","v":""},null,"",null,""]
[null,null,null,null,null,null,null,null,{"$f":"IF(AND(F24=\"\",H24=\"\"),\"\",(F24*References!$I$4+H24)/$K$3)","v":""},null,"",null,{"$f":"IFERROR(L24/J24,\"\")","v":""}]
[null,null,null,null,null,null,null,null,{"$f":"IF(AND(F25=\"\",H25=\"\"),\"\",(F25*References!$I$4+H25)/$K$3)","v":""},null,"",null,{"$f":"IFERROR(L25/J25,\"\")","v":""}]
[null,null,null,null,null,null,null,null,{"$f":"IF(AND(F26=\"\",H26=\"\"),\"\",(F26*References!$I$4+H26)/$K$3)","v":""},null,"",null,""]
[null,null,null,null,null,null,null,null,{"$f":"IF(AND(F27=\"\",H27=\"\"),\"\",(F27*References!$I$4+H27)/$K$3)","v":""},null,"",null,""]
[null,null,null,null,null,null,null,null,{"$f":"IF(AND(F28=\"\",H28=\"\"),\"\",(F28*References!$I$4+H28)/$K$3)","v":""},null,"",null,""]
[null,null,null,null,null,null,null,null,{"$f":"IF(AND(F29=\"\",H29=\"\"),\"\",(F29*References!$I$4+H29)/$K$3)","v":""},null,"",null,""]
[null,null,null,null,null,null,null,null,{"$f":"IF(AND(F30=\"\",H30=\"\"),\"\",(F30*References!$I$4+H30)/$K$3)","v":""},null,"",null,""]
{"$rows_left_out":32}
{"sheet":"References","index":1,"n_rows":23,"n_cols":9,"rows_kept":23,"cut":false,"hidden":false,"merged":[[22,0,22,8],[14,0,14,9],[15,0,15,9],[16,0,16,9],[20,0,20,9],[1,4,1,5],[1,7,1,8],[19,0,19,8],[1,1,1,2],[21,0,21,8]]}
[]
[null,"Measure Status1",null,null,"Fuel Saved",null,null,"MMBtu Conversion Factors"]
[null,"I","Implemented",null,"Elec","Electric",null,"Btu",1000000]
[null,"R","Recommended",null,"NGas","Natural Gas",null,"kWh",3.4120000000000001E-3]
[null,"RS","Further Study Recommended",null,"Oil2","#2 Oil",null,"therms",0.1]
[null,"NR","Not Recommended",null,"Oil4","#4 Oil",null,"#2 gallon",0.13900000000000001]
[null,"RME","Recommeded Mutually Exclusive",null,"Oil6","#6 Oil",null,"#4 gallon",0.1467]
[null,"ME","Mutually Exclusive to Recommended Option",null,"Steam","District Steam",null,"#6 gallon",0.15]
[null,"RNE","Recommended Non-Energy",null,"LPG","Propane",null,"Steam lbs.",1.1999999999999999E-3]
[null,null,null,null,"Coal","Coal",null,"LPG gallon",9.1499999999999998E-2]
[null,null,null,null,"Other","Other",null,"Coal tons",24]
[]
[]
["Notes:"]
["2 Fuel Savings Type: Indicate the reported MMBtu savings fuel type. Select the predominant fuel type if there are MMBtu \n  savings from multiple fuel sources"]
["3 Energy Savings to Total Fuel Baseline Use is a comparison of the total electric & fuel savings to the total baseline energy use"]
["4 Cost Savings to Total Annual Cost is a comparison of the total annual cost savings to the total baseline annual energy cost"]
[]
["Instructions:"]
["* Fill in the light blue cells, as appropriate. White cells will auto-calculate."]
["* Energy savings must be presented as savings at the customer’s utility meter(s), not at the individual building or tenant space"]
["* Update the baseline energy use conversion factors in the 'References' tab, as necessary"]
["* Unhide rows to enter more measures, as necessary"]

{"sheet":"Savings Check","index":2,"n_rows":53,"n_cols":4,"rows_kept":53,"cut":false,"hidden":true,"merged":[]}
["Measure","Electric (kWh) \nsavings over \nElectric (kWh) baseline","Fuel (MMBtu) \nsavings over \nFuel (MMBtu) baseline","Total Project Energy savings\n(all energy sources): "]
[{"$f":"IF('Project Summary Sheet'!A10=\"\",\"\",'Project Summary Sheet'!A10)","v":""},{"$f":"IFERROR(VLOOKUP(A2,'Project Summary Sheet'!$A$8:$M$59,6,FALSE)/'Project Summary Sheet'!$B$3,\"\")","v":""},{"$f":"IFERROR(VLOOKUP(A2,'Project Summary Sheet'!$A$8:$M$59,8,FALSE)/('Project Summary Sheet'!$K$3-('Project Summary Sheet'!$B$3*References!$I$4)),\"\")","v":""},{"$f":"IFERROR(((VLOOKUP(A2,'Project Summary Sheet'!$A$8:$M$59,6,FALSE)*References!$I$4)+VLOOKUP(A2,'Project Summary Sheet'!$A$8:$M$59,8,FALSE))/'Project Summary Sheet'!$K$3,\"\")","v":""}]
[{"$f":"IF('Project Summary Sheet'!A11=\"\",\"\",'Project Summary Sheet'!A11)","v":""},{"$f":"IFERROR(VLOOKUP(A3,'Project Summary Sheet'!$A$8:$M$59,6,FALSE)/'Project Summary Sheet'!$B$3,\"\")","v":""},{"$f":"IFERROR(VLOOKUP(A3,'Project Summary Sheet'!$A$8:$M$59,8,FALSE)/('Project Summary Sheet'!$K$3-('Project Summary Sheet'!$B$3*References!$I$4)),\"\")","v":""},{"$f":"IFERROR(((VLOOKUP(A3,'Project Summary Sheet'!$A$8:$M$59,6,FALSE)*References!$I$4)+VLOOKUP(A3,'Project Summary Sheet'!$A$8:$M$59,8,FALSE))/'Project Summary Sheet'!$K$3,\"\")","v":""}]
[{"$f":"IF('Project Summary Sheet'!A12=\"\",\"\",'Project Summary Sheet'!A12)","v":""},{"$f":"IFERROR(VLOOKUP(A4,'Project Summary Sheet'!$A$8:$M$59,6,FALSE)/'Project Summary Sheet'!$B$3,\"\")","v":""},{"$f":"IFERROR(VLOOKUP(A4,'Project Summary Sheet'!$A$8:$M$59,8,FALSE)/('Project Summary Sheet'!$K$3-('Project Summary Sheet'!$B$3*References!$I$4)),\"\")","v":""},{"$f":"IFERROR(((VLOOKUP(A4,'Project Summary Sheet'!$A$8:$M$59,6,FALSE)*References!$I$4)+VLOOKUP(A4,'Project Summary Sheet'!$A$8:$M$59,8,FALSE))/'Project Summary Sheet'!$K$3,\"\")","v":""}]
[{"$f":"IF('Project Summary Sheet'!A13=\"\",\"\",'Project Summary Sheet'!A13)","v":""},{"$f":"IFERROR(VLOOKUP(A5,'Project Summary Sheet'!$A$8:$M$59,6,FALSE)/'Project Summary Sheet'!$B$3,\"\")","v":""},{"$f":"IFERROR(VLOOKUP(A5,'Project Summary Sheet'!$A$8:$M$59,8,FALSE)/('Project Summary Sheet'!$K$3-('Project Summary Sheet'!$B$3*References!$I$4)),\"\")","v":""},{"$f":"IFERROR(((VLOOKUP(A5,'Project Summary Sheet'!$A$8:$M$59,6,FALSE)*References!$I$4)+VLOOKUP(A5,'Project Summary Sheet'!$A$8:$M$59,8,FALSE))/'Project Summary Sheet'!$K$3,\"\")","v":""}]
[{"$f":"IF('Project Summary Sheet'!A14=\"\",\"\",'Project Summary Sheet'!A14)","v":""},{"$f":"IFERROR(VLOOKUP(A6,'Project Summary Sheet'!$A$8:$M$59,6,FALSE)/'Project Summary Sheet'!$B$3,\"\")","v":""},{"$f":"IFERROR(VLOOKUP(A6,'Project Summary Sheet'!$A$8:$M$59,8,FALSE)/('Project Summary Sheet'!$K$3-('Project Summary Sheet'!$B$3*References!$I$4)),\"\")","v":""},{"$f":"IFERROR(((VLOOKUP(A6,'Project Summary Sheet'!$A$8:$M$59,6,FALSE)*References!$I$4)+VLOOKUP(A6,'Project Summary Sheet'!$A$8:$M$59,8,FALSE))/'Project Summary Sheet'!$K$3,\"\")","v":""}]
[{"$f":"IF('Project Summary Sheet'!A15=\"\",\"\",'Project Summary Sheet'!A15)","v":""},{"$f":"IFERROR(VLOOKUP(A7,'Project Summary Sheet'!$A$8:$M$59,6,FALSE)/'Project Summary Sheet'!$B$3,\"\")","v":""},{"$f":"IFERROR(VLOOKUP(A7,'Project Summary Sheet'!$A$8:$M$59,8,FALSE)/('Project Summary Sheet'!$K$3-('Project Summary Sheet'!$B$3*References!$I$4)),\"\")","v":""},{"$f":"IFERROR(((VLOOKUP(A7,'Project Summary Sheet'!$A$8:$M$59,6,FALSE)*References!$I$4)+VLOOKUP(A7,'Project Summary Sheet'!$A$8:$M$59,8,FALSE))/'Project Summary Sheet'!$K$3,\"\")","v":""}]
[{"$f":"IF('Project Summary Sheet'!A16=\"\",\"\",'Project Summary Sheet'!A16)","v":""},{"$f":"IFERROR(VLOOKUP(A8,'Project Summary Sheet'!$A$8:$M$59,6,FALSE)/'Project Summary Sheet'!$B$3,\"\")","v":""},{"$f":"IFERROR(VLOOKUP(A8,'Project Summary Sheet'!$A$8:$M$59,8,FALSE)/('Project Summary Sheet'!$K$3-('Project Summary Sheet'!$B$3*References!$I$4)),\"\")","v":""},{"$f":"IFERROR(((VLOOKUP(A8,'Project Summary Sheet'!$A$8:$M$59,6,FALSE)*References!$I$4)+VLOOKUP(A8,'Project Summary Sheet'!$A$8:$M$59,8,FALSE))/'Project Summary Sheet'!$K$3,\"\")","v":""}]
[{"$f":"IF('Project Summary Sheet'!A17=\"\",\"\",'Project Summary Sheet'!A17)","v":""},{"$f":"IFERROR(VLOOKUP(A9,'Project Summary Sheet'!$A$8:$M$59,6,FALSE)/'Project Summary Sheet'!$B$3,\"\")","v":""},{"$f":"IFERROR(VLOOKUP(A9,'Project Summary Sheet'!$A$8:$M$59,8,FALSE)/('Project Summary Sheet'!$K$3-('Project Summary Sheet'!$B$3*References!$I$4)),\"\")","v":""},{"$f":"IFERROR(((VLOOKUP(A9,'Project Summary Sheet'!$A$8:$M$59,6,FALSE)*References!$I$4)+VLOOKUP(A9,'Project Summary Sheet'!$A$8:$M$59,8,FALSE))/'Project Summary Sheet'!$K$3,\"\")","v":""}]
[{"$f":"IF('Project Summary Sheet'!A18=\"\",\"\",'Project Summary Sheet'!A18)","v":""},{"$f":"IFERROR(VLOOKUP(A10,'Project Summary Sheet'!$A$8:$M$59,6,FALSE)/'Project Summary Sheet'!$B$3,\"\")","v":""},{"$f":"IFERROR(VLOOKUP(A10,'Project Summary Sheet'!$A$8:$M$59,8,FALSE)/('Project Summary Sheet'!$K$3-('Project Summary Sheet'!$B$3*References!$I$4)),\"\")","v":""},{"$f":"IFERROR(((VLOOKUP(A10,'Project Summary Sheet'!$A$8:$M$59,6,FALSE)*References!$I$4)+VLOOKUP(A10,'Project Summary Sheet'!$A$8:$M$59,8,FALSE))/'Project Summary Sheet'!$K$3,\"\")","v":""}]
[{"$f":"IF('Project Summary Sheet'!A19=\"\",\"\",'Project Summary Sheet'!A19)","v":""},{"$f":"IFERROR(VLOOKUP(A11,'Project Summary Sheet'!$A$8:$M$59,6,FALSE)/'Project Summary Sheet'!$B$3,\"\")","v":""},{"$f":"IFERROR(VLOOKUP(A11,'Project Summary Sheet'!$A$8:$M$59,8,FALSE)/('Project Summary Sheet'!$K$3-('Project Summary Sheet'!$B$3*References!$I$4)),\"\")","v":""},{"$f":"IFERROR(((VLOOKUP(A11,'Project Summary Sheet'!$A$8:$M$59,6,FALSE)*References!$I$4)+VLOOKUP(A11,'Project Summary Sheet'!$A$8:$M$59,8,FALSE))/'Project Summary Sheet'!$K$3,\"\")","v":""}]
[{"$f":"IF('Project Summary Sheet'!A20=\"\",\"\",'Project Summary Sheet'!A20)","v":""},{"$f":"IFERROR(VLOOKUP(A12,'Project Summary Sheet'!$A$8:$M$59,6,FALSE)/'Project Summary Sheet'!$B$3,\"\")","v":""},{"$f":"IFERROR(VLOOKUP(A12,'Project Summary Sheet'!$A$8:$M$59,8,FALSE)/('Project Summary Sheet'!$K$3-('Project Summary Sheet'!$B$3*References!$I$4)),\"\")","v":""},{"$f":"IFERROR(((VLOOKUP(A12,'Project Summary Sheet'!$A$8:$M$59,6,FALSE)*References!$I$4)+VLOOKUP(A12,'Project Summary Sheet'!$A$8:$M$59,8,FALSE))/'Project Summary Sheet'!$K$3,\"\")","v":""}]
[{"$f":"IF('Project Summary Sheet'!A21=\"\",\"\",'Project Summary Sheet'!A21)","v":""},{"$f":"IFERROR(VLOOKUP(A13,'Project Summary Sheet'!$A$8:$M$59,6,FALSE)/'Project Summary Sheet'!$B$3,\"\")","v":""},{"$f":"IFERROR(VLOOKUP(A13,'Project Summary Sheet'!$A$8:$M$59,8,FALSE)/('Project Summary Sheet'!$K$3-('Project Summary Sheet'!$B$3*References!$I$4)),\"\")","v":""},{"$f":"IFERROR(((VLOOKUP(A13,'Project Summary Sheet'!$A$8:$M$59,6,FALSE)*References!$I$4)+VLOOKUP(A13,'Project Summary Sheet'!$A$8:$M$59,8,FALSE))/'Project Summary Sheet'!$K$3,\"\")","v":""}]
[{"$f":"IF('Project Summary Sheet'!A22=\"\",\"\",'Project Summary Sheet'!A22)","v":""},{"$f":"IFERROR(VLOOKUP(A14,'Project Summary Sheet'!$A$8:$M$59,6,FALSE)/'Project Summary Sheet'!$B$3,\"\")","v":""},{"$f":"IFERROR(VLOOKUP(A14,'Project Summary Sheet'!$A$8:$M$59,8,FALSE)/('Project Summary Sheet'!$K$3-('Project Summary Sheet'!$B$3*References!$I$4)),\"\")","v":""},{"$f":"IFERROR(((VLOOKUP(A14,'Project Summary Sheet'!$A$8:$M$59,6,FALSE)*References!$I$4)+VLOOKUP(A14,'Project Summary Sheet'!$A$8:$M$59,8,FALSE))/'Project Summary Sheet'!$K$3,\"\")","v":""}]
[{"$f":"IF('Project Summary Sheet'!A23=\"\",\"\",'Project Summary Sheet'!A23)","v":""},{"$f":"IFERROR(VLOOKUP(A15,'Project Summary Sheet'!$A$8:$M$59,6,FALSE)/'Project Summary Sheet'!$B$3,\"\")","v":""},{"$f":"IFERROR(VLOOKUP(A15,'Project Summary Sheet'!$A$8:$M$59,8,FALSE)/('Project Summary Sheet'!$K$3-('Project Summary Sheet'!$B$3*References!$I$4)),\"\")","v":""},{"$f":"IFERROR(((VLOOKUP(A15,'Project Summary Sheet'!$A$8:$M$59,6,FALSE)*References!$I$4)+VLOOKUP(A15,'Project Summary Sheet'!$A$8:$M$59,8,FALSE))/'Project Summary Sheet'!$K$3,\"\")","v":""}]
[{"$f":"IF('Project Summary Sheet'!A24=\"\",\"\",'Project Summary Sheet'!A24)","v":""},{"$f":"IFERROR(VLOOKUP(A16,'Project Summary Sheet'!$A$8:$M$59,6,FALSE)/'Project Summary Sheet'!$B$3,\"\")","v":""},{"$f":"IFERROR(VLOOKUP(A16,'Project Summary Sheet'!$A$8:$M$59,8,FALSE)/('Project Summary Sheet'!$K$3-('Project Summary Sheet'!$B$3*References!$I$4)),\"\")","v":""},{"$f":"IFERROR(((VLOOKUP(A16,'Project Summary Sheet'!$A$8:$M$59,6,FALSE)*References!$I$4)+VLOOKUP(A16,'Project Summary Sheet'!$A$8:$M$59,8,FALSE))/'Project Summary Sheet'!$K$3,\"\")","v":""}]
[{"$f":"IF('Project Summary Sheet'!A25=\"\",\"\",'Project Summary Sheet'!A25)","v":""},{"$f":"IFERROR(VLOOKUP(A17,'Project Summary Sheet'!$A$8:$M$59,6,FALSE)/'Project Summary Sheet'!$B$3,\"\")","v":""},{"$f":"IFERROR(VLOOKUP(A17,'Project Summary Sheet'!$A$8:$M$59,8,FALSE)/('Project Summary Sheet'!$K$3-('Project Summary Sheet'!$B$3*References!$I$4)),\"\")","v":""},{"$f":"IFERROR(((VLOOKUP(A17,'Project Summary Sheet'!$A$8:$M$59,6,FALSE)*References!$I$4)+VLOOKUP(A17,'Project Summary Sheet'!$A$8:$M$59,8,FALSE))/'Project Summary Sheet'!$K$3,\"\")","v":""}]
[{"$f":"IF('Project Summary Sheet'!A26=\"\",\"\",'Project Summary Sheet'!A26)","v":""},{"$f":"IFERROR(VLOOKUP(A18,'Project Summary Sheet'!$A$8:$M$59,6,FALSE)/'Project Summary Sheet'!$B$3,\"\")","v":""},{"$f":"IFERROR(VLOOKUP(A18,'Project Summary Sheet'!$A$8:$M$59,8,FALSE)/('Project Summary Sheet'!$K$3-('Project Summary Sheet'!$B$3*References!$I$4)),\"\")","v":""},{"$f":"IFERROR(((VLOOKUP(A18,'Project Summary Sheet'!$A$8:$M$59,6,FALSE)*References!$I$4)+VLOOKUP(A18,'Project Summary Sheet'!$A$8:$M$59,8,FALSE))/'Project Summary Sheet'!$K$3,\"\")","v":""}]
[{"$f":"IF('Project Summary Sheet'!A27=\"\",\"\",'Project Summary Sheet'!A27)","v":""},{"$f":"IFERROR(VLOOKUP(A19,'Project Summary Sheet'!$A$8:$M$59,6,FALSE)/'Project Summary Sheet'!$B$3,\"\")","v":""},{"$f":"IFERROR(VLOOKUP(A19,'Project Summary Sheet'!$A$8:$M$59,8,FALSE)/('Project Summary Sheet'!$K$3-('Project Summary Sheet'!$B$3*References!$I$4)),\"\")","v":""},{"$f":"IFERROR(((VLOOKUP(A19,'Project Summary Sheet'!$A$8:$M$59,6,FALSE)*References!$I$4)+VLOOKUP(A19,'Project Summary Sheet'!$A$8:$M$59,8,FALSE))/'Project Summary Sheet'!$K$3,\"\")","v":""}]
[{"$f":"IF('Project Summary Sheet'!A28=\"\",\"\",'Project Summary Sheet'!A28)","v":""},{"$f":"IFERROR(VLOOKUP(A20,'Project Summary Sheet'!$A$8:$M$59,6,FALSE)/'Project Summary Sheet'!$B$3,\"\")","v":""},{"$f":"IFERROR(VLOOKUP(A20,'Project Summary Sheet'!$A$8:$M$59,8,FALSE)/('Project Summary Sheet'!$K$3-('Project Summary Sheet'!$B$3*References!$I$4)),\"\")","v":""},{"$f":"IFERROR(((VLOOKUP(A20,'Project Summary Sheet'!$A$8:$M$59,6,FALSE)*References!$I$4)+VLOOKUP(A20,'Project Summary Sheet'!$A$8:$M$59,8,FALSE))/'Project Summary Sheet'!$K$3,\"\")","v":""}]
[{"$f":"IF('Project Summary Sheet'!A29=\"\",\"\",'Project Summary Sheet'!A29)","v":""},{"$f":"IFERROR(VLOOKUP(A21,'Project Summary Sheet'!$A$8:$M$59,6,FALSE)/'Project Summary Sheet'!$B$3,\"\")","v":""},{"$f":"IFERROR(VLOOKUP(A21,'Project Summary Sheet'!$A$8:$M$59,8,FALSE)/('Project Summary Sheet'!$K$3-('Project Summary Sheet'!$B$3*References!$I$4)),\"\")","v":""},{"$f":"IFERROR(((VLOOKUP(A21,'Project Summary Sheet'!$A$8:$M$59,6,FALSE)*References!$I$4)+VLOOKUP(A21,'Project Summary Sheet'!$A$8:$M$59,8,FALSE))/'Project Summary Sheet'!$K$3,\"\")","v":""}]
[{"$f":"IF('Project Summary Sheet'!A30=\"\",\"\",'Project Summary Sheet'!A30)","v":""},{"$f":"IFERROR(VLOOKUP(A22,'Project Summary Sheet'!$A$8:$M$59,6,FALSE)/'Project Summary Sheet'!$B$3,\"\")","v":""},{"$f":"IFERROR(VLOOKUP(A22,'Project Summary Sheet'!$A$8:$M$59,8,FALSE)/('Project Summary Sheet'!$K$3-('Project Summary Sheet'!$B$3*References!$I$4)),\"\")","v":""},{"$f":"IFERROR(((VLOOKUP(A22,'Project Summary Sheet'!$A$8:$M$59,6,FALSE)*References!$I$4)+VLOOKUP(A22,'Project Summary Sheet'!$A$8:$M$59,8,FALSE))/'Project Summary Sheet'!$K$3,\"\")","v":""}]
[{"$f":"IF('Project Summary Sheet'!A31=\"\",\"\",'Project Summary Sheet'!A31)","v":""},{"$f":"IFERROR(VLOOKUP(A23,'Project Summary Sheet'!$A$8:$M$59,6,FALSE)/'Project Summary Sheet'!$B$3,\"\")","v":""},{"$f":"IFERROR(VLOOKUP(A23,'Project Summary Sheet'!$A$8:$M$59,8,FALSE)/('Project Summary Sheet'!$K$3-('Project Summary Sheet'!$B$3*References!$I$4)),\"\")","v":""},{"$f":"IFERROR(((VLOOKUP(A23,'Project Summary Sheet'!$A$8:$M$59,6,FALSE)*References!$I$4)+VLOOKUP(A23,'Project Summary Sheet'!$A$8:$M$59,8,FALSE))/'Project Summary Sheet'!$K$3,\"\")","v":""}]
[{"$f":"IF('Project Summary Sheet'!A32=\"\",\"\",'Project Summary Sheet'!A32)","v":""},{"$f":"IFERROR(VLOOKUP(A24,'Project Summary Sheet'!$A$8:$M$59,6,FALSE)/'Project Summary Sheet'!$B$3,\"\")","v":""},{"$f":"IFERROR(VLOOKUP(A24,'Project Summary Sheet'!$A$8:$M$59,8,FALSE)/('Project Summary Sheet'!$K$3-('Project Summary Sheet'!$B$3*References!$I$4)),\"\")","v":""},{"$f":"IFERROR(((VLOOKUP(A24,'Project Summary Sheet'!$A$8:$M$59,6,FALSE)*References!$I$4)+VLOOKUP(A24,'Project Summary Sheet'!$A$8:$M$59,8,FALSE))/'Project Summary Sheet'!$K$3,\"\")","v":""}]
[{"$f":"IF('Project Summary Sheet'!A33=\"\",\"\",'Project Summary Sheet'!A33)","v":""},{"$f":"IFERROR(VLOOKUP(A25,'Project Summary Sheet'!$A$8:$M$59,6,FALSE)/'Project Summary Sheet'!$B$3,\"\")","v":""},{"$f":"IFERROR(VLOOKUP(A25,'Project Summary Sheet'!$A$8:$M$59,8,FALSE)/('Project Summary Sheet'!$K$3-('Project Summary Sheet'!$B$3*References!$I$4)),\"\")","v":""},{"$f":"IFERROR(((VLOOKUP(A25,'Project Summary Sheet'!$A$8:$M$59,6,FALSE)*References!$I$4)+VLOOKUP(A25,'Project Summary Sheet'!$A$8:$M$59,8,FALSE))/'Project Summary Sheet'!$K$3,\"\")","v":""}]
[{"$f":"IF('Project Summary Sheet'!A34=\"\",\"\",'Project Summary Sheet'!A34)","v":""},{"$f":"IFERROR(VLOOKUP(A26,'Project Summary Sheet'!$A$8:$M$59,6,FALSE)/'Project Summary Sheet'!$B$3,\"\")","v":""},{"$f":"IFERROR(VLOOKUP(A26,'Project Summary Sheet'!$A$8:$M$59,8,FALSE)/('Project Summary Sheet'!$K$3-('Project Summary Sheet'!$B$3*References!$I$4)),\"\")","v":""},{"$f":"IFERROR(((VLOOKUP(A26,'Project Summary Sheet'!$A$8:$M$59,6,FALSE)*References!$I$4)+VLOOKUP(A26,'Project Summary Sheet'!$A$8:$M$59,8,FALSE))/'Project Summary Sheet'!$K$3,\"\")","v":""}]
[{"$f":"IF('Project Summary Sheet'!A35=\"\",\"\",'Project Summary Sheet'!A35)","v":""},{"$f":"IFERROR(VLOOKUP(A27,'Project Summary Sheet'!$A$8:$M$59,6,FALSE)/'Project Summary Sheet'!$B$3,\"\")","v":""},{"$f":"IFERROR(VLOOKUP(A27,'Project Summary Sheet'!$A$8:$M$59,8,FALSE)/('Project Summary Sheet'!$K$3-('Project Summary Sheet'!$B$3*References!$I$4)),\"\")","v":""},{"$f":"IFERROR(((VLOOKUP(A27,'Project Summary Sheet'!$A$8:$M$59,6,FALSE)*References!$I$4)+VLOOKUP(A27,'Project Summary Sheet'!$A$8:$M$59,8,FALSE))/'Project Summary Sheet'!$K$3,\"\")","v":""}]
[{"$f":"IF('Project Summary Sheet'!A36=\"\",\"\",'Project Summary Sheet'!A36)","v":""},{"$f":"IFERROR(VLOOKUP(A28,'Project Summary Sheet'!$A$8:$M$59,6,FALSE)/'Project Summary Sheet'!$B$3,\"\")","v":""},{"$f":"IFERROR(VLOOKUP(A28,'Project Summary Sheet'!$A$8:$M$59,8,FALSE)/('Project Summary Sheet'!$K$3-('Project Summary Sheet'!$B$3*References!$I$4)),\"\")","v":""},{"$f":"IFERROR(((VLOOKUP(A28,'Project Summary Sheet'!$A$8:$M$59,6,FALSE)*References!$I$4)+VLOOKUP(A28,'Project Summary Sheet'!$A$8:$M$59,8,FALSE))/'Project Summary Sheet'!$K$3,\"\")","v":""}]
[{"$f":"IF('Project Summary Sheet'!A37=\"\",\"\",'Project Summary Sheet'!A37)","v":""},{"$f":"IFERROR(VLOOKUP(A29,'Project Summary Sheet'!$A$8:$M$59,6,FALSE)/'Project Summary Sheet'!$B$3,\"\")","v":""},{"$f":"IFERROR(VLOOKUP(A29,'Project Summary Sheet'!$A$8:$M$59,8,FALSE)/('Project Summary Sheet'!$K$3-('Project Summary Sheet'!$B$3*References!$I$4)),\"\")","v":""},{"$f":"IFERROR(((VLOOKUP(A29,'Project Summary Sheet'!$A$8:$M$59,6,FALSE)*References!$I$4)+VLOOKUP(A29,'Project Summary Sheet'!$A$8:$M$59,8,FALSE))/'Project Summary Sheet'!$K$3,\"\")","v":""}]
[{"$f":"IF('Project Summary Sheet'!A38=\"\",\"\",'Project Summary Sheet'!A38)","v":""},{"$f":"IFERROR(VLOOKUP(A30,'Project Summary Sheet'!$A$8:$M$59,6,FALSE)/'Project Summary Sheet'!$B$3,\"\")","v":""},{"$f":"IFERROR(VLOOKUP(A30,'Project Summary Sheet'!$A$8:$M$59,8,FALSE)/('Project Summary Sheet'!$K$3-('Project Summary Sheet'!$B$3*References!$I$4)),\"\")","v":""},{"$f":"IFERROR(((VLOOKUP(A30,'Project Summary Sheet'!$A$8:$M$59,6,FALSE)*References!$I$4)+VLOOKUP(A30,'Project Summary Sheet'!$A$8:$M$59,8,FALSE))/'Project Summary Sheet'!$K$3,\"\")","v":""}]
{"$rows_left_out":23}