{"text_format":"1","workbook":"xlsx","n_sheets":21,"sheets":["Welcome","Instructions","General Project Info","Utility Info","Measure Descriptions","Existing Conditions","Measure Summary","Measure QC","QC Check","QC Feedback","Project Summary","External Calculations","UDAT Support","Calcs","TRC Test","CRIS Data Entry","Avoided Costs","ZipCode Map","DropDowns","Incentives","Version Tracking"],"not_rendered":{"charts":4,"images":2,"macros":1,"external_links":0,"defined_names":825,"comments":10,"pivot_tables":0},"unopened":[],"bounds":{"document_bytes":16777216,"sheet_cells":100000,"rows_first":2000,"rows_last":500,"rows_between":2000,"halvings":0,"cell_chars":16384,"cell_head_chars":4096},"cells_cut":0,"cells_raw":0,"read":"whole","date_system":"1900"}

{"sheet":"Welcome","index":0,"n_rows":0,"n_cols":0,"rows_kept":0,"cut":false,"hidden":false,"merged":[]}

{"sheet":"Instructions","index":1,"n_rows":0,"n_cols":0,"rows_kept":0,"cut":false,"hidden":false,"merged":[]}

{"sheet":"General Project Info","index":2,"n_rows":62,"n_cols":8,"rows_kept":62,"cut":false,"hidden":false,"merged":[[2,1,4,5],[33,1,33,2],[40,1,40,2],[48,1,48,2],[60,1,60,7],[15,1,15,2],[6,1,6,2],[52,1,52,2],[25,1,25,2],[30,3,30,4],[31,3,31,4],[57,1,57,2]]}
[null,"General Project Information"]
[null,"Instructions"]
[null,"1) User must complete all orange and blue cells. Orange cells indicate inputs critical for subsequent calculations.\n2) Do not add rows to this sheet. If you do, subsequent links and calculations will not work.\n3) Read the notes indicated by red corners to assist in properly completing this tab."]
[]
[]
[]
[null,"Multifamily Building Solutions Provider Information"]
[null,"Provider Name"]
[null,"Provider Street Address"]
[null,"Provider City and State"]
[null,"Provider Zip Code"]
[null,"Provider Contact Name"]
[null,"Provider Email"]
[null,"Provider Phone Number"]
[]
[null,"Project Information"]
[null,"Project Name"]
[null,"Project Primary Street Address"]
[null,"Project City"]
[null,"Project Zip Code"]
[null,"Project County"]
[null,"Population Type (seniors, families, etc.)"]
[null,"Is the project applying for a Construction Progress Payment?"]
[null,"If the project is 50 units or less, is it subject to Local Law 87?"]
[]
[null,"Project Site Information"]
[null,"Building Street Address(es)"]
[null,"Number of Buildings"]
[null,"Number of Stories"]
[null,"Year Built"]
[null,"Heating Fuel/Type",null,"<Provide additional detail here>"]
[null,"Electric Cooling?",null,"<Provide additional detail here>"]
[null,"Domestic Hot Water Fuel Type"]
[null,"Units"]
[null,"# of Studios"]
[null,"# of 1 Bedroom Units"]
[null,"# of 2 Bedroom Units"]
[null,"# of 3 Bedroom Units"]
[null,"# of 4+ Bedroom Units"]
[null,"Total Units",{"$f":"SUM(C35:C39)","v":0}]
[null,"Site Square Footage - For multiple building projects, enter total across entire project "]
[null,"Apartments (sq. ft.)"]
[null,"Common Area - Residentially Associated (sq. ft.)"]
[null,"Common Area - Non-Residentially Associated (sq. ft.)"]
[null,"Commercial (sq. ft.)"]
[null,"Conditioned Garage (sq. ft.)"]
[null,"Total Site Sq. Ft.",{"$f":"SUM(C42:C46)","v":0}]
[null,"Total Project Related Sq. Ft.",{"$f":"SUM(C42:C43)","v":0}]
[null,"Occupancy"]
[null,"Current # of Occupants"]
[null,"Estimated Vacancy Rate (%)"]
[]
[null,"Audit Information"]
[null,"Name of Auditor(s)"]
[null,"Name of Owner Representative at Audit"]
[null,"Date(s) of Audit Site Visit"]
[]
[null,"Modeling Information"]
[null,"Modeling Software Used"]
[]
[null,"Project Implementation Team Information"]
[null,"Project Role","Company Name","Contact Name","Contact Phone #","Contact E-Mail","Street Address","City, State"]

{"sheet":"Utility Info","index":3,"n_rows":55,"n_cols":13,"rows_kept":55,"cut":false,"hidden":false,"merged":[[54,1,54,2],[10,1,10,6],[11,1,11,6],[2,1,2,7],[4,1,4,7],[19,1,19,2],[46,1,46,6],[22,7,27,12]]}
[null,"Utility Information"]
[null,"Instructions"]
[null,"1) Complete the Pre-Construction Utility Information table based on your knowledge of the building\n2) Complete rows 14 - 19 in the PRE-CONSTRUCTION ENERGY USAGE & COST table using the Energy Use Snapshot Report provided by NYSERDA.\n3) Copy the range B22:F45 from the project's Energy Use Snapshot Report and PASTE VALUES into cells B22:F45 below.\n4) When the post-construction performance period ends, complete rows 49 - 54 in the POST-CONSTRUCTION ENERGY USAGE & COST table using the energy data provided by NYSERDA."]
[]
[null,"UTILITY INFORMATION"]
[null,null,"Electric","Gas","Fuel Oil","Steam","Propane","Select Other Fuel Type…"]
[null,"Utility Company","<Select One>","<Select One>"]
[null,"3rd Party Supplier"]
[null,"Metering Configuration"]
[]
[null,"ALL INFORMATION ENTERED IN THE TABLE BELOW SHOULD COME DIRECTLY FROM THE PROJECT'S ENERGY USE SNAPSHOT REPORT."]
[null,"PRE-CONSTRUCTION ENERGY USAGE & COST"]
[null,"Fuel Type","Site-Source Ratio","Pre-Construction Site MMBtu","Pre-Construction Source MMBtu","Energy Cost","Energy Cost Unit"]
[null,"Electricity",{"$f":"Calcs!$B89","v":2.5499999999999998},null,{"$f":"D14*C14","v":0},null,"per kWh"]
[null,"Natural Gas",{"$f":"Calcs!$B90","v":1.05},null,0,null,"per MMBtu"]
[null,"Fuel Oil",{"$f":"Calcs!$B91","v":1.01},null,0,null,"per MMBtu"]
[null,"Steam",{"$f":"Calcs!$B92","v":1.45},null,0,null,"per MMBtu"]
[null,"Propane",{"$f":"Calcs!$B93","v":1.01},null,0,null,"per MMBtu"]
[null,{"$f":"H6","v":"Select Other Fuel Type…"},1,null,0,null,"per MMBtu"]
[null,"Total",null,{"$f":"SUM(D14:D19)","v":0},0]
[]
[null,"Electricity",null,null,null,null,null,"OPTIONAL Model True-Up Check"]
[null,"Heating","Cooling","Baseload","Total","Units",null,"The below table is an optional model true-up check. To use, enter the usage determined by the modeling software (TREAT, eQUEST, etc.) in the appropriate sections. As per the Simulation Guidelines, the difference between the annual modeled use and the actual consumption for heating, cooling, and baseload must differ by no more than -10% to 0%. The model should not show more energy consumption than the bills. "]
[null,null,null,null,null,"kWh / year"]
[null,null,null,null,null,"MMBtu / year"]
[]
[null,"Natural Gas"]
[null,"Heating","Cooling","Baseload","Total","Units"]
[null,null,null,null,null,"Therms / year",null,null,"Heating","Cooling","Baseload","Total","Units"]
[null,null,null,null,null,"MMBtu / year",null,"Electric",null,null,null,null,"kWh/year"]
[null,null,null,null,null,null,null,"% Difference",{"$f":"(B24-I30)/B24","v":{"$error":"#DIV/0!"}},{"$f":"(C24-J30)/C24","v":{"$error":"#DIV/0!"}},{"$f":"(D24-K30)/D24","v":{"$error":"#DIV/0!"}},{"$f":"(E24-L30)/E24","v":{"$error":"#DIV/0!"}},"kWh/year"]
[null,"Oil",null,null,null,null,null,"Natural Gas",null,null,null,null,"Therms/year"]
[null,"Heating","Cooling","Baseload","Total","Units",null,"% Difference",{"$f":"(B29-I32)/B29","v":{"$error":"#DIV/0!"}},{"$f":"(C29-J32)/C29","v":{"$error":"#DIV/0!"}},{"$error":"#DIV/0!"},{"$error":"#DIV/0!"},"Therms/year"]
[null,null,null,null,null,"Gallons / year",null,"Oil",null,null,null,null,"Gallons/year"]
[null,null,null,null,null,"MMBtu / year",null,"% Difference",{"$f":"(B34-I34)/B34","v":{"$error":"#DIV/0!"}},{"$f":"(C34-J34)/C34","v":{"$error":"#DIV/0!"}},{"$error":"#DIV/0!"},{"$error":"#DIV/0!"},"Gallons/year"]
[null,null,null,null,null,null,null,"District Steam",null,null,null,null,"kLbs/year"]
[null,"District Steam",null,null,null,null,null,"% Difference",{"$f":"(B39-I36)/B39","v":{"$error":"#DIV/0!"}},{"$f":"(C39-J36)/C39","v":{"$error":"#DIV/0!"}},{"$error":"#DIV/0!"},{"$error":"#DIV/0!"},"kLbs/year"]
[null,"Heating","Cooling","Baseload","Total","Units",null,"Propane",null,null,null,null,"Gallons/year"]
[null,null,null,null,null,"kLbs / year",null,"% Difference",{"$f":"(B44-I38)/B44","v":{"$error":"#DIV/0!"}},{"$f":"(C44-J38)/C44","v":{"$error":"#DIV/0!"}},{"$error":"#DIV/0!"},{"$error":"#DIV/0!"},"Gallons/year"]
[null,null,null,null,null,"MMBtu / year"]
[]
[null,"Propane"]
[null,"Heating","Cooling","Baseload","Total","Units"]
[null,null,null,null,null,"Gallons / year"]
[null,null,null,null,null,"MMBtu / year"]
[]
[null,"POST-CONSTRUCTION ENERGY USAGE & COST"]
[null,"Fuel Type","Site-Source Ratio","Post-Construction Site MMBtu","Post-Construction Source MMBtu","Energy Cost","Energy Cost Unit"]
[null,"Electricity (Utility)",{"$f":"Calcs!$B89","v":2.5499999999999998},null,{"$f":"D49*C49","v":0},null,"per kWh"]
[null,"Natural Gas (Utility)",{"$f":"Calcs!$B90","v":1.05},null,0,null,"per MMBtu"]
[null,"Fuel Oil",{"$f":"Calcs!$B91","v":1.01},null,0,null,"per MMBtu"]
[null,"Steam",{"$f":"Calcs!$B92","v":1.45},null,0,null,"per MMBtu"]
[null,"Propane",{"$f":"Calcs!$B93","v":1.01},null,0,null,"per MMBtu"]
[null,{"$f":"H6","v":"Select Other Fuel Type…"},{"$f":"Calcs!$B94","v":1},null,0,null,"per MMBtu"]
[null,"Total",null,{"$f":"SUM(D49:D54)","v":0},0]

{"sheet":"Measure Descriptions","index":4,"n_rows":33,"n_cols":27,"rows_kept":33,"cut":false,"hidden":false,"merged":[[2,1,2,6],[6,1,6,8],[22,1,22,8]]}
[null,"Measure Descriptions"]
[null,"Instructions"]
[null,"1) Provide detailed descriptions of all measures proposed under the project's workscope.\n2) Note that this table contains two sections for measure entry: a section for those measures whose benefits accrue to the building (Measures 1-15) and a section for those whose benefits accrue to tenants (Measures 16-25).\n3) Read the notes indicated by red corners in the header row to properly complete this tab with the required information."]
[]
[null,"Measures Included in Workscope"]
["*\n*\n*","Measure #","Measure Name","Measure Category","Measure Classification","Existing Conditions","Measure Description","Important Assumptions","Measure Location",null,null,null,null,null,null,null,null,null,null,null,null,null,null,null,null,null,"Row Check"]
[null,"Measures to be undertaken by building - Savings accrue to building"]
["*\n*",1,null,null,null,null,null,null,null,null,null,null,null,null,null,null,null,null,null,null,null,null,null,null,null,null,{"$f":"IF(AND(COUNTA(C8:E8)<>0,COUNTA(C8:E8)<>3)=TRUE,\"ERR\",\"\")","v":""}]
["*\n*",2,null,null,null,null,null,null,null,null,null,null,null,null,null,null,null,null,null,null,null,null,null,null,null,null,{"$f":"IF(AND(COUNTA(C9:E9)<>0,COUNTA(C9:E9)<>3)=TRUE,\"ERR\",\"\")","v":""}]
["*\n*",3,null,null,null,null,null,null,null,null,null,null,null,null,null,null,null,null,null,null,null,null,null,null,null,null,""]
["*\n*",4,null,null,null,null,null,null,null,null,null,null,null,null,null,null,null,null,null,null,null,null,null,null,null,null,""]
["*\n*",5,null,null,null,null,null,null,null,null,null,null,null,null,null,null,null,null,null,null,null,null,null,null,null,null,""]
["*\n*",6,null,null,null,null,null,null,null,null,null,null,null,null,null,null,null,null,null,null,null,null,null,null,null,null,""]
["*\n*",7,null,null,null,null,null,null,null,null,null,null,null,null,null,null,null,null,null,null,null,null,null,null,null,null,""]
["*\n*",8,null,null,null,null,null,null,null,null,null,null,null,null,null,null,null,null,null,null,null,null,null,null,null,null,""]
["*\n*",9,null,null,null,null,null,null,null,null,null,null,null,null,null,null,null,null,null,null,null,null,null,null,null,null,""]
["*\n*",10,null,null,null,null,null,null,null,null,null,null,null,null,null,null,null,null,null,null,null,null,null,null,null,null,""]
["*\n*",11,null,null,null,null,null,null,null,null,null,null,null,null,null,null,null,null,null,null,null,null,null,null,null,null,""]
["*\n*",12,null,null,null,null,null,null,null,null,null,null,null,null,null,null,null,null,null,null,null,null,null,null,null,null,""]
["*\n*",13,null,null,null,null,null,null,null,null,null,null,null,null,null,null,null,null,null,null,null,null,null,null,null,null,""]
["*\n*",14,null,null,null,null,null,null,null,null,null,null,null,null,null,null,null,null,null,null,null,null,null,null,null,null,""]
["*\n*",15,null,null,null,null,null,null,null,null,null,null,null,null,null,null,null,null,null,null,null,null,null,null,null,null,""]
[null,"Measures to be undertaken by building - Savings accrue to tenants",null,null,null,null,null,null,null,null,null,null,null,null,null,null,null,null,null,null,null,null,null,null,null,null,""]
["*\n*",16,null,null,null,null,null,null,null,null,null,null,null,null,null,null,null,null,null,null,null,null,null,null,null,null,""]
["*\n*",17,null,null,null,null,null,null,null,null,null,null,null,null,null,null,null,null,null,null,null,null,null,null,null,null,""]
["*\n*",18,null,null,null,null,null,null,null,null,null,null,null,null,null,null,null,null,null,null,null,null,null,null,null,null,""]
["*\n*",19,null,null,null,null,null,null,null,null,null,null,null,null,null,null,null,null,null,null,null,null,null,null,null,null,""]
["*\n*",20,null,null,null,null,null,null,null,null,null,null,null,null,null,null,null,null,null,null,null,null,null,null,null,null,""]
["*\n*",21,null,null,null,null,null,null,null,null,null,null,null,null,null,null,null,null,null,null,null,null,null,null,null,null,""]
["*\n*",22,null,null,null,null,null,null,null,null,null,null,null,null,null,null,null,null,null,null,null,null,null,null,null,null,""]
["*\n*",23,null,null,null,null,null,null,null,null,null,null,null,null,null,null,null,null,null,null,null,null,null,null,null,null,""]
["*\n*",24,null,null,null,null,null,null,null,null,null,null,null,null,null,null,null,null,null,null,null,null,null,null,null,null,""]
["*\n*",25,null,null,null,null,null,null,null,null,null,null,null,null,null,null,null,null,null,null,null,null,null,null,null,null,""]

{"sheet":"Existing Conditions","index":5,"n_rows":234,"n_cols":43,"rows_kept":234,"cut":false,"hidden":false,"merged":[[149,36,149,37],[149,38,149,39],[149,40,149,41],[149,42,149,43],[174,2,174,24],[165,2,165,24],[160,2,160,24],[149,18,149,19],[149,20,149,21],[149,22,149,23],[149,24,149,25],[149,26,149,27],[149,28,149,29],[149,30,149,31],[149,32,149,33],[149,34,149,35],[147,36,147,37],[147,38,147,39],[147,40,147,41],[147,42,147,43],[148,6,148,7],[148,8,148,9],[148,10,148,11],[148,12,148,13],[148,14,148,15],[148,16,148,17],[148,18,148,19],[148,20,148,21],[148,22,148,23],[148,24,148,25],[148,26,148,27],[148,28,148,29],[148,30,148,31],[148,32,148,33],[148,34,148,35],[148,36,148,37],[148,38,148,39],[148,40,148,41],[148,42,148,43],[147,18,147,19],[147,20,147,21],[147,22,147,23],[147,24,147,25],[147,26,147,27],[147,28,147,29],[147,30,147,31],[147,32,147,33],[147,34,147,35],[147,4,147,5],[148,4,148,5],[149,4,149,5],[147,6,147,7],[147,8,147,9],[147,10,147,11],[147,12,147,13],[147,14,147,15],[147,16,147,17],[149,6,149,7],[149,8,149,9],[149,10,149,11],[149,12,149,13],[149,14,149,15],[149,16,149,17],[103,19,103,27],[53,7,53,16],[54,7,54,16],[55,7,55,16],[56,7,56,16],[57,7,57,16],[58,7,58,16],[59,7,59,16],[78,24,78,27],[79,24,79,27],[64,24,64,27],[65,24,65,27],[66,24,66,27],[67,24,67,27],[144,14,144,15],[144,16,144,17],[144,18,144,19],[144,20,144,21],[144,22,144,23],[51,7,51,16],[52,7,52,16],[125,27,125,34],[104,19,104,27],[105,19,105,27],[82,21,82,27],[83,21,83,27],[84,21,84,27],[85,21,85,27],[86,21,86,27],[87,21,87,27],[88,21,88,27],[89,21,89,27],[90,21,90,27],[91,21,91,27],[92,21,92,27],[95,19,95,27],[96,19,96,27],[97,19,97,27],[98,19,98,27],[99,19,99,27],[100,19,100,27],[101,19,101,27],[102,19,102,27],[214,3,214,4],[214,13,214,22],[215,3,215,4],[215,13,215,22],[218,3,218,4],[218,5,218,6],[218,10,218,11],[218,12,218,13],[218,14,218,22],[211,3,211,4],[211,13,211,22],[212,3,212,4],[212,13,212,22],[213,3,213,4],[213,13,213,22],[208,3,208,4],[208,10,208,11],[208,14,208,22],[209,3,209,4],[209,13,209,22],[210,3,210,4],[210,13,210,22],[226,3,226,15],[227,3,227,15],[228,3,228,15],[229,3,229,15],[230,3,230,15],[231,3,231,15],[232,3,232,15],[233,3,233,15],[219,3,219,4],[219,5,219,6],[219,10,219,11],[219,12,219,13],[219,14,219,22],[220,3,220,4],[220,5,220,6],[220,10,220,11],[220,12,220,13],[220,14,220,22],[223,3,223,15],[224,3,224,15],[225,3,225,15],[206,14,206,22],[207,3,207,4],[207,10,207,11],[207,14,207,22],[204,3,204,4],[204,10,204,11],[204,14,204,22],[205,3,205,4],[205,10,205,11],[205,14,205,22],[202,3,202,4],[202,10,202,11],[202,14,202,22],[203,3,203,4],[203,10,203,11],[203,14,203,22],[198,3,198,4],[198,5,198,6],[198,14,198,22],[199,3,199,4],[199,5,199,6],[199,14,199,22],[206,3,206,4],[206,10,206,11],[196,3,196,4],[196,5,196,6],[196,14,196,22],[197,3,197,4],[197,5,197,6],[197,14,197,22],[195,3,195,4],[195,5,195,6],[195,14,195,22],[192,3,192,4],[192,5,192,6],[192,14,192,22],[193,3,193,4],[193,5,193,6],[193,14,193,22],[189,2,194,2],[189,3,189,4],[189,5,189,6],[189,14,189,22],[190,3,190,4],[190,5,190,6],[190,14,190,22],[191,3,191,4],[191,5,191,6],[191,14,191,22],[194,3,194,4],[194,5,194,6],[194,14,194,22],[187,3,187,4],[187,5,187,6],[187,14,187,22],[188,3,188,4],[188,5,188,6],[188,14,188,22],[185,3,185,4],[185,5,185,6],[185,14,185,22],[186,3,186,4],[186,5,186,6],[186,14,186,22],[183,3,183,4],[183,5,183,6],[183,14,183,22],[184,3,184,4],[184,5,184,6],[184,14,184,22],[182,3,182,4],[182,5,182,6],[182,14,182,22],[171,3,171,4],[171,7,171,8],[171,20,171,24],[172,3,172,4],[172,7,172,8],[172,20,172,24],[169,3,169,4],[169,7,169,8],[169,20,169,24],[170,3,170,4],[170,7,170,8],[170,20,170,24],[166,3,166,4],[166,7,166,8],[166,20,166,24],[167,3,167,4],[167,7,167,8],[167,20,167,24],[168,3,168,4],[168,7,168,8],[168,20,168,24],[173,3,173,4],[173,7,173,8],[173,20,173,24],[175,3,175,14],[176,3,176,14],[177,3,177,14],[178,3,178,14],[179,3,179,14],[164,3,164,4],[164,7,164,8],[164,9,164,10],[164,20,164,24],[162,3,162,4],[162,7,162,8],[162,9,162,10],[162,20,162,24],[163,3,163,4],[163,7,163,8],[163,9,163,10],[163,20,163,24],[161,3,161,4],[161,7,161,8],[161,9,161,10],[161,20,161,24],[156,37,156,38],[159,3,159,4],[159,7,159,8],[159,9,159,10],[159,20,159,24],[156,25,156,26],[156,27,156,28],[156,29,156,30],[156,31,156,32],[156,33,156,34],[156,35,156,36],[156,13,156,14],[156,15,156,16],[156,17,156,18],[156,19,156,20],[158,3,158,12],[156,21,156,22],[156,23,156,24],[153,3,153,4],[153,5,153,6],[156,3,156,4],[156,5,156,6],[156,7,156,8],[156,9,156,10],[156,11,156,12],[155,21,155,22],[155,23,155,24],[155,25,155,26],[155,27,155,28],[156,39,156,40],[156,41,156,42],[155,3,155,4],[155,5,155,6],[155,7,155,8],[155,9,155,10],[154,3,154,4],[154,5,154,6],[154,7,154,8],[154,9,154,10],[154,11,154,12],[154,13,154,14],[154,15,154,16],[153,27,153,28],[153,15,153,16],[153,17,153,18],[153,19,153,20],[153,21,153,22],[154,17,154,18],[153,7,153,8],[153,9,153,10],[153,11,153,12],[153,13,153,14],[155,11,155,12],[155,13,155,14],[155,15,155,16],[155,17,155,18],[155,19,155,20],[153,41,153,42],[153,29,153,30],[153,31,153,32],[153,33,153,34],[153,35,153,36],[153,37,153,38],[154,29,154,30],[154,31,154,32],[154,33,154,34],[154,35,154,36],[154,37,154,38],[154,39,154,40],[155,33,155,34],[155,35,155,36],[155,37,155,38],[155,39,155,40],[155,41,155,42],[155,29,155,30],[155,31,155,32],[152,31,152,32],[152,33,152,34],[152,35,152,36],[152,37,152,38],[152,39,152,40],[153,39,153,40],[152,41,152,42],[152,19,152,20],[152,21,152,22],[152,23,152,24],[152,25,152,26],[152,27,152,28],[152,29,152,30],[153,23,153,24],[153,25,153,26],[154,19,154,20],[154,21,154,22],[154,23,154,24],[154,25,154,26],[154,27,154,28],[154,41,154,42],[146,32,146,33],[146,34,146,35],[146,36,146,37],[150,3,150,12],[151,39,151,40],[151,41,151,42],[151,29,151,30],[151,31,151,32],[151,33,151,34],[151,35,151,36],[151,37,151,38],[152,3,152,4],[152,5,152,6],[152,7,152,8],[152,9,152,10],[152,11,152,12],[152,13,152,14],[152,15,152,16],[152,17,152,18],[151,27,151,28],[151,15,151,16],[151,17,151,18],[151,19,151,20],[151,21,151,22],[151,23,151,24],[151,25,151,26],[151,3,151,4],[151,5,151,6],[151,7,151,8],[151,9,151,10],[151,11,151,12],[151,13,151,14],[145,42,145,43],[146,4,146,5],[146,6,146,7],[146,8,146,9],[146,10,146,11],[146,12,146,13],[146,14,146,15],[146,16,146,17],[146,18,146,19],[146,20,146,21],[145,30,145,31],[145,32,145,33],[145,34,145,35],[145,36,145,37],[145,38,145,39],[145,40,145,41],[145,18,145,19],[145,4,145,5],[145,6,145,7],[145,8,145,9],[145,10,145,11],[145,12,145,13],[145,14,145,15],[145,16,145,17],[146,38,146,39],[146,40,146,41],[146,42,146,43],[146,22,146,23],[146,24,146,25],[146,26,146,27],[146,28,146,29],[146,30,146,31],[144,24,144,25],[143,34,143,35],[145,20,145,21],[145,22,145,23],[145,24,145,25],[145,26,145,27],[145,28,145,29],[143,36,143,37],[143,38,143,39],[143,40,143,41],[143,42,143,43],[144,4,144,5],[144,6,144,7],[144,8,144,9],[144,10,144,11],[144,12,144,13],[143,22,143,23],[143,24,143,25],[143,26,143,27],[143,28,143,29],[143,30,143,31],[143,32,143,33],[144,38,144,39],[144,40,144,41],[144,42,144,43],[144,30,144,31],[144,32,144,33],[144,34,144,35],[144,36,144,37],[144,26,144,27],[144,28,144,29],[143,4,143,5],[143,6,143,7],[143,8,143,9],[143,10,143,11],[143,12,143,13],[143,14,143,15],[143,16,143,17],[143,18,143,19],[143,20,143,21],[140,3,140,4],[140,6,140,8],[140,9,140,10],[141,3,141,4],[141,6,141,8],[141,9,141,10],[138,3,138,4],[138,6,138,8],[138,9,138,10],[139,3,139,4],[139,6,139,8],[139,9,139,10],[138,13,138,19],[139,13,139,19],[140,13,140,19],[141,13,141,19],[142,2,142,43],[134,13,134,19],[135,13,135,19],[136,13,136,19],[137,13,137,19],[132,3,132,4],[132,6,132,8],[132,9,132,10],[133,3,133,4],[133,6,133,8],[133,9,133,10],[133,13,133,19],[136,3,136,4],[136,6,136,8],[136,9,136,10],[137,3,137,4],[137,6,137,8],[137,9,137,10],[134,3,134,4],[134,6,134,8],[134,9,134,10],[135,3,135,4],[135,6,135,8],[135,9,135,10],[130,3,130,4],[130,6,130,8],[130,9,130,10],[131,3,131,4],[131,6,131,8],[131,9,131,10],[130,13,130,19],[131,13,131,19],[132,13,132,19],[128,42,128,44],[129,3,129,5],[129,18,129,19],[129,20,129,21],[129,23,129,24],[129,40,129,41],[129,42,129,44],[126,32,127,32],[126,33,126,38],[126,39,127,39],[126,40,127,41],[126,42,127,44],[128,3,128,5],[128,18,128,19],[128,20,128,21],[128,23,128,24],[128,40,128,41],[126,26,127,26],[126,27,127,27],[126,28,127,28],[126,29,127,29],[126,30,127,30],[126,31,127,31],[126,12,126,17],[126,18,127,19],[126,20,127,21],[126,22,127,22],[126,23,127,24],[126,25,127,25],[126,2,127,2],[126,3,127,5],[126,6,127,6],[126,7,127,7],[126,8,127,8],[126,9,127,9],[126,10,127,10],[126,11,127,11],[125,3,125,5],[125,7,125,8],[125,9,125,10],[125,11,125,12],[125,20,125,22],[125,23,125,24],[124,3,124,5],[124,7,124,8],[124,9,124,10],[124,11,124,12],[124,20,124,22],[124,23,124,24],[123,3,123,5],[123,7,123,8],[123,9,123,10],[123,11,123,12],[123,20,123,22],[123,23,123,24],[123,27,123,34],[124,27,124,34],[121,38,121,44],[122,3,122,5],[122,7,122,8],[122,9,122,10],[122,11,122,12],[122,20,122,22],[122,23,122,24],[122,27,122,34],[120,3,120,5],[120,12,120,13],[120,36,120,37],[120,38,120,44],[121,3,121,5],[121,7,121,8],[121,9,121,10],[121,12,121,13],[121,30,121,35],[121,36,121,37],[120,7,120,8],[120,9,120,10],[119,3,119,5],[119,7,119,8],[119,9,119,10],[119,12,119,13],[119,36,119,37],[119,38,119,44],[117,38,117,44],[118,3,118,5],[118,7,118,8],[118,9,118,10],[118,12,118,13],[118,36,118,37],[118,38,118,44],[116,3,116,5],[116,12,116,13],[116,36,116,37],[116,38,116,44],[117,3,117,5],[117,7,117,8],[117,9,117,10],[117,12,117,13],[117,30,117,35],[117,36,117,37],[116,7,116,8],[116,9,116,10],[115,3,115,5],[115,7,115,8],[115,9,115,10],[115,12,115,13],[115,36,115,37],[115,38,115,44],[113,38,113,44],[114,3,114,5],[114,7,114,8],[114,9,114,10],[114,12,114,13],[114,36,114,37],[114,38,114,44],[112,3,112,5],[112,12,112,13],[112,36,112,37],[112,38,112,44],[113,3,113,5],[113,7,113,8],[113,9,113,10],[113,12,113,13],[113,30,113,35],[113,36,113,37],[112,7,112,8],[112,9,112,10],[111,3,111,5],[111,7,111,8],[111,9,111,10],[111,12,111,13],[111,36,111,37],[111,38,111,44],[108,29,109,29],[108,30,108,35],[108,36,109,37],[108,38,109,44],[110,3,110,5],[110,7,110,8],[110,9,110,10],[110,12,110,13],[110,36,110,37],[110,38,110,44],[108,17,109,17],[108,19,109,19],[108,20,109,20],[108,21,109,21],[108,22,108,27],[108,28,109,28],[108,11,109,11],[108,12,109,13],[108,14,109,14],[108,15,109,15],[108,16,109,16],[108,18,109,18],[108,2,109,2],[108,3,109,5],[108,6,109,6],[108,7,109,8],[108,9,109,10],[104,3,104,4],[104,5,104,6],[104,8,104,9],[104,11,104,12],[105,3,105,4],[105,5,105,6],[105,8,105,9],[105,11,105,12],[102,3,102,4],[102,5,102,6],[102,8,102,9],[102,11,102,12],[103,3,103,4],[103,5,103,6],[103,8,103,9],[103,11,103,12],[100,3,100,4],[100,5,100,6],[100,8,100,9],[100,11,100,12],[101,3,101,4],[101,5,101,6],[101,8,101,9],[101,11,101,12],[98,3,98,4],[98,5,98,6],[98,8,98,9],[98,11,98,12],[99,3,99,4],[99,5,99,6],[99,8,99,9],[99,11,99,12],[96,3,96,4],[96,5,96,6],[96,8,96,9],[96,11,96,12],[97,3,97,4],[97,5,97,6],[97,8,97,9],[97,11,97,12],[92,3,92,4],[92,5,92,6],[92,8,92,9],[92,11,92,12],[95,3,95,4],[95,5,95,6],[95,8,95,9],[95,11,95,12],[90,3,90,4],[90,5,90,6],[90,8,90,9],[90,11,90,12],[91,3,91,4],[91,5,91,6],[91,8,91,9],[91,11,91,12],[88,3,88,4],[88,5,88,6],[88,8,88,9],[88,11,88,12],[89,3,89,4],[89,5,89,6],[89,8,89,9],[89,11,89,12],[86,3,86,4],[86,5,86,6],[86,8,86,9],[86,11,86,12],[87,3,87,4],[87,5,87,6],[87,8,87,9],[87,11,87,12],[84,3,84,4],[84,5,84,6],[84,8,84,9],[84,11,84,12],[85,3,85,4],[85,5,85,6],[85,8,85,9],[85,11,85,12],[82,3,82,4],[82,5,82,6],[82,8,82,9],[82,11,82,12],[83,3,83,4],[83,5,83,6],[83,8,83,9],[83,11,83,12],[78,3,78,4],[78,5,78,6],[78,8,78,9],[78,11,78,12],[79,3,79,4],[79,5,79,6],[79,8,79,9],[79,11,79,12],[76,3,76,4],[76,5,76,6],[76,8,76,9],[76,11,76,12],[77,3,77,4],[77,5,77,6],[77,8,77,9],[77,11,77,12],[76,24,76,27],[77,24,77,27],[74,3,74,4],[74,5,74,6],[74,8,74,9],[74,11,74,12],[75,3,75,4],[75,5,75,6],[75,8,75,9],[75,11,75,12],[74,24,74,27],[75,24,75,27],[72,3,72,4],[72,5,72,6],[72,8,72,9],[72,11,72,12],[73,3,73,4],[73,5,73,6],[73,8,73,9],[73,11,73,12],[72,24,72,27],[73,24,73,27],[70,3,70,4],[70,5,70,6],[70,8,70,9],[70,11,70,12],[71,3,71,4],[71,5,71,6],[71,8,71,9],[71,11,71,12],[70,24,70,27],[71,24,71,27],[68,3,68,4],[68,5,68,6],[68,8,68,9],[68,11,68,12],[69,3,69,4],[69,5,69,6],[69,8,69,9],[69,11,69,12],[68,24,68,27],[69,24,69,27],[67,3,67,4],[67,5,67,6],[67,8,67,9],[67,11,67,12],[65,3,65,4],[65,5,65,6],[65,8,65,9],[65,11,65,12],[57,3,57,4],[57,5,57,6],[58,3,58,4],[58,5,58,6],[59,3,59,4],[59,5,59,6],[64,3,64,4],[64,5,64,6],[64,8,64,9],[64,11,64,12],[66,3,66,4],[66,5,66,6],[66,8,66,9],[66,11,66,12],[61,3,61,4],[60,3,60,4],[55,3,55,4],[55,5,55,6],[56,3,56,4],[56,5,56,6],[53,3,53,4],[53,5,53,6],[54,3,54,4],[54,5,54,6],[51,2,52,2],[51,3,51,4],[51,5,51,6],[52,3,52,4],[52,5,52,6],[47,2,50,2],[47,3,47,4],[47,5,47,6],[48,3,48,4],[48,5,48,6],[50,3,50,4],[50,5,50,6],[50,7,50,16],[42,3,42,4],[42,5,42,6],[43,3,43,4],[43,5,43,6],[39,2,46,2],[39,3,39,4],[39,5,39,6],[40,3,40,4],[40,5,40,6],[41,3,41,4],[41,5,41,6],[44,3,44,4],[44,5,44,6],[45,3,45,4],[45,5,45,6],[39,7,39,16],[40,7,40,16],[49,3,49,4],[49,5,49,6],[46,3,46,4],[46,5,46,6],[41,7,41,16],[42,7,42,16],[35,7,35,16],[36,7,36,16],[37,7,37,16],[38,7,38,16],[43,7,43,16],[44,7,44,16],[45,7,45,16],[46,7,46,16],[47,7,47,16],[48,7,48,16],[49,7,49,16],[37,2,38,2],[37,3,37,4],[37,5,37,6],[38,3,38,4],[38,5,38,6],[35,2,36,2],[35,3,35,4],[35,5,35,6],[36,3,36,4],[36,5,36,6],[31,2,32,2],[31,3,31,4],[31,5,31,6],[32,3,32,4],[32,5,32,6],[31,7,31,16],[32,7,32,16],[33,7,33,16],[34,7,34,16],[33,2,34,2],[33,3,33,4],[33,5,33,6],[34,3,34,4],[34,5,34,6],[29,3,29,4],[29,5,29,6],[29,8,29,9],[29,10,29,11],[29,13,29,22],[30,3,30,4],[30,5,30,6],[27,3,27,4],[27,5,27,6],[27,8,27,9],[27,10,27,11],[27,13,27,22],[28,3,28,4],[28,5,28,6],[28,8,28,9],[28,10,28,11],[28,13,28,22],[30,7,30,16],[25,3,25,4],[25,5,25,6],[25,8,25,9],[25,10,25,11],[25,13,25,22],[26,3,26,4],[26,5,26,6],[26,8,26,9],[26,10,26,11],[26,13,26,22],[23,19,23,22],[24,3,24,4],[24,5,24,6],[24,8,24,9],[24,10,24,11],[24,13,24,22],[23,3,23,4],[23,5,23,6],[23,7,23,8],[23,11,23,12],[23,13,23,14],[23,16,23,17],[21,19,21,22],[22,3,22,4],[22,5,22,6],[22,7,22,8],[22,11,22,12],[22,13,22,14],[22,16,22,17],[22,19,22,22],[21,3,21,4],[21,5,21,6],[21,7,21,8],[21,11,21,12],[21,13,21,14],[21,16,21,17],[19,19,19,22],[20,3,20,4],[20,5,20,6],[20,7,20,8],[20,11,20,12],[20,13,20,14],[20,16,20,17],[20,19,20,22],[19,3,19,4],[19,5,19,6],[19,7,19,8],[19,11,19,12],[19,13,19,14],[19,16,19,17],[17,3,17,8],[18,3,18,4],[18,5,18,6],[18,7,18,8],[18,11,18,12],[18,13,18,14]],"merged_total":1027,"flags":["merged_cut"]}
[1,null,"Existing Conditions"]
[1,null,"Instructions"]
[1,null,"1) Enter building system details in the tables below to the fullest extent possible.  \n2) The data entered on this tab should represent ALL buildings in the project.\n3) Read the notes indicated by red corners to assist in properly completing this tab.\n4) Use the Additional Notes column to provide additional detail, including special operating conditions or other information to support baseline assumptions.\n5) Use the buttons provided to the right to jump to the various sections of this tab."]
[1]
[1,null,"Envelope"]
[1,"*\n*\n*\n*","General Building/Envelope Description"]
[1,"*\n*","Envelope Components","Construction Description",null,null,null,null,null,"Total R-Value","Verification method","Additional Notes"]
[1,"*\n*","Above Grade Exterior Walls"]
[1,"*\n*","Floor Perimeter/ Rim Joists"]
[1,"*\n*","Below Grade Walls"]
[1,"*\n*","Floor Above Unconditioned Space"]
[1,"*\n*","Slab On/Below Grade"]
[1,"*\n*","Roof"]
[1,"*\n*","Ceilings to Unconditioned Attics"]
[1,"*\n*","Wall to Unconditioned Space"]
[1,"*\n*"]
[1,"*\n*"]
[1,"*\n*"]
[1,"*\n*","Windows","Location",null,"Operation Type",null,"Framing Material",null,"Thermal Break","# of Panes","Glass Coating",null,"Gas Filled",null,"U-value","Weather-stripping",null,"Qty. ","Additional Notes"]
[1,null,"Window Type 1"]
[1,null,"Window Type 2"]
[1,null,"Window Type 3"]
[1,null,"Window Type 4"]
[1,null,"Window Type 5"]
[1,null,"Exterior Doors","Location",null,"Material",null,"% Glazing","Glazing Type",null,"Weather-stripping",null,"Qty.","Additional Notes"]
[1,null,"Door Type 1"]
[1,null,"Door Type 2"]
[1,null,"Door Type 3"]
[1,null,"Door Type 4"]
[1,null,"Door Type 5"]
[1,null,"Air Infiltration","Location of Leakage",null,"Tightness",null,"Additional Notes"]
[1,null,"Common Area Windows","Frame"]
[1,null,null,"Moving Surfaces"]
[1,null,"In-unit Windows","Frame"]
[1,null,null,"Moving Surfaces"]
[1,null,"Exterior Doors","Frame"]
[1,null,null,"Moving Surfaces"]
[1,null,"Laundry Room","Dryer Vent"]
[1,null,null,"Exhaust Fans"]
[1,null,"Attic","Hatch Frame"]
[1,null,null,"Hatch Door"]
[1,null,null,"Pipe Penetrations"]
[1,null,null,"Electrical Boxes"]
[1,null,null,"Recessed Lights"]
[1,null,null,"Wall Caps"]
[1,null,null,"Exhaust Fans"]
[1,null,null,"Open Chases"]
[1,null,"Apartments","Pipe Penetrations"]
[1,null,null,"Exhaust Fans"]
[1,null,null,"Electrical Boxes"]
[1,null,null,"Patio Doors"]
[1,null,"AC Sleeves","Sleeve-to-wall Junction"]
[1,null,null,"Unit Fit in Sleeve"]
[1,null,"Basement Penetrations"]
[1,null,"Roof Penetrations"]
[1,null,"Elevator Penthouses"]
[1,null,"Stairwells"]
[1]
[1]
[1]
[1,null,"Blower Door Test (CFM50)"]
[1,null,"Assumed or Modeled ACHn"]
[{"$f":"IF((COUNTIF('Measure Descriptions'!$D$8:$D$33,DropDowns!$S$49)+COUNTIF('Measure Descriptions'!$D$8:$D$33,DropDowns!$S$51))>0,1,\"\")","v":""}]
[{"$f":"IF((COUNTIF('Measure Descriptions'!$D$8:$D$33,DropDowns!$S$49)+COUNTIF('Measure Descriptions'!$D$8:$D$33,DropDowns!$S$51))>0,1,\"\")","v":""},null,"Fans"]
[{"$f":"IF((COUNTIF('Measure Descriptions'!$D$8:$D$33,DropDowns!$S$49)+COUNTIF('Measure Descriptions'!$D$8:$D$33,DropDowns!$S$51))>0,1,\"\")","v":""},null,"System/Equipment Type","Motor Type",null,"Spaces/Systems Served",null,"Qty","Location",null,"Annual Hours","Controls",null,"Setpoints","Motor HP","Phase","CFM at Fan","CFM Data Source","CFM at Registers","CFM Data Source","CAR Dampers?","Motor Efficiency","NEMA Premium?","Annual kWh","Additional Notes"]
[{"$f":"IF((COUNTIF('Measure Descriptions'!$D$8:$D$33,DropDowns!$S$49)+COUNTIF('Measure Descriptions'!$D$8:$D$33,DropDowns!$S$51))>0,1,\"\")","v":""}]
[{"$f":"IF((COUNTIF('Measure Descriptions'!$D$8:$D$33,DropDowns!$S$49)+COUNTIF('Measure Descriptions'!$D$8:$D$33,DropDowns!$S$51))>0,1,\"\")","v":""}]
[{"$f":"IF((COUNTIF('Measure Descriptions'!$D$8:$D$33,DropDowns!$S$49)+COUNTIF('Measure Descriptions'!$D$8:$D$33,DropDowns!$S$51))>0,1,\"\")","v":""}]
[{"$f":"IF((COUNTIF('Measure Descriptions'!$D$8:$D$33,DropDowns!$S$49)+COUNTIF('Measure Descriptions'!$D$8:$D$33,DropDowns!$S$51))>0,1,\"\")","v":""}]
[{"$f":"IF((COUNTIF('Measure Descriptions'!$D$8:$D$33,DropDowns!$S$49)+COUNTIF('Measure Descriptions'!$D$8:$D$33,DropDowns!$S$51))>0,1,\"\")","v":""}]
[{"$f":"IF((COUNTIF('Measure Descriptions'!$D$8:$D$33,DropDowns!$S$49)+COUNTIF('Measure Descriptions'!$D$8:$D$33,DropDowns!$S$51))>0,1,\"\")","v":""}]
[{"$f":"IF((COUNTIF('Measure Descriptions'!$D$8:$D$33,DropDowns!$S$49)+COUNTIF('Measure Descriptions'!$D$8:$D$33,DropDowns!$S$51))>0,1,\"\")","v":""}]
[{"$f":"IF((COUNTIF('Measure Descriptions'!$D$8:$D$33,DropDowns!$S$49)+COUNTIF('Measure Descriptions'!$D$8:$D$33,DropDowns!$S$51))>0,1,\"\")","v":""}]
[{"$f":"IF((COUNTIF('Measure Descriptions'!$D$8:$D$33,DropDowns!$S$49)+COUNTIF('Measure Descriptions'!$D$8:$D$33,DropDowns!$S$51))>0,1,\"\")","v":""}]
[{"$f":"IF((COUNTIF('Measure Descriptions'!$D$8:$D$33,DropDowns!$S$49)+COUNTIF('Measure Descriptions'!$D$8:$D$33,DropDowns!$S$51))>0,1,\"\")","v":""}]
[{"$f":"IF((COUNTIF('Measure Descriptions'!$D$8:$D$33,DropDowns!$S$49)+COUNTIF('Measure Descriptions'!$D$8:$D$33,DropDowns!$S$51))>0,1,\"\")","v":""}]
[{"$f":"IF((COUNTIF('Measure Descriptions'!$D$8:$D$33,DropDowns!$S$49)+COUNTIF('Measure Descriptions'!$D$8:$D$33,DropDowns!$S$51))>0,1,\"\")","v":""}]
[{"$f":"IF((COUNTIF('Measure Descriptions'!$D$8:$D$33,DropDowns!$S$49)+COUNTIF('Measure Descriptions'!$D$8:$D$33,DropDowns!$S$51))>0,1,\"\")","v":""}]
[{"$f":"IF((COUNTIF('Measure Descriptions'!$D$8:$D$33,DropDowns!$S$49)+COUNTIF('Measure Descriptions'!$D$8:$D$33,DropDowns!$S$51))>0,1,\"\")","v":""}]
[{"$f":"IF((COUNTIF('Measure Descriptions'!$D$8:$D$33,DropDowns!$S$49)+COUNTIF('Measure Descriptions'!$D$8:$D$33,DropDowns!$S$51))>0,1,\"\")","v":""}]
[{"$f":"IF(COUNTIF('Measure Descriptions'!$D$8:$D$33,DropDowns!$S$49)>0,1,\"\")","v":""}]
[{"$f":"IF(COUNTIF('Measure Descriptions'!$D$8:$D$33,DropDowns!$S$49)>0,1,\"\")","v":""},null,"Pumps"]
[{"$f":"IF(COUNTIF('Measure Descriptions'!$D$8:$D$33,DropDowns!$S$49)>0,1,\"\")","v":""},null,"System/Equipment Type","Motor Type",null,"Spaces/Systems Served",null,"Qty","Location",null,"Annual Hours","Controls",null,"Setpoints","Motor HP","Phase","GPM at Pump","GPM Data Source","Motor Efficiency","NEMA Premium?","Annual kWh","Additional Notes"]
[{"$f":"IF(COUNTIF('Measure Descriptions'!$D$8:$D$33,DropDowns!$S$49)>0,1,\"\")","v":""}]
[{"$f":"IF(COUNTIF('Measure Descriptions'!$D$8:$D$33,DropDowns!$S$49)>0,1,\"\")","v":""}]
[{"$f":"IF(COUNTIF('Measure Descriptions'!$D$8:$D$33,DropDowns!$S$49)>0,1,\"\")","v":""}]
[{"$f":"IF(COUNTIF('Measure Descriptions'!$D$8:$D$33,DropDowns!$S$49)>0,1,\"\")","v":""}]
[{"$f":"IF(COUNTIF('Measure Descriptions'!$D$8:$D$33,DropDowns!$S$49)>0,1,\"\")","v":""}]
[{"$f":"IF(COUNTIF('Measure Descriptions'!$D$8:$D$33,DropDowns!$S$49)>0,1,\"\")","v":""}]
[{"$f":"IF(COUNTIF('Measure Descriptions'!$D$8:$D$33,DropDowns!$S$49)>0,1,\"\")","v":""}]
[{"$f":"IF(COUNTIF('Measure Descriptions'!$D$8:$D$33,DropDowns!$S$49)>0,1,\"\")","v":""}]
[{"$f":"IF(COUNTIF('Measure Descriptions'!$D$8:$D$33,DropDowns!$S$49)>0,1,\"\")","v":""}]
[{"$f":"IF(COUNTIF('Measure Descriptions'!$D$8:$D$33,DropDowns!$S$49)>0,1,\"\")","v":""}]
[{"$f":"IF(COUNTIF('Measure Descriptions'!$D$8:$D$33,DropDowns!$S$49)>0,1,\"\")","v":""}]
[{"$f":"IF(COUNTIF('Measure Descriptions'!$D$8:$D$33,DropDowns!$S$49)>0,1,\"\")","v":""},null,"Other Motors"]
[{"$f":"IF(COUNTIF('Measure Descriptions'!$D$8:$D$33,DropDowns!$S$49)>0,1,\"\")","v":""},null,"System/Equipment Type","Motor Type",null,"Spaces/Systems Served",null,"Qty","Location",null,"Annual Hours","Controls",null,"Setpoints","Motor HP","Phase","Motor Efficiency","NEMA Premium?","Annual kWh","Additional Notes"]
[{"$f":"IF(COUNTIF('Measure Descriptions'!$D$8:$D$33,DropDowns!$S$49)>0,1,\"\")","v":""}]
[{"$f":"IF(COUNTIF('Measure Descriptions'!$D$8:$D$33,DropDowns!$S$49)>0,1,\"\")","v":""}]
[{"$f":"IF(COUNTIF('Measure Descriptions'!$D$8:$D$33,DropDowns!$S$49)>0,1,\"\")","v":""}]
[{"$f":"IF(COUNTIF('Measure Descriptions'!$D$8:$D$33,DropDowns!$S$49)>0,1,\"\")","v":""}]
[{"$f":"IF(COUNTIF('Measure Descriptions'!$D$8:$D$33,DropDowns!$S$49)>0,1,\"\")","v":""}]
[{"$f":"IF(COUNTIF('Measure Descriptions'!$D$8:$D$33,DropDowns!$S$49)>0,1,\"\")","v":""}]
[{"$f":"IF(COUNTIF('Measure Descriptions'!$D$8:$D$33,DropDowns!$S$49)>0,1,\"\")","v":""}]
[{"$f":"IF(COUNTIF('Measure Descriptions'!$D$8:$D$33,DropDowns!$S$49)>0,1,\"\")","v":""}]
[{"$f":"IF(COUNTIF('Measure Descriptions'!$D$8:$D$33,DropDowns!$S$49)>0,1,\"\")","v":""}]
[{"$f":"IF(COUNTIF('Measure Descriptions'!$D$8:$D$33,DropDowns!$S$49)>0,1,\"\")","v":""}]
[1]
[1,null,"Mechanical Systems"]
[1,null,"Heating Components","Equipment Type",null,null,"Qty.","Location of Equipment",null,"Spaces Served",null,"EStar?","Manufacturer",null,"Model No.","Year Installed","Fuel Source","Rated Efficiency Units","Rated Efficiency","Venting Type","Total System Input (Mbh)","Total System Output (Mbh)","Combustion Testing",null,null,null,null,null,"Supply  Temp.","Return  Temp.","Controls",null,null,null,null,null,"Thermostat Setpoints",null,"Additional Notes"]
[1,null,null,null,null,null,null,null,null,null,null,null,null,null,null,null,null,null,null,null,null,null,"Draft","Stack Temp.","% O2","% CO2","CO/\nCO air free","Combustion Efficiency",null,null,"Heat Timer","Energy Mgt. System (EMS)","Outdoor Air Reset","Night Setback","Sequencing Controls","Aquastat/ Pressuretrol"]
[1,null,"Primary Heating System"]
[1,"*\n*","Heating System"]
[1,"*\n*","Burner"]
[1,"*\n*","End Use Equipment"]
[1,null,"Secondary Heating System"]
[1,"*\n*","Heating System"]
[1,"*\n*","Burner"]
[1,"*\n*","End Use Equipment"]
[1,null,"Tertiary Heating System"]
[1,"*\n*","Heating System"]
[1,"*\n*","Burner"]
[1,"*\n*","End Use Equipment"]
[1,null,"Cooling Components","Equipment Type",null,null,"Qty.","Location of Equipment",null,"Spaces Served",null,"Manufacturer",null,"Model No.","EStar?","Year Installed","Fuel Source","Btu/h","Rated Efficiency","Rated Efficiency Units","Controls",null,null,"Thermostat Setpoints",null,"Ownership","% of Apartments w/ Cooling","Additional Notes"]
[1,"*\n*","Primary Cooling System"]
[1,"*\n*","Secondary Cooling System"]
[1,"*\n*","Tertiary Cooling System"]
[{"$f":"IF(COUNTIF('Measure Descriptions'!$D$8:$D$33,DropDowns!$S$45)>0,1,\"\")","v":""},null,"DHW System","Equipment Description",null,null,"Qty.","DHW from Space Heating Boiler?","External Heat Exchanger?","Tankless Coil?","Mixing Valve?","Recirc. Pump?","Storage Tank",null,null,null,null,null,"Location of Equipment",null,"Spaces Served",null,"EStar?","Manufacturer",null,"Model No.","Year Installed","Fuel Source","Rated Efficiency","Rated Efficiency (units)","Venting Type","Input (Mbh)","Output (Mbh)","Combustion Testing",null,null,null,null,null,"Controls","Thermostat Setpoints",null,"Additional Notes"]
[{"$f":"IF(COUNTIF('Measure Descriptions'!$D$8:$D$33,DropDowns!$S$45)>0,1,\"\")","v":""},null,null,null,null,null,null,null,null,null,null,null,"Storage Tank?","Heating Element?"," Capacity","Water Temp.","Insulated?","Insulation Thickness",null,null,null,null,null,null,null,null,null,null,null,null,null,null,null,"Draft","Stack Temp.","% O2","% CO2","CO/\nCO air free","Combustion Efficiency"]
[{"$f":"IF(COUNTIF('Measure Descriptions'!$D$8:$D$33,DropDowns!$S$45)>0,1,\"\")","v":""},"*\n*","DHW System 1"]
[{"$f":"IF(COUNTIF('Measure Descriptions'!$D$8:$D$33,DropDowns!$S$45)>0,1,\"\")","v":""},"*\n*","DHW System 2"]
[1,"*\n*","Distribution Systems","Central Distribution Type",null,"Qty. of Zones","Description of Zones",null,null,"Insulation Material",null,"Insulation Thickness","Linear ft. un-insulated","Additional Notes"]
[1,null,"Heating System Distribution"]
[1,"*\n*","Primary Heating System Distribution"]
[1,"*\n*","Secondary Heating System Distribution"]
[1,"*\n*","Tertiary Heating System Distribution"]
[1,null,"Cooling System Distribution"]
[1,"*\n*","Primary Cooling System Distribution"]
[1,"*\n*","Secondary Cooling System Distribution"]
[1,"*\n*","Tertiary Cooling System Distribution"]
[{"$f":"IF(COUNTIF('Measure Descriptions'!$D$8:$D$33,DropDowns!$S$45)>0,1,\"\")","v":""},null,"DHW System Distribution"]
[{"$f":"IF(COUNTIF('Measure Descriptions'!$D$8:$D$33,DropDowns!$S$45)>0,1,\"\")","v":""},"*\n*","DHW System 1 Distribution"]
[{"$f":"IF(COUNTIF('Measure Descriptions'!$D$8:$D$33,DropDowns!$S$45)>0,1,\"\")","v":""},"*\n*","DHW System 2 Distribution"]
[1,null,"Temperature Measurements"]
[1,null,"Interior Temperatures",null,"Measurement 1",null,"Measurement 2",null,"Measurement 3",null,"Measurement 4",null,"Measurement 5",null,"Measurement 6",null,"Measurement 7",null,"Measurement 8",null,"Measurement 9",null,"Measurement 10",null,"Measurement 11",null,"Measurement 12",null,"Measurement 13",null,"Measurement 14",null,"Measurement 15",null,"Measurement 16",null,"Measurement 17",null,"Measurement 18",null,"Measurement 19",null,"Measurement 20"]
[1,null,"Location / Apartment Number"]
[1,null,"Measured Room Temperature "]
[1,null,"Overheating Observations"]
[1,null,"Outdoor Temp. at Time of Measurements"]
[1,null,"Was heating/cooling system in operation at time of measurements?"]
[1,null,"Avg. Indoor Temp. in Heating Season"]
[1,"*\n*","Additional Notes"]
[{"$f":"IF(COUNTIF('Measure Descriptions'!$D$8:$D$33,DropDowns!$S$45)>0,1,\"\")","v":""},null,"DHW Temperatures/ Fixture Flow Rates","Measurement 1",null,"Measurement 2",null,"Measurement 3",null,"Measurement 4",null,"Measurement 5",null,"Measurement 6",null,"Measurement 7",null,"Measurement 8",null,"Measurement 9",null,"Measurement 10",null,"Measurement 11",null,"Measurement 12",null,"Measurement 13",null,"Measurement 14",null,"Measurement 15",null,"Measurement 16",null,"Measurement 17",null,"Measurement 18",null,"Measurement 19",null,"Measurement 20"]
[{"$f":"IF(COUNTIF('Measure Descriptions'!$D$8:$D$33,DropDowns!$S$45)>0,1,\"\")","v":""},null,"Location / Apartment Number"]
[{"$f":"IF(COUNTIF('Measure Descriptions'!$D$8:$D$33,DropDowns!$S$45)>0,1,\"\")","v":""},null,"Measured Tap Temperature "]
[{"$f":"IF(COUNTIF('Measure Descriptions'!$D$8:$D$33,DropDowns!$S$45)>0,1,\"\")","v":""},null,"Showerhead Flow Rate (GPM)"]
[{"$f":"IF(COUNTIF('Measure Descriptions'!$D$8:$D$33,DropDowns!$S$45)>0,1,\"\")","v":""},null,"Kitchen Faucet Flow Rate (GPM)"]
[{"$f":"IF(COUNTIF('Measure Descriptions'!$D$8:$D$33,DropDowns!$S$45)>0,1,\"\")","v":""},null,"Bathroom Faucet Flow Rate (GPM)"]
[{"$f":"IF(COUNTIF('Measure Descriptions'!$D$8:$D$33,DropDowns!$S$45)>0,1,\"\")","v":""},"*\n*","Average Flow Rates",null,"Showerhead GPM",{"$f":"IF(D153>0,AVERAGEIF(D155:AQ155,\">0\",D155:AQ155),\"\")","v":""},null,"Kitchen Faucet GPM",{"$f":"IF(D153>0,AVERAGEIF(D156:AQ156,\">0\",D156:AQ156),\"\")","v":""},null,"Bathroom Faucet GPM",{"$f":"IF(D153>0,AVERAGEIF(D157:AQ157,\">0\",D157:AQ157),\"\")","v":""}]
[{"$f":"IF(COUNTIF('Measure Descriptions'!$D$8:$D$33,DropDowns!$S$45)>0,1,\"\")","v":""},"*\n*","Additional Notes"]
[1,null,"Ventilation","Equipment Type",null,"System Type","Qty.","Location of Equipment",null,"Manufacturer",null,"Model No.","Year Installed","EStar?","Total CFM","Annual Hours","Conditioned Supply?","% Outdoor Air","Duct Leakiness","System Operational?","Additional Notes"]
[1,null,"Supply Location"]
[1,"*\n*","Corridors"]
[1,"*\n*","Apartments"]
[1,"*\n*","Whole Building"]
[1,"*\n*"]
[1,null,"Exhaust Location"]
[1,"*\n*","Corridors"]
[1,"*\n*","Apartment Bathrooms"]
[1,"*\n*","Apartment Kitchens"]
[1,"*\n*","Common Area Bathrooms"]
[1,"*\n*","Common Area/Commercial Kitchen"]
[1,"*\n*","Garage"]
[1,"*\n*","Laundry"]
[1,"*\n*"]
[1]
[1,"*\n*","List In-Unit CFM/Static Pressure Measurements, with location"]
[1,"*\n*","Source of Intake Air"]
[1,"*\n*","Indoor Air Quality Concerns"]
[1,"*\n*","Ventilation Concerns"]
[1,"*\n*","Passive Ventilation Systems"]
[{"$f":"IF((COUNTIF('Measure Descriptions'!$E$8:$E$33,Calcs!$A$17)+COUNTIF('Measure Descriptions'!$E$8:$E$33,Calcs!$A$44)+COUNTIF('Measure Descriptions'!$E$8:$E$33,Calcs!$A$57))>0,1,\"\")","v":""}]
[{"$f":"IF((COUNTIF('Measure Descriptions'!$E$8:$E$33,Calcs!$A$17)+COUNTIF('Measure Descriptions'!$E$8:$E$33,Calcs!$A$44)+COUNTIF('Measure Descriptions'!$E$8:$E$33,Calcs!$A$57))>0,1,\"\")","v":""},null,"Appliances"]
[{"$f":"IF((COUNTIF('Measure Descriptions'!$E$8:$E$33,Calcs!$A$17)+COUNTIF('Measure Descriptions'!$E$8:$E$33,Calcs!$A$44)+COUNTIF('Measure Descriptions'!$E$8:$E$33,Calcs!$A$57))>0,1,\"\")","v":""},null,"Common Area Appliances","Location of Equipment",null,"Manufacturer",null,"Model No.","EStar?","Qty.","Year Manufactured","Capacity\n(ft.3)","Annual kWh/unit","Fuel Source","Additional Notes"]
[{"$f":"IF(COUNTIF('Measure Descriptions'!$E$8:$E$33,Calcs!$A$57)>0,1,\"\")","v":""},null,"Refrigerator",null,null,null,null,null,null,null,null,null,null,""]
[{"$f":"IF(COUNTIF('Measure Descriptions'!$E$8:$E$33,Calcs!$A$44)>0,1,\"\")","v":""},null,"Stove/Range",null,null,null,null,null,"",null,null,""]
[{"$f":"IF(COUNTIF('Measure Descriptions'!$E$8:$E$33,Calcs!$A$44)>0,1,\"\")","v":""},null,"Vending Machine",null,null,null,null,null,"",null,null,"",null,""]
[{"$f":"IF(COUNTIF('Measure Descriptions'!$E$8:$E$33,Calcs!$A$44)>0,1,\"\")","v":""}]
[{"$f":"IF(COUNTIF('Measure Descriptions'!$E$8:$E$33,Calcs!$A$44)>0,1,\"\")","v":""}]
[{"$f":"IF((COUNTIF('Measure Descriptions'!$E$8:$E$33,Calcs!$A$17)+COUNTIF('Measure Descriptions'!$E$8:$E$33,Calcs!$A$44)+COUNTIF('Measure Descriptions'!$E$8:$E$33,Calcs!$A$57))>0,1,\"\")","v":""},null,"Apartment Appliances","List Apartment Numbers",null,"Manufacturer",null,"Model No.","EStar?","Qty.","Year Manufactured","Capacity\n(ft.3)","Annual kWh/unit","Fuel Source","Additional Notes"]
[{"$f":"IF(COUNTIF('Measure Descriptions'!$E$8:$E$33,Calcs!$A$57)>0,1,\"\")","v":""},null,"Refrigerators",null,null,null,null,null,null,null,null,null,null,""]
[{"$f":"IF(COUNTIF('Measure Descriptions'!$E$8:$E$33,Calcs!$A$57)>0,1,\"\")","v":""},null,null,null,null,null,null,null,null,null,null,null,null,""]
[{"$f":"IF(COUNTIF('Measure Descriptions'!$E$8:$E$33,Calcs!$A$57)>0,1,\"\")","v":""},null,null,null,null,null,null,null,null,null,null,null,null,""]
[{"$f":"IF(COUNTIF('Measure Descriptions'!$E$8:$E$33,Calcs!$A$57)>0,1,\"\")","v":""},null,null,null,null,null,null,null,null,null,null,null,null,""]
[{"$f":"IF(COUNTIF('Measure Descriptions'!$E$8:$E$33,Calcs!$A$57)>0,1,\"\")","v":""},null,null,null,null,null,null,null,null,null,null,null,null,""]
[{"$f":"IF(COUNTIF('Measure Descriptions'!$E$8:$E$33,Calcs!$A$57)>0,1,\"\")","v":""},null,null,null,null,null,null,null,null,null,null,null,null,""]
[{"$f":"IF(COUNTIF('Measure Descriptions'!$E$8:$E$33,Calcs!$A$17)>0,1,\"\")","v":""},null,"Dishwashers",null,null,null,null,null,null,null,null,"",null,""]
[{"$f":"IF(COUNTIF('Measure Descriptions'!$E$8:$E$33,Calcs!$A$44)>0,1,\"\")","v":""},null,"Stove/Range",null,null,null,null,null,"",null,null,""]
[{"$f":"IF(COUNTIF('Measure Descriptions'!$E$8:$E$33,Calcs!$A$44)>0,1,\"\")","v":""}]
[{"$f":"IF(COUNTIF('Measure Descriptions'!$E$8:$E$33,Calcs!$A$44)>0,1,\"\")","v":""}]
[{"$f":"IF(COUNTIF('Measure Descriptions'!$E$8:$E$33,Calcs!$A$44)>0,1,\"\")","v":""}]
[{"$f":"IF((COUNTIF('Measure Descriptions'!$E$8:$E$33,Calcs!$A$29)+COUNTIF('Measure Descriptions'!$E$8:$E$33,Calcs!$A$71))>0,1,\"\")","v":""}]
[{"$f":"IF((COUNTIF('Measure Descriptions'!$E$8:$E$33,Calcs!$A$29)+COUNTIF('Measure Descriptions'!$E$8:$E$33,Calcs!$A$71))>0,1,\"\")","v":""},null,"Laundry Equipment"]
[{"$f":"IF((COUNTIF('Measure Descriptions'!$E$8:$E$33,Calcs!$A$29)+COUNTIF('Measure Descriptions'!$E$8:$E$33,Calcs!$A$71))>0,1,\"\")","v":""},null,"Common Area Laundry","Manufacturer",null,"Model No.","Style","EStar?","Qty.","Fuel Source","Location",null,"Ownership","Frequency of Use (Loads/wk.)","Additional Notes"]
[{"$f":"IF(COUNTIF('Measure Descriptions'!$E$8:$E$33,Calcs!$A$71)>0,1,\"\")","v":""},null,"Washer (Type 1)",null,null,null,null,null,null,""]
[{"$f":"IF(COUNTIF('Measure Descriptions'!$E$8:$E$33,Calcs!$A$71)>0,1,\"\")","v":""},null,"Washer (Type 2)",null,null,null,null,null,null,""]
[{"$f":"IF(COUNTIF('Measure Descriptions'!$E$8:$E$33,Calcs!$A$71)>0,1,\"\")","v":""},null,"Washer (Type 3)",null,null,null,null,null,null,""]
[{"$f":"IF(COUNTIF('Measure Descriptions'!$E$8:$E$33,Calcs!$A$29)>0,1,\"\")","v":""},null,"Dryer (Type 1)",null,null,null,"",""]
[{"$f":"IF(COUNTIF('Measure Descriptions'!$E$8:$E$33,Calcs!$A$29)>0,1,\"\")","v":""},null,"Dryer (Type 2)",null,null,null,"",""]
[{"$f":"IF(COUNTIF('Measure Descriptions'!$E$8:$E$33,Calcs!$A$29)>0,1,\"\")","v":""},null,"Dryer (Type 3)",null,null,null,"",""]
[{"$f":"IF((COUNTIF('Measure Descriptions'!$E$8:$E$33,Calcs!$A$29)+COUNTIF('Measure Descriptions'!$E$8:$E$33,Calcs!$A$71))>0,1,\"\")","v":""},null,"Apartment Laundry","Manufacturer",null,"Model No.","Style","EStar?","Qty.","Fuel Source","% of Apts. with Equipment","Ownership","Frequency of Use (Loads/wk.)","Additional Notes"]
[{"$f":"IF(COUNTIF('Measure Descriptions'!$E$8:$E$33,Calcs!$A$71)>0,1,\"\")","v":""},null,"Washer (Type 1)"]
[{"$f":"IF(COUNTIF('Measure Descriptions'!$E$8:$E$33,Calcs!$A$71)>0,1,\"\")","v":""},null,"Washer (Type 2)"]
[{"$f":"IF(COUNTIF('Measure Descriptions'!$E$8:$E$33,Calcs!$A$71)>0,1,\"\")","v":""},null,"Washer (Type 3)"]
[{"$f":"IF(COUNTIF('Measure Descriptions'!$E$8:$E$33,Calcs!$A$29)>0,1,\"\")","v":""},null,"Dryer (Type 1)"]
[{"$f":"IF(COUNTIF('Measure Descriptions'!$E$8:$E$33,Calcs!$A$29)>0,1,\"\")","v":""},null,"Dryer (Type 2)"]
[{"$f":"IF(COUNTIF('Measure Descriptions'!$E$8:$E$33,Calcs!$A$29)>0,1,\"\")","v":""},null,"Dryer (Type 3)"]
[{"$f":"IF(COUNTIF('Measure Descriptions'!$E$8:$E$33,Calcs!$A$21)>0,1,\"\")","v":""}]
[{"$f":"IF(COUNTIF('Measure Descriptions'!$E$8:$E$33,Calcs!$A$21)>0,1,\"\")","v":""},null,"Elevators"]
[{"$f":"IF(COUNTIF('Measure Descriptions'!$E$8:$E$33,Calcs!$A$21)>0,1,\"\")","v":""},null,"Elevators","Elevator Type",null,"Manufacturer",null,"Model No.","Qty.","Year Installed","Motor Type",null,"Operation Schedule",null,"Additional Notes"]
[{"$f":"IF(COUNTIF('Measure Descriptions'!$E$8:$E$33,Calcs!$A$21)>0,1,\"\")","v":""},"*\n*","Elevator (Type 1)"]
[{"$f":"IF(COUNTIF('Measure Descriptions'!$E$8:$E$33,Calcs!$A$21)>0,1,\"\")","v":""},"*\n*","Elevator (Type 2)"]
[1]
[1,null,"Other Systems"]
[1,null,"Name of System","System Details"]
[1,"*\n*"]
[1,"*\n*"]
[1,"*\n*"]
[1,"*\n*"]
[1,"*\n*"]
[1,"*\n*"]
[1,"*\n*"]
[1,"*\n*"]
[1,"*\n*"]
[1,"*\n*"]

{"sheet":"Measure Summary","index":6,"n_rows":50,"n_cols":79,"rows_kept":50,"cut":false,"hidden":false,"merged":[[2,1,2,29],[22,1,22,20],[33,1,33,20],[39,1,39,20],[33,25,33,29],[4,11,5,11],[4,15,5,15],[4,22,5,22],[4,23,5,23],[4,13,5,13],[4,24,5,24],[47,1,47,2],[43,1,43,2],[46,1,46,2],[41,22,41,23],[4,16,5,16],[4,17,5,17],[4,19,5,19],[4,20,5,20],[4,18,5,18],[4,12,5,12],[4,14,5,14],[4,1,5,2],[4,4,5,4],[4,5,5,5],[4,6,4,9],[4,10,5,10],[45,1,45,2],[4,3,5,3],[4,28,5,28],[4,26,5,26],[4,29,5,29],[4,27,5,27],[4,25,5,25],[39,24,39,28],[6,22,6,29],[22,22,22,29],[6,1,6,20],[36,6,36,20],[38,6,38,20],[37,24,37,28],[38,24,38,28],[44,1,44,2]]}
[null,"Detailed Cost and Savings Summary for Proposed Measures"]
[null,"Instructions"]
[false,"1) Prior to entering any data on this tab, ensure the General Project Info, Existing Conditions, Utility Info and Measure Descriptions tabs have been properly completed.\n2) Enter measure specific metrics in all orange and blue input cells. Note that in some cases, a Measure Life will need to be entered manually.\n3) Read the notes indicated by red corners, where appropriate, to assist in properly completing this tab.\n4) Choose Furnace/Chiller/AC Type: If you are installing a gas furnace, chiller, or central AC, you must choose the appropriate capacity/efficiency in the Measure Data section (starting in cell W36).\n5) The energy savings entered on the Measure Summary tab should reflect site usage reduction. These values are converted to source energy savings by the SAV-IT tool for evaluation of project eligibility.\n6) Use the \"Show Financial Performance Metrics >>\" link in cell N4 to display measure and project-level SIR, IRR and TRC B/C Ratio.\n\n"]
[]
[null,"Measure Name",null,"Measure Cateogry","Measure Classification","Cost","Annual SITE Energy Savings",null,null,null,"Demand Savings\n(kW)","Annual Water/Sewer Savings\n(1000 gal)","Annual O&M Savings","Affected Fuel\n(for MMBtu Savings)","Annual Cost Savings","Water Cost ($/1000 gal)","Payback\n(years)","S.I.R.","IRR\n(%)","TRC B/C Ratio","Source Energy Savings\n(%)",null,"Quantity","Units","Previously Installed Measure?","Incentive Previously Received\n($)","Measure Life\n(years)","Full or Incremental Savings","Existing Equipment Year of Manufacture","Life Cycle Savings"]
[null,null,null,null,null,null,"Heating MMBtu","Non-Heating MMBtu","Cooling kWh","Non-Cooling kWh",null,null,null,null,null,null,null,null,null,null,null,null,null,null,null,null,null,null,null,null,null,null,"Cash Flow for IRR Calculation",null,null,null,null,null,null,null,null,null,null,null,null,null,null,null,null,null,null,null,null,null,null,null,null,null,null,null,null,null,null,null,null,null,null,null,null,null,null,null,null,null,null,null,null,null,"Row Check"]
[null,"Measures to be undertaken by building - Savings accrue to building",null,null,null,null,null,null,null,null,null,null,null,null,null,null,null,null,null,null,null,null,null,null,null,null,null,null,null,null,null,null,"Year 0","Year 1","Year 2","Year 3","Year 4","Year 5","Year 6","Year 7","Year 8","Year 9","Year 10","Year 11","Year 12","Year 13","Year 14","Year 15","Year 16","Year 17","Year 18","Year 19","Year 20","Year 21","Year 22","Year 23","Year 24","Year 25","Year 26","Year 27","Year 28","Year 29","Year 30","Year 31","Year 32","Year 33","Year 34","Year 35","Year 36","Year 37","Year 38","Year 39","Year 40","IRR Estimate"]
[null,1,{"$f":"IF(OR('Measure Descriptions'!C8=\"\",'Measure Descriptions'!D8=\"\",'Measure Descriptions'!E8=\"\")=TRUE,\"\",'Measure Descriptions'!C8)","v":""},{"$f":"IF(OR('Measure Descriptions'!C8=\"\",'Measure Descriptions'!D8=\"\",'Measure Descriptions'!E8=\"\")=TRUE,\"\",'Measure Descriptions'!D8)","v":""},{"$f":"IF(OR('Measure Descriptions'!C8=\"\",'Measure Descriptions'!D8=\"\",'Measure Descriptions'!E8=\"\")=TRUE,\"\",'Measure Descriptions'!E8)","v":""},null,null,null,null,null,null,null,null,null,{"$f":"IF(E8=\"\",\"\",(G8+H8)*VLOOKUP(N8,'Utility Info'!$B$15:$G$19,5,FALSE)+(I8+J8)*'Utility Info'!$F$14)","v":""},{"$f":"IFERROR(IF(UpDown=\"U\",3,7),0)","v":0},{"$f":"IF(N(O8)=0,\"\",F8/O8)","v":""},{"$f":"IF(N(O8)=0,\"\",PV($Y$42,AA8,-O8)/F8)","v":""},{"$f":"IFERROR(IFERROR(IF(O8=0,0,(IRR(AG8:BU8,BV8))),IF(O8=0,0,(IRR(AG8:BU8,10%)))),0)","v":0},{"$f":"IFERROR(IF(F8=0,0,IF(OR(C8=\"Fuel Conversion\",Y8=\"Yes\")=TRUE,\"N/A\",'TRC Test'!K6/'TRC Test'!M6)),0)","v":0},{"$f":"'Measure QC'!H6","v":0},null,null,{"$f":"IFERROR(IF(E8=\"\",\"\",IF(VLOOKUP(E8,MeasureQCData,2,FALSE)=\"\",\"\",VLOOKUP(E8,MeasureQCData,2,FALSE))),\"\")","v":""},null,null,{"$f":"IFERROR(IF(E8=\"\",\"\",IF(VLOOKUP(E8,MeasureQCData,3,FALSE)=\"\",\"\",VLOOKUP(E8,MeasureQCData,3,FALSE))),\"\")","v":""},{"$f":"IFERROR(IF(E8=\"\",\"\",IF(VLOOKUP(E8,MeasureQCData,27,FALSE)=\"\",\"\",VLOOKUP(E8,MeasureQCData,27,FALSE))),\"\")","v":""},null,{"$f":"IFERROR(IF(E8=\"\",\"\",-PV($Y$42,AA8,O8)-F8),\"\")","v":""},null,null,{"$f":"-F8","v":0},{"$f":"O8","v":""},{"$f":"IF(COUNTIF(AH8,O8)<AA8,O8,0)","v":""},{"$f":"IF(COUNTIF($AH8:AI8,$O8)<$AA8,$O8,0)","v":""},{"$f":"IF(COUNTIF($AH8:AJ8,$O8)<$AA8,$O8,0)","v":""},{"$f":"IF(COUNTIF($AH8:AK8,$O8)<$AA8,$O8,0)","v":""},{"$f":"IF(COUNTIF($AH8:AL8,$O8)<$AA8,$O8,0)","v":""},{"$f":"IF(COUNTIF($AH8:AM8,$O8)<$AA8,$O8,0)","v":""},{"$f":"IF(COUNTIF($AH8:AN8,$O8)<$AA8,$O8,0)","v":""},{"$f":"IF(COUNTIF($AH8:AO8,$O8)<$AA8,$O8,0)","v":""},{"$f":"IF(COUNTIF($AH8:AP8,$O8)<$AA8,$O8,0)","v":""},{"$f":"IF(COUNTIF($AH8:AQ8,$O8)<$AA8,$O8,0)","v":""},{"$f":"IF(COUNTIF($AH8:AR8,$O8)<$AA8,$O8,0)","v":""},{"$f":"IF(COUNTIF($AH8:AS8,$O8)<$AA8,$O8,0)","v":""},{"$f":"IF(COUNTIF($AH8:AT8,$O8)<$AA8,$O8,0)","v":""},{"$f":"IF(COUNTIF($AH8:AU8,$O8)<$AA8,$O8,0)","v":""},{"$f":"IF(COUNTIF($AH8:AV8,$O8)<$AA8,$O8,0)","v":""},{"$f":"IF(COUNTIF($AH8:AW8,$O8)<$AA8,$O8,0)","v":""},{"$f":"IF(COUNTIF($AH8:AX8,$O8)<$AA8,$O8,0)","v":""},{"$f":"IF(COUNTIF($AH8:AY8,$O8)<$AA8,$O8,0)","v":""},{"$f":"IF(COUNTIF($AH8:AZ8,$O8)<$AA8,$O8,0)","v":""},{"$f":"IF(COUNTIF($AH8:BA8,$O8)<$AA8,$O8,0)","v":""},{"$f":"IF(COUNTIF($AH8:BB8,$O8)<$AA8,$O8,0)","v":""},{"$f":"IF(COUNTIF($AH8:BC8,$O8)<$AA8,$O8,0)","v":""},{"$f":"IF(COUNTIF($AH8:BD8,$O8)<$AA8,$O8,0)","v":""},{"$f":"IF(COUNTIF($AH8:BE8,$O8)<$AA8,$O8,0)","v":""},{"$f":"IF(COUNTIF($AH8:BF8,$O8)<$AA8,$O8,0)","v":""},{"$f":"IF(COUNTIF($AH8:BG8,$O8)<$AA8,$O8,0)","v":""},{"$f":"IF(COUNTIF($AH8:BH8,$O8)<$AA8,$O8,0)","v":""},{"$f":"IF(COUNTIF($AH8:BI8,$O8)<$AA8,$O8,0)","v":""},{"$f":"IF(COUNTIF($AH8:BJ8,$O8)<$AA8,$O8,0)","v":""},{"$f":"IF(COUNTIF($AH8:BK8,$O8)<$AA8,$O8,0)","v":""},{"$f":"IF(COUNTIF($AH8:BL8,$O8)<$AA8,$O8,0)","v":""},{"$f":"IF(COUNTIF($AH8:BM8,$O8)<$AA8,$O8,0)","v":""},{"$f":"IF(COUNTIF($AH8:BN8,$O8)<$AA8,$O8,0)","v":""},{"$f":"IF(COUNTIF($AH8:BO8,$O8)<$AA8,$O8,0)","v":""},{"$f":"IF(COUNTIF($AH8:BP8,$O8)<$AA8,$O8,0)","v":""},{"$f":"IF(COUNTIF($AH8:BQ8,$O8)<$AA8,$O8,0)","v":""},{"$f":"IF(COUNTIF($AH8:BR8,$O8)<$AA8,$O8,0)","v":""},{"$f":"IF(COUNTIF($AH8:BS8,$O8)<$AA8,$O8,0)","v":""},{"$f":"IF(COUNTIF($AH8:BT8,$O8)<$AA8,$O8,0)","v":""},{"$f":"IF(N(O8)*N(AA8)>N(F8),0.3,-0.3)","v":-0.3},null,null,null,null,{"$f":"IF(C8=\"\",\"\",IF(OR(F8=\"\",G8=\"\",H8=\"\",I8=\"\",J8=\"\",K8=\"\",L8=\"\",M8=\"\",O8=\"\",W8=\"\",X8=\"\",N8=\"\",N8=\"\",Y8=\"\",Z8=\"\",AA8=\"\",AND(AB8=\"Inc\",AC8=\"\")=TRUE)=TRUE,\"ERR\",\"\"))","v":""}]
[null,2,{"$f":"IF(OR('Measure Descriptions'!C9=\"\",'Measure Descriptions'!D9=\"\",'Measure Descriptions'!E9=\"\")=TRUE,\"\",'Measure Descriptions'!C9)","v":""},{"$f":"IF(OR('Measure Descriptions'!C9=\"\",'Measure Descriptions'!D9=\"\",'Measure Descriptions'!E9=\"\")=TRUE,\"\",'Measure Descriptions'!D9)","v":""},{"$f":"IF(OR('Measure Descriptions'!C9=\"\",'Measure Descriptions'!D9=\"\",'Measure Descriptions'!E9=\"\")=TRUE,\"\",'Measure Descriptions'!E9)","v":""},null,null,null,null,null,null,null,null,null,{"$f":"IF(E9=\"\",\"\",(G9+H9)*VLOOKUP(N9,'Utility Info'!$B$15:$G$19,5,FALSE)+(I9+J9)*'Utility Info'!$F$14)","v":""},0,{"$f":"IF(N(O9)=0,\"\",F9/O9)","v":""},{"$f":"IF(N(O9)=0,\"\",PV($Y$42,AA9,-O9)/F9)","v":""},0,{"$f":"IFERROR(IF(F9=0,0,IF(OR(C9=\"Fuel Conversion\",Y9=\"Yes\")=TRUE,\"N/A\",'TRC Test'!K7/'TRC Test'!M7)),0)","v":0},{"$f":"'Measure QC'!H7","v":0},null,null,"",null,null,"","",null,"",null,null,0,"","",{"$f":"IF(COUNTIF($AH9:AI9,$O9)<$AA9,$O9,0)","v":""},{"$f":"IF(COUNTIF($AH9:AJ9,$O9)<$AA9,$O9,0)","v":""},{"$f":"IF(COUNTIF($AH9:AK9,$O9)<$AA9,$O9,0)","v":""},{"$f":"IF(COUNTIF($AH9:AL9,$O9)<$AA9,$O9,0)","v":""},{"$f":"IF(COUNTIF($AH9:AM9,$O9)<$AA9,$O9,0)","v":""},{"$f":"IF(COUNTIF($AH9:AN9,$O9)<$AA9,$O9,0)","v":""},{"$f":"IF(COUNTIF($AH9:AO9,$O9)<$AA9,$O9,0)","v":""},{"$f":"IF(COUNTIF($AH9:AP9,$O9)<$AA9,$O9,0)","v":""},{"$f":"IF(COUNTIF($AH9:AQ9,$O9)<$AA9,$O9,0)","v":""},{"$f":"IF(COUNTIF($AH9:AR9,$O9)<$AA9,$O9,0)","v":""},{"$f":"IF(COUNTIF($AH9:AS9,$O9)<$AA9,$O9,0)","v":""},{"$f":"IF(COUNTIF($AH9:AT9,$O9)<$AA9,$O9,0)","v":""},{"$f":"IF(COUNTIF($AH9:AU9,$O9)<$AA9,$O9,0)","v":""},{"$f":"IF(COUNTIF($AH9:AV9,$O9)<$AA9,$O9,0)","v":""},{"$f":"IF(COUNTIF($AH9:AW9,$O9)<$AA9,$O9,0)","v":""},{"$f":"IF(COUNTIF($AH9:AX9,$O9)<$AA9,$O9,0)","v":""},{"$f":"IF(COUNTIF($AH9:AY9,$O9)<$AA9,$O9,0)","v":""},{"$f":"IF(COUNTIF($AH9:AZ9,$O9)<$AA9,$O9,0)","v":""},{"$f":"IF(COUNTIF($AH9:BA9,$O9)<$AA9,$O9,0)","v":""},{"$f":"IF(COUNTIF($AH9:BB9,$O9)<$AA9,$O9,0)","v":""},{"$f":"IF(COUNTIF($AH9:BC9,$O9)<$AA9,$O9,0)","v":""},{"$f":"IF(COUNTIF($AH9:BD9,$O9)<$AA9,$O9,0)","v":""},{"$f":"IF(COUNTIF($AH9:BE9,$O9)<$AA9,$O9,0)","v":""},{"$f":"IF(COUNTIF($AH9:BF9,$O9)<$AA9,$O9,0)","v":""},{"$f":"IF(COUNTIF($AH9:BG9,$O9)<$AA9,$O9,0)","v":""},{"$f":"IF(COUNTIF($AH9:BH9,$O9)<$AA9,$O9,0)","v":""},{"$f":"IF(COUNTIF($AH9:BI9,$O9)<$AA9,$O9,0)","v":""},{"$f":"IF(COUNTIF($AH9:BJ9,$O9)<$AA9,$O9,0)","v":""},{"$f":"IF(COUNTIF($AH9:BK9,$O9)<$AA9,$O9,0)","v":""},{"$f":"IF(COUNTIF($AH9:BL9,$O9)<$AA9,$O9,0)","v":""},{"$f":"IF(COUNTIF($AH9:BM9,$O9)<$AA9,$O9,0)","v":""},{"$f":"IF(COUNTIF($AH9:BN9,$O9)<$AA9,$O9,0)","v":""},{"$f":"IF(COUNTIF($AH9:BO9,$O9)<$AA9,$O9,0)","v":""},{"$f":"IF(COUNTIF($AH9:BP9,$O9)<$AA9,$O9,0)","v":""},{"$f":"IF(COUNTIF($AH9:BQ9,$O9)<$AA9,$O9,0)","v":""},{"$f":"IF(COUNTIF($AH9:BR9,$O9)<$AA9,$O9,0)","v":""},{"$f":"IF(COUNTIF($AH9:BS9,$O9)<$AA9,$O9,0)","v":""},{"$f":"IF(COUNTIF($AH9:BT9,$O9)<$AA9,$O9,0)","v":""},{"$f":"IF(N(O9)*N(AA9)>N(F9),0.3,-0.3)","v":-0.3},null,null,null,null,""]
[null,3,{"$f":"IF(OR('Measure Descriptions'!C10=\"\",'Measure Descriptions'!D10=\"\",'Measure Descriptions'!E10=\"\")=TRUE,\"\",'Measure Descriptions'!C10)","v":""},{"$f":"IF(OR('Measure Descriptions'!C10=\"\",'Measure Descriptions'!D10=\"\",'Measure Descriptions'!E10=\"\")=TRUE,\"\",'Measure Descriptions'!D10)","v":""},{"$f":"IF(OR('Measure Descriptions'!C10=\"\",'Measure Descriptions'!D10=\"\",'Measure Descriptions'!E10=\"\")=TRUE,\"\",'Measure Descriptions'!E10)","v":""},null,null,null,null,null,null,null,null,null,{"$f":"IF(E10=\"\",\"\",(G10+H10)*VLOOKUP(N10,'Utility Info'!$B$15:$G$19,5,FALSE)+(I10+J10)*'Utility Info'!$F$14)","v":""},0,"","",0,{"$f":"IFERROR(IF(F10=0,0,IF(OR(C10=\"Fuel Conversion\",Y10=\"Yes\")=TRUE,\"N/A\",'TRC Test'!K8/'TRC Test'!M8)),0)","v":0},{"$f":"'Measure QC'!H8","v":0},null,null,"",null,null,"","",null,"",null,null,0,"","",{"$f":"IF(COUNTIF($AH10:AI10,$O10)<$AA10,$O10,0)","v":""},{"$f":"IF(COUNTIF($AH10:AJ10,$O10)<$AA10,$O10,0)","v":""},{"$f":"IF(COUNTIF($AH10:AK10,$O10)<$AA10,$O10,0)","v":""},{"$f":"IF(COUNTIF($AH10:AL10,$O10)<$AA10,$O10,0)","v":""},{"$f":"IF(COUNTIF($AH10:AM10,$O10)<$AA10,$O10,0)","v":""},{"$f":"IF(COUNTIF($AH10:AN10,$O10)<$AA10,$O10,0)","v":""},{"$f":"IF(COUNTIF($AH10:AO10,$O10)<$AA10,$O10,0)","v":""},{"$f":"IF(COUNTIF($AH10:AP10,$O10)<$AA10,$O10,0)","v":""},{"$f":"IF(COUNTIF($AH10:AQ10,$O10)<$AA10,$O10,0)","v":""},{"$f":"IF(COUNTIF($AH10:AR10,$O10)<$AA10,$O10,0)","v":""},{"$f":"IF(COUNTIF($AH10:AS10,$O10)<$AA10,$O10,0)","v":""},{"$f":"IF(COUNTIF($AH10:AT10,$O10)<$AA10,$O10,0)","v":""},{"$f":"IF(COUNTIF($AH10:AU10,$O10)<$AA10,$O10,0)","v":""},{"$f":"IF(COUNTIF($AH10:AV10,$O10)<$AA10,$O10,0)","v":""},{"$f":"IF(COUNTIF($AH10:AW10,$O10)<$AA10,$O10,0)","v":""},{"$f":"IF(COUNTIF($AH10:AX10,$O10)<$AA10,$O10,0)","v":""},{"$f":"IF(COUNTIF($AH10:AY10,$O10)<$AA10,$O10,0)","v":""},{"$f":"IF(COUNTIF($AH10:AZ10,$O10)<$AA10,$O10,0)","v":""},{"$f":"IF(COUNTIF($AH10:BA10,$O10)<$AA10,$O10,0)","v":""},{"$f":"IF(COUNTIF($AH10:BB10,$O10)<$AA10,$O10,0)","v":""},{"$f":"IF(COUNTIF($AH10:BC10,$O10)<$AA10,$O10,0)","v":""},{"$f":"IF(COUNTIF($AH10:BD10,$O10)<$AA10,$O10,0)","v":""},{"$f":"IF(COUNTIF($AH10:BE10,$O10)<$AA10,$O10,0)","v":""},{"$f":"IF(COUNTIF($AH10:BF10,$O10)<$AA10,$O10,0)","v":""},{"$f":"IF(COUNTIF($AH10:BG10,$O10)<$AA10,$O10,0)","v":""},{"$f":"IF(COUNTIF($AH10:BH10,$O10)<$AA10,$O10,0)","v":""},{"$f":"IF(COUNTIF($AH10:BI10,$O10)<$AA10,$O10,0)","v":""},{"$f":"IF(COUNTIF($AH10:BJ10,$O10)<$AA10,$O10,0)","v":""},{"$f":"IF(COUNTIF($AH10:BK10,$O10)<$AA10,$O10,0)","v":""},{"$f":"IF(COUNTIF($AH10:BL10,$O10)<$AA10,$O10,0)","v":""},{"$f":"IF(COUNTIF($AH10:BM10,$O10)<$AA10,$O10,0)","v":""},{"$f":"IF(COUNTIF($AH10:BN10,$O10)<$AA10,$O10,0)","v":""},{"$f":"IF(COUNTIF($AH10:BO10,$O10)<$AA10,$O10,0)","v":""},{"$f":"IF(COUNTIF($AH10:BP10,$O10)<$AA10,$O10,0)","v":""},{"$f":"IF(COUNTIF($AH10:BQ10,$O10)<$AA10,$O10,0)","v":""},{"$f":"IF(COUNTIF($AH10:BR10,$O10)<$AA10,$O10,0)","v":""},{"$f":"IF(COUNTIF($AH10:BS10,$O10)<$AA10,$O10,0)","v":""},{"$f":"IF(COUNTIF($AH10:BT10,$O10)<$AA10,$O10,0)","v":""},-0.3,null,null,null,null,""]
[null,4,{"$f":"IF(OR('Measure Descriptions'!C11=\"\",'Measure Descriptions'!D11=\"\",'Measure Descriptions'!E11=\"\")=TRUE,\"\",'Measure Descriptions'!C11)","v":""},{"$f":"IF(OR('Measure Descriptions'!C11=\"\",'Measure Descriptions'!D11=\"\",'Measure Descriptions'!E11=\"\")=TRUE,\"\",'Measure Descriptions'!D11)","v":""},{"$f":"IF(OR('Measure Descriptions'!C11=\"\",'Measure Descriptions'!D11=\"\",'Measure Descriptions'!E11=\"\")=TRUE,\"\",'Measure Descriptions'!E11)","v":""},null,null,null,null,null,null,null,null,null,{"$f":"IF(E11=\"\",\"\",(G11+H11)*VLOOKUP(N11,'Utility Info'!$B$15:$G$19,5,FALSE)+(I11+J11)*'Utility Info'!$F$14)","v":""},0,"","",0,{"$f":"IFERROR(IF(F11=0,0,IF(OR(C11=\"Fuel Conversion\",Y11=\"Yes\")=TRUE,\"N/A\",'TRC Test'!K9/'TRC Test'!M9)),0)","v":0},{"$f":"'Measure QC'!H9","v":0},null,null,"",null,null,"","",null,"",null,null,0,"","",{"$f":"IF(COUNTIF($AH11:AI11,$O11)<$AA11,$O11,0)","v":""},{"$f":"IF(COUNTIF($AH11:AJ11,$O11)<$AA11,$O11,0)","v":""},{"$f":"IF(COUNTIF($AH11:AK11,$O11)<$AA11,$O11,0)","v":""},{"$f":"IF(COUNTIF($AH11:AL11,$O11)<$AA11,$O11,0)","v":""},{"$f":"IF(COUNTIF($AH11:AM11,$O11)<$AA11,$O11,0)","v":""},{"$f":"IF(COUNTIF($AH11:AN11,$O11)<$AA11,$O11,0)","v":""},{"$f":"IF(COUNTIF($AH11:AO11,$O11)<$AA11,$O11,0)","v":""},{"$f":"IF(COUNTIF($AH11:AP11,$O11)<$AA11,$O11,0)","v":""},{"$f":"IF(COUNTIF($AH11:AQ11,$O11)<$AA11,$O11,0)","v":""},{"$f":"IF(COUNTIF($AH11:AR11,$O11)<$AA11,$O11,0)","v":""},{"$f":"IF(COUNTIF($AH11:AS11,$O11)<$AA11,$O11,0)","v":""},{"$f":"IF(COUNTIF($AH11:AT11,$O11)<$AA11,$O11,0)","v":""},{"$f":"IF(COUNTIF($AH11:AU11,$O11)<$AA11,$O11,0)","v":""},{"$f":"IF(COUNTIF($AH11:AV11,$O11)<$AA11,$O11,0)","v":""},{"$f":"IF(COUNTIF($AH11:AW11,$O11)<$AA11,$O11,0)","v":""},{"$f":"IF(COUNTIF($AH11:AX11,$O11)<$AA11,$O11,0)","v":""},{"$f":"IF(COUNTIF($AH11:AY11,$O11)<$AA11,$O11,0)","v":""},{"$f":"IF(COUNTIF($AH11:AZ11,$O11)<$AA11,$O11,0)","v":""},{"$f":"IF(COUNTIF($AH11:BA11,$O11)<$AA11,$O11,0)","v":""},{"$f":"IF(COUNTIF($AH11:BB11,$O11)<$AA11,$O11,0)","v":""},{"$f":"IF(COUNTIF($AH11:BC11,$O11)<$AA11,$O11,0)","v":""},{"$f":"IF(COUNTIF($AH11:BD11,$O11)<$AA11,$O11,0)","v":""},{"$f":"IF(COUNTIF($AH11:BE11,$O11)<$AA11,$O11,0)","v":""},{"$f":"IF(COUNTIF($AH11:BF11,$O11)<$AA11,$O11,0)","v":""},{"$f":"IF(COUNTIF($AH11:BG11,$O11)<$AA11,$O11,0)","v":""},{"$f":"IF(COUNTIF($AH11:BH11,$O11)<$AA11,$O11,0)","v":""},{"$f":"IF(COUNTIF($AH11:BI11,$O11)<$AA11,$O11,0)","v":""},{"$f":"IF(COUNTIF($AH11:BJ11,$O11)<$AA11,$O11,0)","v":""},{"$f":"IF(COUNTIF($AH11:BK11,$O11)<$AA11,$O11,0)","v":""},{"$f":"IF(COUNTIF($AH11:BL11,$O11)<$AA11,$O11,0)","v":""},{"$f":"IF(COUNTIF($AH11:BM11,$O11)<$AA11,$O11,0)","v":""},{"$f":"IF(COUNTIF($AH11:BN11,$O11)<$AA11,$O11,0)","v":""},{"$f":"IF(COUNTIF($AH11:BO11,$O11)<$AA11,$O11,0)","v":""},{"$f":"IF(COUNTIF($AH11:BP11,$O11)<$AA11,$O11,0)","v":""},{"$f":"IF(COUNTIF($AH11:BQ11,$O11)<$AA11,$O11,0)","v":""},{"$f":"IF(COUNTIF($AH11:BR11,$O11)<$AA11,$O11,0)","v":""},{"$f":"IF(COUNTIF($AH11:BS11,$O11)<$AA11,$O11,0)","v":""},{"$f":"IF(COUNTIF($AH11:BT11,$O11)<$AA11,$O11,0)","v":""},-0.3,null,null,null,null,""]
[null,5,{"$f":"IF(OR('Measure Descriptions'!C12=\"\",'Measure Descriptions'!D12=\"\",'Measure Descriptions'!E12=\"\")=TRUE,\"\",'Measure Descriptions'!C12)","v":""},{"$f":"IF(OR('Measure Descriptions'!C12=\"\",'Measure Descriptions'!D12=\"\",'Measure Descriptions'!E12=\"\")=TRUE,\"\",'Measure Descriptions'!D12)","v":""},{"$f":"IF(OR('Measure Descriptions'!C12=\"\",'Measure Descriptions'!D12=\"\",'Measure Descriptions'!E12=\"\")=TRUE,\"\",'Measure Descriptions'!E12)","v":""},null,null,null,null,null,null,null,null,null,{"$f":"IF(E12=\"\",\"\",(G12+H12)*VLOOKUP(N12,'Utility Info'!$B$15:$G$19,5,FALSE)+(I12+J12)*'Utility Info'!$F$14)","v":""},0,"","",0,{"$f":"IFERROR(IF(F12=0,0,IF(OR(C12=\"Fuel Conversion\",Y12=\"Yes\")=TRUE,\"N/A\",'TRC Test'!K10/'TRC Test'!M10)),0)","v":0},{"$f":"'Measure QC'!H10","v":0},null,null,"",null,null,"","",null,"",null,null,0,"","",{"$f":"IF(COUNTIF($AH12:AI12,$O12)<$AA12,$O12,0)","v":""},{"$f":"IF(COUNTIF($AH12:AJ12,$O12)<$AA12,$O12,0)","v":""},{"$f":"IF(COUNTIF($AH12:AK12,$O12)<$AA12,$O12,0)","v":""},{"$f":"IF(COUNTIF($AH12:AL12,$O12)<$AA12,$O12,0)","v":""},{"$f":"IF(COUNTIF($AH12:AM12,$O12)<$AA12,$O12,0)","v":""},{"$f":"IF(COUNTIF($AH12:AN12,$O12)<$AA12,$O12,0)","v":""},{"$f":"IF(COUNTIF($AH12:AO12,$O12)<$AA12,$O12,0)","v":""},{"$f":"IF(COUNTIF($AH12:AP12,$O12)<$AA12,$O12,0)","v":""},{"$f":"IF(COUNTIF($AH12:AQ12,$O12)<$AA12,$O12,0)","v":""},{"$f":"IF(COUNTIF($AH12:AR12,$O12)<$AA12,$O12,0)","v":""},{"$f":"IF(COUNTIF($AH12:AS12,$O12)<$AA12,$O12,0)","v":""},{"$f":"IF(COUNTIF($AH12:AT12,$O12)<$AA12,$O12,0)","v":""},{"$f":"IF(COUNTIF($AH12:AU12,$O12)<$AA12,$O12,0)","v":""},{"$f":"IF(COUNTIF($AH12:AV12,$O12)<$AA12,$O12,0)","v":""},{"$f":"IF(COUNTIF($AH12:AW12,$O12)<$AA12,$O12,0)","v":""},{"$f":"IF(COUNTIF($AH12:AX12,$O12)<$AA12,$O12,0)","v":""},{"$f":"IF(COUNTIF($AH12:AY12,$O12)<$AA12,$O12,0)","v":""},{"$f":"IF(COUNTIF($AH12:AZ12,$O12)<$AA12,$O12,0)","v":""},{"$f":"IF(COUNTIF($AH12:BA12,$O12)<$AA12,$O12,0)","v":""},{"$f":"IF(COUNTIF($AH12:BB12,$O12)<$AA12,$O12,0)","v":""},{"$f":"IF(COUNTIF($AH12:BC12,$O12)<$AA12,$O12,0)","v":""},{"$f":"IF(COUNTIF($AH12:BD12,$O12)<$AA12,$O12,0)","v":""},{"$f":"IF(COUNTIF($AH12:BE12,$O12)<$AA12,$O12,0)","v":""},{"$f":"IF(COUNTIF($AH12:BF12,$O12)<$AA12,$O12,0)","v":""},{"$f":"IF(COUNTIF($AH12:BG12,$O12)<$AA12,$O12,0)","v":""},{"$f":"IF(COUNTIF($AH12:BH12,$O12)<$AA12,$O12,0)","v":""},{"$f":"IF(COUNTIF($AH12:BI12,$O12)<$AA12,$O12,0)","v":""},{"$f":"IF(COUNTIF($AH12:BJ12,$O12)<$AA12,$O12,0)","v":""},{"$f":"IF(COUNTIF($AH12:BK12,$O12)<$AA12,$O12,0)","v":""},{"$f":"IF(COUNTIF($AH12:BL12,$O12)<$AA12,$O12,0)","v":""},{"$f":"IF(COUNTIF($AH12:BM12,$O12)<$AA12,$O12,0)","v":""},{"$f":"IF(COUNTIF($AH12:BN12,$O12)<$AA12,$O12,0)","v":""},{"$f":"IF(COUNTIF($AH12:BO12,$O12)<$AA12,$O12,0)","v":""},{"$f":"IF(COUNTIF($AH12:BP12,$O12)<$AA12,$O12,0)","v":""},{"$f":"IF(COUNTIF($AH12:BQ12,$O12)<$AA12,$O12,0)","v":""},{"$f":"IF(COUNTIF($AH12:BR12,$O12)<$AA12,$O12,0)","v":""},{"$f":"IF(COUNTIF($AH12:BS12,$O12)<$AA12,$O12,0)","v":""},{"$f":"IF(COUNTIF($AH12:BT12,$O12)<$AA12,$O12,0)","v":""},-0.3,null,null,null,null,""]
[null,6,{"$f":"IF(OR('Measure Descriptions'!C13=\"\",'Measure Descriptions'!D13=\"\",'Measure Descriptions'!E13=\"\")=TRUE,\"\",'Measure Descriptions'!C13)","v":""},{"$f":"IF(OR('Measure Descriptions'!C13=\"\",'Measure Descriptions'!D13=\"\",'Measure Descriptions'!E13=\"\")=TRUE,\"\",'Measure Descriptions'!D13)","v":""},{"$f":"IF(OR('Measure Descriptions'!C13=\"\",'Measure Descriptions'!D13=\"\",'Measure Descriptions'!E13=\"\")=TRUE,\"\",'Measure Descriptions'!E13)","v":""},null,null,null,null,null,null,null,null,null,{"$f":"IF(E13=\"\",\"\",(G13+H13)*VLOOKUP(N13,'Utility Info'!$B$15:$G$19,5,FALSE)+(I13+J13)*'Utility Info'!$F$14)","v":""},0,"","",0,{"$f":"IFERROR(IF(F13=0,0,IF(OR(C13=\"Fuel Conversion\",Y13=\"Yes\")=TRUE,\"N/A\",'TRC Test'!K11/'TRC Test'!M11)),0)","v":0},{"$f":"'Measure QC'!H11","v":0},null,null,"",null,null,"","",null,"",null,null,0,"","",{"$f":"IF(COUNTIF($AH13:AI13,$O13)<$AA13,$O13,0)","v":""},{"$f":"IF(COUNTIF($AH13:AJ13,$O13)<$AA13,$O13,0)","v":""},{"$f":"IF(COUNTIF($AH13:AK13,$O13)<$AA13,$O13,0)","v":""},{"$f":"IF(COUNTIF($AH13:AL13,$O13)<$AA13,$O13,0)","v":""},{"$f":"IF(COUNTIF($AH13:AM13,$O13)<$AA13,$O13,0)","v":""},{"$f":"IF(COUNTIF($AH13:AN13,$O13)<$AA13,$O13,0)","v":""},{"$f":"IF(COUNTIF($AH13:AO13,$O13)<$AA13,$O13,0)","v":""},{"$f":"IF(COUNTIF($AH13:AP13,$O13)<$AA13,$O13,0)","v":""},{"$f":"IF(COUNTIF($AH13:AQ13,$O13)<$AA13,$O13,0)","v":""},{"$f":"IF(COUNTIF($AH13:AR13,$O13)<$AA13,$O13,0)","v":""},{"$f":"IF(COUNTIF($AH13:AS13,$O13)<$AA13,$O13,0)","v":""},{"$f":"IF(COUNTIF($AH13:AT13,$O13)<$AA13,$O13,0)","v":""},{"$f":"IF(COUNTIF($AH13:AU13,$O13)<$AA13,$O13,0)","v":""},{"$f":"IF(COUNTIF($AH13:AV13,$O13)<$AA13,$O13,0)","v":""},{"$f":"IF(COUNTIF($AH13:AW13,$O13)<$AA13,$O13,0)","v":""},{"$f":"IF(COUNTIF($AH13:AX13,$O13)<$AA13,$O13,0)","v":""},{"$f":"IF(COUNTIF($AH13:AY13,$O13)<$AA13,$O13,0)","v":""},{"$f":"IF(COUNTIF($AH13:AZ13,$O13)<$AA13,$O13,0)","v":""},{"$f":"IF(COUNTIF($AH13:BA13,$O13)<$AA13,$O13,0)","v":""},{"$f":"IF(COUNTIF($AH13:BB13,$O13)<$AA13,$O13,0)","v":""},{"$f":"IF(COUNTIF($AH13:BC13,$O13)<$AA13,$O13,0)","v":""},{"$f":"IF(COUNTIF($AH13:BD13,$O13)<$AA13,$O13,0)","v":""},{"$f":"IF(COUNTIF($AH13:BE13,$O13)<$AA13,$O13,0)","v":""},{"$f":"IF(COUNTIF($AH13:BF13,$O13)<$AA13,$O13,0)","v":""},{"$f":"IF(COUNTIF($AH13:BG13,$O13)<$AA13,$O13,0)","v":""},{"$f":"IF(COUNTIF($AH13:BH13,$O13)<$AA13,$O13,0)","v":""},{"$f":"IF(COUNTIF($AH13:BI13,$O13)<$AA13,$O13,0)","v":""},{"$f":"IF(COUNTIF($AH13:BJ13,$O13)<$AA13,$O13,0)","v":""},{"$f":"IF(COUNTIF($AH13:BK13,$O13)<$AA13,$O13,0)","v":""},{"$f":"IF(COUNTIF($AH13:BL13,$O13)<$AA13,$O13,0)","v":""},{"$f":"IF(COUNTIF($AH13:BM13,$O13)<$AA13,$O13,0)","v":""},{"$f":"IF(COUNTIF($AH13:BN13,$O13)<$AA13,$O13,0)","v":""},{"$f":"IF(COUNTIF($AH13:BO13,$O13)<$AA13,$O13,0)","v":""},{"$f":"IF(COUNTIF($AH13:BP13,$O13)<$AA13,$O13,0)","v":""},{"$f":"IF(COUNTIF($AH13:BQ13,$O13)<$AA13,$O13,0)","v":""},{"$f":"IF(COUNTIF($AH13:BR13,$O13)<$AA13,$O13,0)","v":""},{"$f":"IF(COUNTIF($AH13:BS13,$O13)<$AA13,$O13,0)","v":""},{"$f":"IF(COUNTIF($AH13:BT13,$O13)<$AA13,$O13,0)","v":""},-0.3,null,null,null,null,""]
[null,7,{"$f":"IF(OR('Measure Descriptions'!C14=\"\",'Measure Descriptions'!D14=\"\",'Measure Descriptions'!E14=\"\")=TRUE,\"\",'Measure Descriptions'!C14)","v":""},{"$f":"IF(OR('Measure Descriptions'!C14=\"\",'Measure Descriptions'!D14=\"\",'Measure Descriptions'!E14=\"\")=TRUE,\"\",'Measure Descriptions'!D14)","v":""},{"$f":"IF(OR('Measure Descriptions'!C14=\"\",'Measure Descriptions'!D14=\"\",'Measure Descriptions'!E14=\"\")=TRUE,\"\",'Measure Descriptions'!E14)","v":""},null,null,null,null,null,null,null,null,null,{"$f":"IF(E14=\"\",\"\",(G14+H14)*VLOOKUP(N14,'Utility Info'!$B$15:$G$19,5,FALSE)+(I14+J14)*'Utility Info'!$F$14)","v":""},0,"","",0,{"$f":"IFERROR(IF(F14=0,0,IF(OR(C14=\"Fuel Conversion\",Y14=\"Yes\")=TRUE,\"N/A\",'TRC Test'!K12/'TRC Test'!M12)),0)","v":0},{"$f":"'Measure QC'!H12","v":0},null,null,"",null,null,"","",null,"",null,null,0,"","",{"$f":"IF(COUNTIF($AH14:AI14,$O14)<$AA14,$O14,0)","v":""},{"$f":"IF(COUNTIF($AH14:AJ14,$O14)<$AA14,$O14,0)","v":""},{"$f":"IF(COUNTIF($AH14:AK14,$O14)<$AA14,$O14,0)","v":""},{"$f":"IF(COUNTIF($AH14:AL14,$O14)<$AA14,$O14,0)","v":""},{"$f":"IF(COUNTIF($AH14:AM14,$O14)<$AA14,$O14,0)","v":""},{"$f":"IF(COUNTIF($AH14:AN14,$O14)<$AA14,$O14,0)","v":""},{"$f":"IF(COUNTIF($AH14:AO14,$O14)<$AA14,$O14,0)","v":""},{"$f":"IF(COUNTIF($AH14:AP14,$O14)<$AA14,$O14,0)","v":""},{"$f":"IF(COUNTIF($AH14:AQ14,$O14)<$AA14,$O14,0)","v":""},{"$f":"IF(COUNTIF($AH14:AR14,$O14)<$AA14,$O14,0)","v":""},{"$f":"IF(COUNTIF($AH14:AS14,$O14)<$AA14,$O14,0)","v":""},{"$f":"IF(COUNTIF($AH14:AT14,$O14)<$AA14,$O14,0)","v":""},{"$f":"IF(COUNTIF($AH14:AU14,$O14)<$AA14,$O14,0)","v":""},{"$f":"IF(COUNTIF($AH14:AV14,$O14)<$AA14,$O14,0)","v":""},{"$f":"IF(COUNTIF($AH14:AW14,$O14)<$AA14,$O14,0)","v":""},{"$f":"IF(COUNTIF($AH14:AX14,$O14)<$AA14,$O14,0)","v":""},{"$f":"IF(COUNTIF($AH14:AY14,$O14)<$AA14,$O14,0)","v":""},{"$f":"IF(COUNTIF($AH14:AZ14,$O14)<$AA14,$O14,0)","v":""},{"$f":"IF(COUNTIF($AH14:BA14,$O14)<$AA14,$O14,0)","v":""},{"$f":"IF(COUNTIF($AH14:BB14,$O14)<$AA14,$O14,0)","v":""},{"$f":"IF(COUNTIF($AH14:BC14,$O14)<$AA14,$O14,0)","v":""},{"$f":"IF(COUNTIF($AH14:BD14,$O14)<$AA14,$O14,0)","v":""},{"$f":"IF(COUNTIF($AH14:BE14,$O14)<$AA14,$O14,0)","v":""},{"$f":"IF(COUNTIF($AH14:BF14,$O14)<$AA14,$O14,0)","v":""},{"$f":"IF(COUNTIF($AH14:BG14,$O14)<$AA14,$O14,0)","v":""},{"$f":"IF(COUNTIF($AH14:BH14,$O14)<$AA14,$O14,0)","v":""},{"$f":"IF(COUNTIF($AH14:BI14,$O14)<$AA14,$O14,0)","v":""},{"$f":"IF(COUNTIF($AH14:BJ14,$O14)<$AA14,$O14,0)","v":""},{"$f":"IF(COUNTIF($AH14:BK14,$O14)<$AA14,$O14,0)","v":""},{"$f":"IF(COUNTIF($AH14:BL14,$O14)<$AA14,$O14,0)","v":""},{"$f":"IF(COUNTIF($AH14:BM14,$O14)<$AA14,$O14,0)","v":""},{"$f":"IF(COUNTIF($AH14:BN14,$O14)<$AA14,$O14,0)","v":""},{"$f":"IF(COUNTIF($AH14:BO14,$O14)<$AA14,$O14,0)","v":""},{"$f":"IF(COUNTIF($AH14:BP14,$O14)<$AA14,$O14,0)","v":""},{"$f":"IF(COUNTIF($AH14:BQ14,$O14)<$AA14,$O14,0)","v":""},{"$f":"IF(COUNTIF($AH14:BR14,$O14)<$AA14,$O14,0)","v":""},{"$f":"IF(COUNTIF($AH14:BS14,$O14)<$AA14,$O14,0)","v":""},{"$f":"IF(COUNTIF($AH14:BT14,$O14)<$AA14,$O14,0)","v":""},-0.3,null,null,null,null,""]
[null,8,{"$f":"IF(OR('Measure Descriptions'!C15=\"\",'Measure Descriptions'!D15=\"\",'Measure Descriptions'!E15=\"\")=TRUE,\"\",'Measure Descriptions'!C15)","v":""},{"$f":"IF(OR('Measure Descriptions'!C15=\"\",'Measure Descriptions'!D15=\"\",'Measure Descriptions'!E15=\"\")=TRUE,\"\",'Measure Descriptions'!D15)","v":""},{"$f":"IF(OR('Measure Descriptions'!C15=\"\",'Measure Descriptions'!D15=\"\",'Measure Descriptions'!E15=\"\")=TRUE,\"\",'Measure Descriptions'!E15)","v":""},null,null,null,null,null,null,null,null,null,{"$f":"IF(E15=\"\",\"\",(G15+H15)*VLOOKUP(N15,'Utility Info'!$B$15:$G$19,5,FALSE)+(I15+J15)*'Utility Info'!$F$14)","v":""},0,"","",0,{"$f":"IFERROR(IF(F15=0,0,IF(OR(C15=\"Fuel Conversion\",Y15=\"Yes\")=TRUE,\"N/A\",'TRC Test'!K13/'TRC Test'!M13)),0)","v":0},{"$f":"'Measure QC'!H13","v":0},null,null,"",null,null,"","",null,"",null,null,0,"","",{"$f":"IF(COUNTIF($AH15:AI15,$O15)<$AA15,$O15,0)","v":""},{"$f":"IF(COUNTIF($AH15:AJ15,$O15)<$AA15,$O15,0)","v":""},{"$f":"IF(COUNTIF($AH15:AK15,$O15)<$AA15,$O15,0)","v":""},{"$f":"IF(COUNTIF($AH15:AL15,$O15)<$AA15,$O15,0)","v":""},{"$f":"IF(COUNTIF($AH15:AM15,$O15)<$AA15,$O15,0)","v":""},{"$f":"IF(COUNTIF($AH15:AN15,$O15)<$AA15,$O15,0)","v":""},{"$f":"IF(COUNTIF($AH15:AO15,$O15)<$AA15,$O15,0)","v":""},{"$f":"IF(COUNTIF($AH15:AP15,$O15)<$AA15,$O15,0)","v":""},{"$f":"IF(COUNTIF($AH15:AQ15,$O15)<$AA15,$O15,0)","v":""},{"$f":"IF(COUNTIF($AH15:AR15,$O15)<$AA15,$O15,0)","v":""},{"$f":"IF(COUNTIF($AH15:AS15,$O15)<$AA15,$O15,0)","v":""},{"$f":"IF(COUNTIF($AH15:AT15,$O15)<$AA15,$O15,0)","v":""},{"$f":"IF(COUNTIF($AH15:AU15,$O15)<$AA15,$O15,0)","v":""},{"$f":"IF(COUNTIF($AH15:AV15,$O15)<$AA15,$O15,0)","v":""},{"$f":"IF(COUNTIF($AH15:AW15,$O15)<$AA15,$O15,0)","v":""},{"$f":"IF(COUNTIF($AH15:AX15,$O15)<$AA15,$O15,0)","v":""},{"$f":"IF(COUNTIF($AH15:AY15,$O15)<$AA15,$O15,0)","v":""},{"$f":"IF(COUNTIF($AH15:AZ15,$O15)<$AA15,$O15,0)","v":""},{"$f":"IF(COUNTIF($AH15:BA15,$O15)<$AA15,$O15,0)","v":""},{"$f":"IF(COUNTIF($AH15:BB15,$O15)<$AA15,$O15,0)","v":""},{"$f":"IF(COUNTIF($AH15:BC15,$O15)<$AA15,$O15,0)","v":""},{"$f":"IF(COUNTIF($AH15:BD15,$O15)<$AA15,$O15,0)","v":""},{"$f":"IF(COUNTIF($AH15:BE15,$O15)<$AA15,$O15,0)","v":""},{"$f":"IF(COUNTIF($AH15:BF15,$O15)<$AA15,$O15,0)","v":""},{"$f":"IF(COUNTIF($AH15:BG15,$O15)<$AA15,$O15,0)","v":""},{"$f":"IF(COUNTIF($AH15:BH15,$O15)<$AA15,$O15,0)","v":""},{"$f":"IF(COUNTIF($AH15:BI15,$O15)<$AA15,$O15,0)","v":""},{"$f":"IF(COUNTIF($AH15:BJ15,$O15)<$AA15,$O15,0)","v":""},{"$f":"IF(COUNTIF($AH15:BK15,$O15)<$AA15,$O15,0)","v":""},{"$f":"IF(COUNTIF($AH15:BL15,$O15)<$AA15,$O15,0)","v":""},{"$f":"IF(COUNTIF($AH15:BM15,$O15)<$AA15,$O15,0)","v":""},{"$f":"IF(COUNTIF($AH15:BN15,$O15)<$AA15,$O15,0)","v":""},{"$f":"IF(COUNTIF($AH15:BO15,$O15)<$AA15,$O15,0)","v":""},{"$f":"IF(COUNTIF($AH15:BP15,$O15)<$AA15,$O15,0)","v":""},{"$f":"IF(COUNTIF($AH15:BQ15,$O15)<$AA15,$O15,0)","v":""},{"$f":"IF(COUNTIF($AH15:BR15,$O15)<$AA15,$O15,0)","v":""},{"$f":"IF(COUNTIF($AH15:BS15,$O15)<$AA15,$O15,0)","v":""},{"$f":"IF(COUNTIF($AH15:BT15,$O15)<$AA15,$O15,0)","v":""},-0.3,null,null,null,null,""]
[null,9,{"$f":"IF(OR('Measure Descriptions'!C16=\"\",'Measure Descriptions'!D16=\"\",'Measure Descriptions'!E16=\"\")=TRUE,\"\",'Measure Descriptions'!C16)","v":""},{"$f":"IF(OR('Measure Descriptions'!C16=\"\",'Measure Descriptions'!D16=\"\",'Measure Descriptions'!E16=\"\")=TRUE,\"\",'Measure Descriptions'!D16)","v":""},{"$f":"IF(OR('Measure Descriptions'!C16=\"\",'Measure Descriptions'!D16=\"\",'Measure Descriptions'!E16=\"\")=TRUE,\"\",'Measure Descriptions'!E16)","v":""},null,null,null,null,null,null,null,null,null,{"$f":"IF(E16=\"\",\"\",(G16+H16)*VLOOKUP(N16,'Utility Info'!$B$15:$G$19,5,FALSE)+(I16+J16)*'Utility Info'!$F$14)","v":""},0,"","",0,{"$f":"IFERROR(IF(F16=0,0,IF(OR(C16=\"Fuel Conversion\",Y16=\"Yes\")=TRUE,\"N/A\",'TRC Test'!K14/'TRC Test'!M14)),0)","v":0},{"$f":"'Measure QC'!H14","v":0},null,null,"",null,null,"","",null,"",null,null,0,"","",{"$f":"IF(COUNTIF($AH16:AI16,$O16)<$AA16,$O16,0)","v":""},{"$f":"IF(COUNTIF($AH16:AJ16,$O16)<$AA16,$O16,0)","v":""},{"$f":"IF(COUNTIF($AH16:AK16,$O16)<$AA16,$O16,0)","v":""},{"$f":"IF(COUNTIF($AH16:AL16,$O16)<$AA16,$O16,0)","v":""},{"$f":"IF(COUNTIF($AH16:AM16,$O16)<$AA16,$O16,0)","v":""},{"$f":"IF(COUNTIF($AH16:AN16,$O16)<$AA16,$O16,0)","v":""},{"$f":"IF(COUNTIF($AH16:AO16,$O16)<$AA16,$O16,0)","v":""},{"$f":"IF(COUNTIF($AH16:AP16,$O16)<$AA16,$O16,0)","v":""},{"$f":"IF(COUNTIF($AH16:AQ16,$O16)<$AA16,$O16,0)","v":""},{"$f":"IF(COUNTIF($AH16:AR16,$O16)<$AA16,$O16,0)","v":""},{"$f":"IF(COUNTIF($AH16:AS16,$O16)<$AA16,$O16,0)","v":""},{"$f":"IF(COUNTIF($AH16:AT16,$O16)<$AA16,$O16,0)","v":""},{"$f":"IF(COUNTIF($AH16:AU16,$O16)<$AA16,$O16,0)","v":""},{"$f":"IF(COUNTIF($AH16:AV16,$O16)<$AA16,$O16,0)","v":""},{"$f":"IF(COUNTIF($AH16:AW16,$O16)<$AA16,$O16,0)","v":""},{"$f":"IF(COUNTIF($AH16:AX16,$O16)<$AA16,$O16,0)","v":""},{"$f":"IF(COUNTIF($AH16:AY16,$O16)<$AA16,$O16,0)","v":""},{"$f":"IF(COUNTIF($AH16:AZ16,$O16)<$AA16,$O16,0)","v":""},{"$f":"IF(COUNTIF($AH16:BA16,$O16)<$AA16,$O16,0)","v":""},{"$f":"IF(COUNTIF($AH16:BB16,$O16)<$AA16,$O16,0)","v":""},{"$f":"IF(COUNTIF($AH16:BC16,$O16)<$AA16,$O16,0)","v":""},{"$f":"IF(COUNTIF($AH16:BD16,$O16)<$AA16,$O16,0)","v":""},{"$f":"IF(COUNTIF($AH16:BE16,$O16)<$AA16,$O16,0)","v":""},{"$f":"IF(COUNTIF($AH16:BF16,$O16)<$AA16,$O16,0)","v":""},{"$f":"IF(COUNTIF($AH16:BG16,$O16)<$AA16,$O16,0)","v":""},{"$f":"IF(COUNTIF($AH16:BH16,$O16)<$AA16,$O16,0)","v":""},{"$f":"IF(COUNTIF($AH16:BI16,$O16)<$AA16,$O16,0)","v":""},{"$f":"IF(COUNTIF($AH16:BJ16,$O16)<$AA16,$O16,0)","v":""},{"$f":"IF(COUNTIF($AH16:BK16,$O16)<$AA16,$O16,0)","v":""},{"$f":"IF(COUNTIF($AH16:BL16,$O16)<$AA16,$O16,0)","v":""},{"$f":"IF(COUNTIF($AH16:BM16,$O16)<$AA16,$O16,0)","v":""},{"$f":"IF(COUNTIF($AH16:BN16,$O16)<$AA16,$O16,0)","v":""},{"$f":"IF(COUNTIF($AH16:BO16,$O16)<$AA16,$O16,0)","v":""},{"$f":"IF(COUNTIF($AH16:BP16,$O16)<$AA16,$O16,0)","v":""},{"$f":"IF(COUNTIF($AH16:BQ16,$O16)<$AA16,$O16,0)","v":""},{"$f":"IF(COUNTIF($AH16:BR16,$O16)<$AA16,$O16,0)","v":""},{"$f":"IF(COUNTIF($AH16:BS16,$O16)<$AA16,$O16,0)","v":""},{"$f":"IF(COUNTIF($AH16:BT16,$O16)<$AA16,$O16,0)","v":""},-0.3,null,null,null,null,""]
[null,10,{"$f":"IF(OR('Measure Descriptions'!C17=\"\",'Measure Descriptions'!D17=\"\",'Measure Descriptions'!E17=\"\")=TRUE,\"\",'Measure Descriptions'!C17)","v":""},{"$f":"IF(OR('Measure Descriptions'!C17=\"\",'Measure Descriptions'!D17=\"\",'Measure Descriptions'!E17=\"\")=TRUE,\"\",'Measure Descriptions'!D17)","v":""},{"$f":"IF(OR('Measure Descriptions'!C17=\"\",'Measure Descriptions'!D17=\"\",'Measure Descriptions'!E17=\"\")=TRUE,\"\",'Measure Descriptions'!E17)","v":""},null,null,null,null,null,null,null,null,null,{"$f":"IF(E17=\"\",\"\",(G17+H17)*VLOOKUP(N17,'Utility Info'!$B$15:$G$19,5,FALSE)+(I17+J17)*'Utility Info'!$F$14)","v":""},0,"","",0,{"$f":"IFERROR(IF(F17=0,0,IF(OR(C17=\"Fuel Conversion\",Y17=\"Yes\")=TRUE,\"N/A\",'TRC Test'!K15/'TRC Test'!M15)),0)","v":0},{"$f":"'Measure QC'!H15","v":0},null,null,"",null,null,"","",null,"",null,null,0,"","",{"$f":"IF(COUNTIF($AH17:AI17,$O17)<$AA17,$O17,0)","v":""},{"$f":"IF(COUNTIF($AH17:AJ17,$O17)<$AA17,$O17,0)","v":""},{"$f":"IF(COUNTIF($AH17:AK17,$O17)<$AA17,$O17,0)","v":""},{"$f":"IF(COUNTIF($AH17:AL17,$O17)<$AA17,$O17,0)","v":""},{"$f":"IF(COUNTIF($AH17:AM17,$O17)<$AA17,$O17,0)","v":""},{"$f":"IF(COUNTIF($AH17:AN17,$O17)<$AA17,$O17,0)","v":""},{"$f":"IF(COUNTIF($AH17:AO17,$O17)<$AA17,$O17,0)","v":""},{"$f":"IF(COUNTIF($AH17:AP17,$O17)<$AA17,$O17,0)","v":""},{"$f":"IF(COUNTIF($AH17:AQ17,$O17)<$AA17,$O17,0)","v":""},{"$f":"IF(COUNTIF($AH17:AR17,$O17)<$AA17,$O17,0)","v":""},{"$f":"IF(COUNTIF($AH17:AS17,$O17)<$AA17,$O17,0)","v":""},{"$f":"IF(COUNTIF($AH17:AT17,$O17)<$AA17,$O17,0)","v":""},{"$f":"IF(COUNTIF($AH17:AU17,$O17)<$AA17,$O17,0)","v":""},{"$f":"IF(COUNTIF($AH17:AV17,$O17)<$AA17,$O17,0)","v":""},{"$f":"IF(COUNTIF($AH17:AW17,$O17)<$AA17,$O17,0)","v":""},{"$f":"IF(COUNTIF($AH17:AX17,$O17)<$AA17,$O17,0)","v":""},{"$f":"IF(COUNTIF($AH17:AY17,$O17)<$AA17,$O17,0)","v":""},{"$f":"IF(COUNTIF($AH17:AZ17,$O17)<$AA17,$O17,0)","v":""},{"$f":"IF(COUNTIF($AH17:BA17,$O17)<$AA17,$O17,0)","v":""},{"$f":"IF(COUNTIF($AH17:BB17,$O17)<$AA17,$O17,0)","v":""},{"$f":"IF(COUNTIF($AH17:BC17,$O17)<$AA17,$O17,0)","v":""},{"$f":"IF(COUNTIF($AH17:BD17,$O17)<$AA17,$O17,0)","v":""},{"$f":"IF(COUNTIF($AH17:BE17,$O17)<$AA17,$O17,0)","v":""},{"$f":"IF(COUNTIF($AH17:BF17,$O17)<$AA17,$O17,0)","v":""},{"$f":"IF(COUNTIF($AH17:BG17,$O17)<$AA17,$O17,0)","v":""},{"$f":"IF(COUNTIF($AH17:BH17,$O17)<$AA17,$O17,0)","v":""},{"$f":"IF(COUNTIF($AH17:BI17,$O17)<$AA17,$O17,0)","v":""},{"$f":"IF(COUNTIF($AH17:BJ17,$O17)<$AA17,$O17,0)","v":""},{"$f":"IF(COUNTIF($AH17:BK17,$O17)<$AA17,$O17,0)","v":""},{"$f":"IF(COUNTIF($AH17:BL17,$O17)<$AA17,$O17,0)","v":""},{"$f":"IF(COUNTIF($AH17:BM17,$O17)<$AA17,$O17,0)","v":""},{"$f":"IF(COUNTIF($AH17:BN17,$O17)<$AA17,$O17,0)","v":""},{"$f":"IF(COUNTIF($AH17:BO17,$O17)<$AA17,$O17,0)","v":""},{"$f":"IF(COUNTIF($AH17:BP17,$O17)<$AA17,$O17,0)","v":""},{"$f":"IF(COUNTIF($AH17:BQ17,$O17)<$AA17,$O17,0)","v":""},{"$f":"IF(COUNTIF($AH17:BR17,$O17)<$AA17,$O17,0)","v":""},{"$f":"IF(COUNTIF($AH17:BS17,$O17)<$AA17,$O17,0)","v":""},{"$f":"IF(COUNTIF($AH17:BT17,$O17)<$AA17,$O17,0)","v":""},-0.3,null,null,null,null,""]
[null,11,{"$f":"IF(OR('Measure Descriptions'!C18=\"\",'Measure Descriptions'!D18=\"\",'Measure Descriptions'!E18=\"\")=TRUE,\"\",'Measure Descriptions'!C18)","v":""},{"$f":"IF(OR('Measure Descriptions'!C18=\"\",'Measure Descriptions'!D18=\"\",'Measure Descriptions'!E18=\"\")=TRUE,\"\",'Measure Descriptions'!D18)","v":""},{"$f":"IF(OR('Measure Descriptions'!C18=\"\",'Measure Descriptions'!D18=\"\",'Measure Descriptions'!E18=\"\")=TRUE,\"\",'Measure Descriptions'!E18)","v":""},null,null,null,null,null,null,null,null,null,{"$f":"IF(E18=\"\",\"\",(G18+H18)*VLOOKUP(N18,'Utility Info'!$B$15:$G$19,5,FALSE)+(I18+J18)*'Utility Info'!$F$14)","v":""},0,"","",0,{"$f":"IFERROR(IF(F18=0,0,IF(OR(C18=\"Fuel Conversion\",Y18=\"Yes\")=TRUE,\"N/A\",'TRC Test'!K16/'TRC Test'!M16)),0)","v":0},{"$f":"'Measure QC'!H16","v":0},null,null,"",null,null,"","",null,"",null,null,0,"","",{"$f":"IF(COUNTIF($AH18:AI18,$O18)<$AA18,$O18,0)","v":""},{"$f":"IF(COUNTIF($AH18:AJ18,$O18)<$AA18,$O18,0)","v":""},{"$f":"IF(COUNTIF($AH18:AK18,$O18)<$AA18,$O18,0)","v":""},{"$f":"IF(COUNTIF($AH18:AL18,$O18)<$AA18,$O18,0)","v":""},{"$f":"IF(COUNTIF($AH18:AM18,$O18)<$AA18,$O18,0)","v":""},{"$f":"IF(COUNTIF($AH18:AN18,$O18)<$AA18,$O18,0)","v":""},{"$f":"IF(COUNTIF($AH18:AO18,$O18)<$AA18,$O18,0)","v":""},{"$f":"IF(COUNTIF($AH18:AP18,$O18)<$AA18,$O18,0)","v":""},{"$f":"IF(COUNTIF($AH18:AQ18,$O18)<$AA18,$O18,0)","v":""},{"$f":"IF(COUNTIF($AH18:AR18,$O18)<$AA18,$O18,0)","v":""},{"$f":"IF(COUNTIF($AH18:AS18,$O18)<$AA18,$O18,0)","v":""},{"$f":"IF(COUNTIF($AH18:AT18,$O18)<$AA18,$O18,0)","v":""},{"$f":"IF(COUNTIF($AH18:AU18,$O18)<$AA18,$O18,0)","v":""},{"$f":"IF(COUNTIF($AH18:AV18,$O18)<$AA18,$O18,0)","v":""},{"$f":"IF(COUNTIF($AH18:AW18,$O18)<$AA18,$O18,0)","v":""},{"$f":"IF(COUNTIF($AH18:AX18,$O18)<$AA18,$O18,0)","v":""},{"$f":"IF(COUNTIF($AH18:AY18,$O18)<$AA18,$O18,0)","v":""},{"$f":"IF(COUNTIF($AH18:AZ18,$O18)<$AA18,$O18,0)","v":""},{"$f":"IF(COUNTIF($AH18:BA18,$O18)<$AA18,$O18,0)","v":""},{"$f":"IF(COUNTIF($AH18:BB18,$O18)<$AA18,$O18,0)","v":""},{"$f":"IF(COUNTIF($AH18:BC18,$O18)<$AA18,$O18,0)","v":""},{"$f":"IF(COUNTIF($AH18:BD18,$O18)<$AA18,$O18,0)","v":""},{"$f":"IF(COUNTIF($AH18:BE18,$O18)<$AA18,$O18,0)","v":""},{"$f":"IF(COUNTIF($AH18:BF18,$O18)<$AA18,$O18,0)","v":""},{"$f":"IF(COUNTIF($AH18:BG18,$O18)<$AA18,$O18,0)","v":""},{"$f":"IF(COUNTIF($AH18:BH18,$O18)<$AA18,$O18,0)","v":""},{"$f":"IF(COUNTIF($AH18:BI18,$O18)<$AA18,$O18,0)","v":""},{"$f":"IF(COUNTIF($AH18:BJ18,$O18)<$AA18,$O18,0)","v":""},{"$f":"IF(COUNTIF($AH18:BK18,$O18)<$AA18,$O18,0)","v":""},{"$f":"IF(COUNTIF($AH18:BL18,$O18)<$AA18,$O18,0)","v":""},{"$f":"IF(COUNTIF($AH18:BM18,$O18)<$AA18,$O18,0)","v":""},{"$f":"IF(COUNTIF($AH18:BN18,$O18)<$AA18,$O18,0)","v":""},{"$f":"IF(COUNTIF($AH18:BO18,$O18)<$AA18,$O18,0)","v":""},{"$f":"IF(COUNTIF($AH18:BP18,$O18)<$AA18,$O18,0)","v":""},{"$f":"IF(COUNTIF($AH18:BQ18,$O18)<$AA18,$O18,0)","v":""},{"$f":"IF(COUNTIF($AH18:BR18,$O18)<$AA18,$O18,0)","v":""},{"$f":"IF(COUNTIF($AH18:BS18,$O18)<$AA18,$O18,0)","v":""},{"$f":"IF(COUNTIF($AH18:BT18,$O18)<$AA18,$O18,0)","v":""},-0.3,null,null,null,null,""]
[null,12,{"$f":"IF(OR('Measure Descriptions'!C19=\"\",'Measure Descriptions'!D19=\"\",'Measure Descriptions'!E19=\"\")=TRUE,\"\",'Measure Descriptions'!C19)","v":""},{"$f":"IF(OR('Measure Descriptions'!C19=\"\",'Measure Descriptions'!D19=\"\",'Measure Descriptions'!E19=\"\")=TRUE,\"\",'Measure Descriptions'!D19)","v":""},{"$f":"IF(OR('Measure Descriptions'!C19=\"\",'Measure Descriptions'!D19=\"\",'Measure Descriptions'!E19=\"\")=TRUE,\"\",'Measure Descriptions'!E19)","v":""},null,null,null,null,null,null,null,null,null,{"$f":"IF(E19=\"\",\"\",(G19+H19)*VLOOKUP(N19,'Utility Info'!$B$15:$G$19,5,FALSE)+(I19+J19)*'Utility Info'!$F$14)","v":""},0,"","",0,{"$f":"IFERROR(IF(F19=0,0,IF(OR(C19=\"Fuel Conversion\",Y19=\"Yes\")=TRUE,\"N/A\",'TRC Test'!K17/'TRC Test'!M17)),0)","v":0},{"$f":"'Measure QC'!H17","v":0},null,null,"",null,null,"","",null,"",null,null,0,"","",{"$f":"IF(COUNTIF($AH19:AI19,$O19)<$AA19,$O19,0)","v":""},{"$f":"IF(COUNTIF($AH19:AJ19,$O19)<$AA19,$O19,0)","v":""},{"$f":"IF(COUNTIF($AH19:AK19,$O19)<$AA19,$O19,0)","v":""},{"$f":"IF(COUNTIF($AH19:AL19,$O19)<$AA19,$O19,0)","v":""},{"$f":"IF(COUNTIF($AH19:AM19,$O19)<$AA19,$O19,0)","v":""},{"$f":"IF(COUNTIF($AH19:AN19,$O19)<$AA19,$O19,0)","v":""},{"$f":"IF(COUNTIF($AH19:AO19,$O19)<$AA19,$O19,0)","v":""},{"$f":"IF(COUNTIF($AH19:AP19,$O19)<$AA19,$O19,0)","v":""},{"$f":"IF(COUNTIF($AH19:AQ19,$O19)<$AA19,$O19,0)","v":""},{"$f":"IF(COUNTIF($AH19:AR19,$O19)<$AA19,$O19,0)","v":""},{"$f":"IF(COUNTIF($AH19:AS19,$O19)<$AA19,$O19,0)","v":""},{"$f":"IF(COUNTIF($AH19:AT19,$O19)<$AA19,$O19,0)","v":""},{"$f":"IF(COUNTIF($AH19:AU19,$O19)<$AA19,$O19,0)","v":""},{"$f":"IF(COUNTIF($AH19:AV19,$O19)<$AA19,$O19,0)","v":""},{"$f":"IF(COUNTIF($AH19:AW19,$O19)<$AA19,$O19,0)","v":""},{"$f":"IF(COUNTIF($AH19:AX19,$O19)<$AA19,$O19,0)","v":""},{"$f":"IF(COUNTIF($AH19:AY19,$O19)<$AA19,$O19,0)","v":""},{"$f":"IF(COUNTIF($AH19:AZ19,$O19)<$AA19,$O19,0)","v":""},{"$f":"IF(COUNTIF($AH19:BA19,$O19)<$AA19,$O19,0)","v":""},{"$f":"IF(COUNTIF($AH19:BB19,$O19)<$AA19,$O19,0)","v":""},{"$f":"IF(COUNTIF($AH19:BC19,$O19)<$AA19,$O19,0)","v":""},{"$f":"IF(COUNTIF($AH19:BD19,$O19)<$AA19,$O19,0)","v":""},{"$f":"IF(COUNTIF($AH19:BE19,$O19)<$AA19,$O19,0)","v":""},{"$f":"IF(COUNTIF($AH19:BF19,$O19)<$AA19,$O19,0)","v":""},{"$f":"IF(COUNTIF($AH19:BG19,$O19)<$AA19,$O19,0)","v":""},{"$f":"IF(COUNTIF($AH19:BH19,$O19)<$AA19,$O19,0)","v":""},{"$f":"IF(COUNTIF($AH19:BI19,$O19)<$AA19,$O19,0)","v":""},{"$f":"IF(COUNTIF($AH19:BJ19,$O19)<$AA19,$O19,0)","v":""},{"$f":"IF(COUNTIF($AH19:BK19,$O19)<$AA19,$O19,0)","v":""},{"$f":"IF(COUNTIF($AH19:BL19,$O19)<$AA19,$O19,0)","v":""},{"$f":"IF(COUNTIF($AH19:BM19,$O19)<$AA19,$O19,0)","v":""},{"$f":"IF(COUNTIF($AH19:BN19,$O19)<$AA19,$O19,0)","v":""},{"$f":"IF(COUNTIF($AH19:BO19,$O19)<$AA19,$O19,0)","v":""},{"$f":"IF(COUNTIF($AH19:BP19,$O19)<$AA19,$O19,0)","v":""},{"$f":"IF(COUNTIF($AH19:BQ19,$O19)<$AA19,$O19,0)","v":""},{"$f":"IF(COUNTIF($AH19:BR19,$O19)<$AA19,$O19,0)","v":""},{"$f":"IF(COUNTIF($AH19:BS19,$O19)<$AA19,$O19,0)","v":""},{"$f":"IF(COUNTIF($AH19:BT19,$O19)<$AA19,$O19,0)","v":""},-0.3,null,null,null,null,""]
[null,13,{"$f":"IF(OR('Measure Descriptions'!C20=\"\",'Measure Descriptions'!D20=\"\",'Measure Descriptions'!E20=\"\")=TRUE,\"\",'Measure Descriptions'!C20)","v":""},{"$f":"IF(OR('Measure Descriptions'!C20=\"\",'Measure Descriptions'!D20=\"\",'Measure Descriptions'!E20=\"\")=TRUE,\"\",'Measure Descriptions'!D20)","v":""},{"$f":"IF(OR('Measure Descriptions'!C20=\"\",'Measure Descriptions'!D20=\"\",'Measure Descriptions'!E20=\"\")=TRUE,\"\",'Measure Descriptions'!E20)","v":""},null,null,null,null,null,null,null,null,null,{"$f":"IF(E20=\"\",\"\",(G20+H20)*VLOOKUP(N20,'Utility Info'!$B$15:$G$19,5,FALSE)+(I20+J20)*'Utility Info'!$F$14)","v":""},0,"","",0,{"$f":"IFERROR(IF(F20=0,0,IF(OR(C20=\"Fuel Conversion\",Y20=\"Yes\")=TRUE,\"N/A\",'TRC Test'!K18/'TRC Test'!M18)),0)","v":0},{"$f":"'Measure QC'!H18","v":0},null,null,"",null,null,"","",null,"",null,null,0,"","",{"$f":"IF(COUNTIF($AH20:AI20,$O20)<$AA20,$O20,0)","v":""},{"$f":"IF(COUNTIF($AH20:AJ20,$O20)<$AA20,$O20,0)","v":""},{"$f":"IF(COUNTIF($AH20:AK20,$O20)<$AA20,$O20,0)","v":""},{"$f":"IF(COUNTIF($AH20:AL20,$O20)<$AA20,$O20,0)","v":""},{"$f":"IF(COUNTIF($AH20:AM20,$O20)<$AA20,$O20,0)","v":""},{"$f":"IF(COUNTIF($AH20:AN20,$O20)<$AA20,$O20,0)","v":""},{"$f":"IF(COUNTIF($AH20:AO20,$O20)<$AA20,$O20,0)","v":""},{"$f":"IF(COUNTIF($AH20:AP20,$O20)<$AA20,$O20,0)","v":""},{"$f":"IF(COUNTIF($AH20:AQ20,$O20)<$AA20,$O20,0)","v":""},{"$f":"IF(COUNTIF($AH20:AR20,$O20)<$AA20,$O20,0)","v":""},{"$f":"IF(COUNTIF($AH20:AS20,$O20)<$AA20,$O20,0)","v":""},{"$f":"IF(COUNTIF($AH20:AT20,$O20)<$AA20,$O20,0)","v":""},{"$f":"IF(COUNTIF($AH20:AU20,$O20)<$AA20,$O20,0)","v":""},{"$f":"IF(COUNTIF($AH20:AV20,$O20)<$AA20,$O20,0)","v":""},{"$f":"IF(COUNTIF($AH20:AW20,$O20)<$AA20,$O20,0)","v":""},{"$f":"IF(COUNTIF($AH20:AX20,$O20)<$AA20,$O20,0)","v":""},{"$f":"IF(COUNTIF($AH20:AY20,$O20)<$AA20,$O20,0)","v":""},{"$f":"IF(COUNTIF($AH20:AZ20,$O20)<$AA20,$O20,0)","v":""},{"$f":"IF(COUNTIF($AH20:BA20,$O20)<$AA20,$O20,0)","v":""},{"$f":"IF(COUNTIF($AH20:BB20,$O20)<$AA20,$O20,0)","v":""},{"$f":"IF(COUNTIF($AH20:BC20,$O20)<$AA20,$O20,0)","v":""},{"$f":"IF(COUNTIF($AH20:BD20,$O20)<$AA20,$O20,0)","v":""},{"$f":"IF(COUNTIF($AH20:BE20,$O20)<$AA20,$O20,0)","v":""},{"$f":"IF(COUNTIF($AH20:BF20,$O20)<$AA20,$O20,0)","v":""},{"$f":"IF(COUNTIF($AH20:BG20,$O20)<$AA20,$O20,0)","v":""},{"$f":"IF(COUNTIF($AH20:BH20,$O20)<$AA20,$O20,0)","v":""},{"$f":"IF(COUNTIF($AH20:BI20,$O20)<$AA20,$O20,0)","v":""},{"$f":"IF(COUNTIF($AH20:BJ20,$O20)<$AA20,$O20,0)","v":""},{"$f":"IF(COUNTIF($AH20:BK20,$O20)<$AA20,$O20,0)","v":""},{"$f":"IF(COUNTIF($AH20:BL20,$O20)<$AA20,$O20,0)","v":""},{"$f":"IF(COUNTIF($AH20:BM20,$O20)<$AA20,$O20,0)","v":""},{"$f":"IF(COUNTIF($AH20:BN20,$O20)<$AA20,$O20,0)","v":""},{"$f":"IF(COUNTIF($AH20:BO20,$O20)<$AA20,$O20,0)","v":""},{"$f":"IF(COUNTIF($AH20:BP20,$O20)<$AA20,$O20,0)","v":""},{"$f":"IF(COUNTIF($AH20:BQ20,$O20)<$AA20,$O20,0)","v":""},{"$f":"IF(COUNTIF($AH20:BR20,$O20)<$AA20,$O20,0)","v":""},{"$f":"IF(COUNTIF($AH20:BS20,$O20)<$AA20,$O20,0)","v":""},{"$f":"IF(COUNTIF($AH20:BT20,$O20)<$AA20,$O20,0)","v":""},-0.3,null,null,null,null,""]
[null,14,{"$f":"IF(OR('Measure Descriptions'!C21=\"\",'Measure Descriptions'!D21=\"\",'Measure Descriptions'!E21=\"\")=TRUE,\"\",'Measure Descriptions'!C21)","v":""},{"$f":"IF(OR('Measure Descriptions'!C21=\"\",'Measure Descriptions'!D21=\"\",'Measure Descriptions'!E21=\"\")=TRUE,\"\",'Measure Descriptions'!D21)","v":""},{"$f":"IF(OR('Measure Descriptions'!C21=\"\",'Measure Descriptions'!D21=\"\",'Measure Descriptions'!E21=\"\")=TRUE,\"\",'Measure Descriptions'!E21)","v":""},null,null,null,null,null,null,null,null,null,{"$f":"IF(E21=\"\",\"\",(G21+H21)*VLOOKUP(N21,'Utility Info'!$B$15:$G$19,5,FALSE)+(I21+J21)*'Utility Info'!$F$14)","v":""},0,"","",0,{"$f":"IFERROR(IF(F21=0,0,IF(OR(C21=\"Fuel Conversion\",Y21=\"Yes\")=TRUE,\"N/A\",'TRC Test'!K19/'TRC Test'!M19)),0)","v":0},{"$f":"'Measure QC'!H19","v":0},null,null,"",null,null,"","",null,"",null,null,0,"","",{"$f":"IF(COUNTIF($AH21:AI21,$O21)<$AA21,$O21,0)","v":""},{"$f":"IF(COUNTIF($AH21:AJ21,$O21)<$AA21,$O21,0)","v":""},{"$f":"IF(COUNTIF($AH21:AK21,$O21)<$AA21,$O21,0)","v":""},{"$f":"IF(COUNTIF($AH21:AL21,$O21)<$AA21,$O21,0)","v":""},{"$f":"IF(COUNTIF($AH21:AM21,$O21)<$AA21,$O21,0)","v":""},{"$f":"IF(COUNTIF($AH21:AN21,$O21)<$AA21,$O21,0)","v":""},{"$f":"IF(COUNTIF($AH21:AO21,$O21)<$AA21,$O21,0)","v":""},{"$f":"IF(COUNTIF($AH21:AP21,$O21)<$AA21,$O21,0)","v":""},{"$f":"IF(COUNTIF($AH21:AQ21,$O21)<$AA21,$O21,0)","v":""},{"$f":"IF(COUNTIF($AH21:AR21,$O21)<$AA21,$O21,0)","v":""},{"$f":"IF(COUNTIF($AH21:AS21,$O21)<$AA21,$O21,0)","v":""},{"$f":"IF(COUNTIF($AH21:AT21,$O21)<$AA21,$O21,0)","v":""},{"$f":"IF(COUNTIF($AH21:AU21,$O21)<$AA21,$O21,0)","v":""},{"$f":"IF(COUNTIF($AH21:AV21,$O21)<$AA21,$O21,0)","v":""},{"$f":"IF(COUNTIF($AH21:AW21,$O21)<$AA21,$O21,0)","v":""},{"$f":"IF(COUNTIF($AH21:AX21,$O21)<$AA21,$O21,0)","v":""},{"$f":"IF(COUNTIF($AH21:AY21,$O21)<$AA21,$O21,0)","v":""},{"$f":"IF(COUNTIF($AH21:AZ21,$O21)<$AA21,$O21,0)","v":""},{"$f":"IF(COUNTIF($AH21:BA21,$O21)<$AA21,$O21,0)","v":""},{"$f":"IF(COUNTIF($AH21:BB21,$O21)<$AA21,$O21,0)","v":""},{"$f":"IF(COUNTIF($AH21:BC21,$O21)<$AA21,$O21,0)","v":""},{"$f":"IF(COUNTIF($AH21:BD21,$O21)<$AA21,$O21,0)","v":""},{"$f":"IF(COUNTIF($AH21:BE21,$O21)<$AA21,$O21,0)","v":""},{"$f":"IF(COUNTIF($AH21:BF21,$O21)<$AA21,$O21,0)","v":""},{"$f":"IF(COUNTIF($AH21:BG21,$O21)<$AA21,$O21,0)","v":""},{"$f":"IF(COUNTIF($AH21:BH21,$O21)<$AA21,$O21,0)","v":""},{"$f":"IF(COUNTIF($AH21:BI21,$O21)<$AA21,$O21,0)","v":""},{"$f":"IF(COUNTIF($AH21:BJ21,$O21)<$AA21,$O21,0)","v":""},{"$f":"IF(COUNTIF($AH21:BK21,$O21)<$AA21,$O21,0)","v":""},{"$f":"IF(COUNTIF($AH21:BL21,$O21)<$AA21,$O21,0)","v":""},{"$f":"IF(COUNTIF($AH21:BM21,$O21)<$AA21,$O21,0)","v":""},{"$f":"IF(COUNTIF($AH21:BN21,$O21)<$AA21,$O21,0)","v":""},{"$f":"IF(COUNTIF($AH21:BO21,$O21)<$AA21,$O21,0)","v":""},{"$f":"IF(COUNTIF($AH21:BP21,$O21)<$AA21,$O21,0)","v":""},{"$f":"IF(COUNTIF($AH21:BQ21,$O21)<$AA21,$O21,0)","v":""},{"$f":"IF(COUNTIF($AH21:BR21,$O21)<$AA21,$O21,0)","v":""},{"$f":"IF(COUNTIF($AH21:BS21,$O21)<$AA21,$O21,0)","v":""},{"$f":"IF(COUNTIF($AH21:BT21,$O21)<$AA21,$O21,0)","v":""},-0.3,null,null,null,null,""]
[null,15,{"$f":"IF(OR('Measure Descriptions'!C22=\"\",'Measure Descriptions'!D22=\"\",'Measure Descriptions'!E22=\"\")=TRUE,\"\",'Measure Descriptions'!C22)","v":""},{"$f":"IF(OR('Measure Descriptions'!C22=\"\",'Measure Descriptions'!D22=\"\",'Measure Descriptions'!E22=\"\")=TRUE,\"\",'Measure Descriptions'!D22)","v":""},{"$f":"IF(OR('Measure Descriptions'!C22=\"\",'Measure Descriptions'!D22=\"\",'Measure Descriptions'!E22=\"\")=TRUE,\"\",'Measure Descriptions'!E22)","v":""},null,null,null,null,null,null,null,null,null,{"$f":"IF(E22=\"\",\"\",(G22+H22)*VLOOKUP(N22,'Utility Info'!$B$15:$G$19,5,FALSE)+(I22+J22)*'Utility Info'!$F$14)","v":""},0,"","",0,{"$f":"IFERROR(IF(F22=0,0,IF(OR(C22=\"Fuel Conversion\",Y22=\"Yes\")=TRUE,\"N/A\",'TRC Test'!K20/'TRC Test'!M20)),0)","v":0},{"$f":"'Measure QC'!H20","v":0},null,null,"",null,null,"","",null,"",null,null,0,"","",{"$f":"IF(COUNTIF($AH22:AI22,$O22)<$AA22,$O22,0)","v":""},{"$f":"IF(COUNTIF($AH22:AJ22,$O22)<$AA22,$O22,0)","v":""},{"$f":"IF(COUNTIF($AH22:AK22,$O22)<$AA22,$O22,0)","v":""},{"$f":"IF(COUNTIF($AH22:AL22,$O22)<$AA22,$O22,0)","v":""},{"$f":"IF(COUNTIF($AH22:AM22,$O22)<$AA22,$O22,0)","v":""},{"$f":"IF(COUNTIF($AH22:AN22,$O22)<$AA22,$O22,0)","v":""},{"$f":"IF(COUNTIF($AH22:AO22,$O22)<$AA22,$O22,0)","v":""},{"$f":"IF(COUNTIF($AH22:AP22,$O22)<$AA22,$O22,0)","v":""},{"$f":"IF(COUNTIF($AH22:AQ22,$O22)<$AA22,$O22,0)","v":""},{"$f":"IF(COUNTIF($AH22:AR22,$O22)<$AA22,$O22,0)","v":""},{"$f":"IF(COUNTIF($AH22:AS22,$O22)<$AA22,$O22,0)","v":""},{"$f":"IF(COUNTIF($AH22:AT22,$O22)<$AA22,$O22,0)","v":""},{"$f":"IF(COUNTIF($AH22:AU22,$O22)<$AA22,$O22,0)","v":""},{"$f":"IF(COUNTIF($AH22:AV22,$O22)<$AA22,$O22,0)","v":""},{"$f":"IF(COUNTIF($AH22:AW22,$O22)<$AA22,$O22,0)","v":""},{"$f":"IF(COUNTIF($AH22:AX22,$O22)<$AA22,$O22,0)","v":""},{"$f":"IF(COUNTIF($AH22:AY22,$O22)<$AA22,$O22,0)","v":""},{"$f":"IF(COUNTIF($AH22:AZ22,$O22)<$AA22,$O22,0)","v":""},{"$f":"IF(COUNTIF($AH22:BA22,$O22)<$AA22,$O22,0)","v":""},{"$f":"IF(COUNTIF($AH22:BB22,$O22)<$AA22,$O22,0)","v":""},{"$f":"IF(COUNTIF($AH22:BC22,$O22)<$AA22,$O22,0)","v":""},{"$f":"IF(COUNTIF($AH22:BD22,$O22)<$AA22,$O22,0)","v":""},{"$f":"IF(COUNTIF($AH22:BE22,$O22)<$AA22,$O22,0)","v":""},{"$f":"IF(COUNTIF($AH22:BF22,$O22)<$AA22,$O22,0)","v":""},{"$f":"IF(COUNTIF($AH22:BG22,$O22)<$AA22,$O22,0)","v":""},{"$f":"IF(COUNTIF($AH22:BH22,$O22)<$AA22,$O22,0)","v":""},{"$f":"IF(COUNTIF($AH22:BI22,$O22)<$AA22,$O22,0)","v":""},{"$f":"IF(COUNTIF($AH22:BJ22,$O22)<$AA22,$O22,0)","v":""},{"$f":"IF(COUNTIF($AH22:BK22,$O22)<$AA22,$O22,0)","v":""},{"$f":"IF(COUNTIF($AH22:BL22,$O22)<$AA22,$O22,0)","v":""},{"$f":"IF(COUNTIF($AH22:BM22,$O22)<$AA22,$O22,0)","v":""},{"$f":"IF(COUNTIF($AH22:BN22,$O22)<$AA22,$O22,0)","v":""},{"$f":"IF(COUNTIF($AH22:BO22,$O22)<$AA22,$O22,0)","v":""},{"$f":"IF(COUNTIF($AH22:BP22,$O22)<$AA22,$O22,0)","v":""},{"$f":"IF(COUNTIF($AH22:BQ22,$O22)<$AA22,$O22,0)","v":""},{"$f":"IF(COUNTIF($AH22:BR22,$O22)<$AA22,$O22,0)","v":""},{"$f":"IF(COUNTIF($AH22:BS22,$O22)<$AA22,$O22,0)","v":""},{"$f":"IF(COUNTIF($AH22:BT22,$O22)<$AA22,$O22,0)","v":""},-0.3,null,null,null,null,""]
[null,"Measures to be undertaken by building - Savings accrue to tenants"]
[null,16,{"$f":"IF(OR('Measure Descriptions'!C24=\"\",'Measure Descriptions'!D24=\"\",'Measure Descriptions'!E24=\"\")=TRUE,\"\",'Measure Descriptions'!C24)","v":""},{"$f":"IF(OR('Measure Descriptions'!C24=\"\",'Measure Descriptions'!D24=\"\",'Measure Descriptions'!E24=\"\")=TRUE,\"\",'Measure Descriptions'!D24)","v":""},{"$f":"IF(OR('Measure Descriptions'!C24=\"\",'Measure Descriptions'!D24=\"\",'Measure Descriptions'!E24=\"\")=TRUE,\"\",'Measure Descriptions'!E24)","v":""},null,null,null,null,null,null,null,null,null,{"$f":"IF(E24=\"\",\"\",(G24+H24)*VLOOKUP(N24,'Utility Info'!$B$15:$G$19,5,FALSE)+(I24+J24)*'Utility Info'!$F$14)","v":""},0,{"$f":"IF(N(O24)=0,\"\",F24/O24)","v":""},"",{"$f":"IFERROR(IFERROR(IF(O24=0,0,(IRR(AG24:BU24,BV24))),IF(O24=0,0,(IRR(AG24:BU24,10%)))),0)","v":0},{"$f":"IFERROR(IF(F24=0,0,IF(OR(C24=\"Fuel Conversion\",Y24=\"Yes\")=TRUE,\"N/A\",'TRC Test'!K22/'TRC Test'!M22)),0)","v":0},{"$f":"'Measure QC'!H22","v":0},null,null,{"$f":"IFERROR(IF(E24=\"\",\"\",IF(VLOOKUP(E24,MeasureQCData,2,FALSE)=\"\",\"\",VLOOKUP(E24,MeasureQCData,2,FALSE))),\"\")","v":""},null,null,{"$f":"IFERROR(IF(E24=\"\",\"\",IF(VLOOKUP(E24,MeasureQCData,3,FALSE)=\"\",\"\",VLOOKUP(E24,MeasureQCData,3,FALSE))),\"\")","v":""},{"$f":"IFERROR(IF(E24=\"\",\"\",IF(VLOOKUP(E24,MeasureQCData,27,FALSE)=\"\",\"\",VLOOKUP(E24,MeasureQCData,27,FALSE))),\"\")","v":""},null,{"$f":"IFERROR(IF(E24=\"\",\"\",-PV($Y$42,AA24,O24)-F24),\"\")","v":""},null,null,{"$f":"-F24","v":0},{"$f":"O24","v":""},{"$f":"IF(COUNTIF(AH24,O24)<AA24,O24,0)","v":""},{"$f":"IF(COUNTIF($AH24:AI24,$O24)<$AA24,$O24,0)","v":""},{"$f":"IF(COUNTIF($AH24:AJ24,$O24)<$AA24,$O24,0)","v":""},{"$f":"IF(COUNTIF($AH24:AK24,$O24)<$AA24,$O24,0)","v":""},{"$f":"IF(COUNTIF($AH24:AL24,$O24)<$AA24,$O24,0)","v":""},{"$f":"IF(COUNTIF($AH24:AM24,$O24)<$AA24,$O24,0)","v":""},{"$f":"IF(COUNTIF($AH24:AN24,$O24)<$AA24,$O24,0)","v":""},{"$f":"IF(COUNTIF($AH24:AO24,$O24)<$AA24,$O24,0)","v":""},{"$f":"IF(COUNTIF($AH24:AP24,$O24)<$AA24,$O24,0)","v":""},{"$f":"IF(COUNTIF($AH24:AQ24,$O24)<$AA24,$O24,0)","v":""},{"$f":"IF(COUNTIF($AH24:AR24,$O24)<$AA24,$O24,0)","v":""},{"$f":"IF(COUNTIF($AH24:AS24,$O24)<$AA24,$O24,0)","v":""},{"$f":"IF(COUNTIF($AH24:AT24,$O24)<$AA24,$O24,0)","v":""},{"$f":"IF(COUNTIF($AH24:AU24,$O24)<$AA24,$O24,0)","v":""},{"$f":"IF(COUNTIF($AH24:AV24,$O24)<$AA24,$O24,0)","v":""},{"$f":"IF(COUNTIF($AH24:AW24,$O24)<$AA24,$O24,0)","v":""},{"$f":"IF(COUNTIF($AH24:AX24,$O24)<$AA24,$O24,0)","v":""},{"$f":"IF(COUNTIF($AH24:AY24,$O24)<$AA24,$O24,0)","v":""},{"$f":"IF(COUNTIF($AH24:AZ24,$O24)<$AA24,$O24,0)","v":""},{"$f":"IF(COUNTIF($AH24:BA24,$O24)<$AA24,$O24,0)","v":""},{"$f":"IF(COUNTIF($AH24:BB24,$O24)<$AA24,$O24,0)","v":""},{"$f":"IF(COUNTIF($AH24:BC24,$O24)<$AA24,$O24,0)","v":""},{"$f":"IF(COUNTIF($AH24:BD24,$O24)<$AA24,$O24,0)","v":""},{"$f":"IF(COUNTIF($AH24:BE24,$O24)<$AA24,$O24,0)","v":""},{"$f":"IF(COUNTIF($AH24:BF24,$O24)<$AA24,$O24,0)","v":""},{"$f":"IF(COUNTIF($AH24:BG24,$O24)<$AA24,$O24,0)","v":""},{"$f":"IF(COUNTIF($AH24:BH24,$O24)<$AA24,$O24,0)","v":""},{"$f":"IF(COUNTIF($AH24:BI24,$O24)<$AA24,$O24,0)","v":""},{"$f":"IF(COUNTIF($AH24:BJ24,$O24)<$AA24,$O24,0)","v":""},{"$f":"IF(COUNTIF($AH24:BK24,$O24)<$AA24,$O24,0)","v":""},{"$f":"IF(COUNTIF($AH24:BL24,$O24)<$AA24,$O24,0)","v":""},{"$f":"IF(COUNTIF($AH24:BM24,$O24)<$AA24,$O24,0)","v":""},{"$f":"IF(COUNTIF($AH24:BN24,$O24)<$AA24,$O24,0)","v":""},{"$f":"IF(COUNTIF($AH24:BO24,$O24)<$AA24,$O24,0)","v":""},{"$f":"IF(COUNTIF($AH24:BP24,$O24)<$AA24,$O24,0)","v":""},{"$f":"IF(COUNTIF($AH24:BQ24,$O24)<$AA24,$O24,0)","v":""},{"$f":"IF(COUNTIF($AH24:BR24,$O24)<$AA24,$O24,0)","v":""},{"$f":"IF(COUNTIF($AH24:BS24,$O24)<$AA24,$O24,0)","v":""},{"$f":"IF(COUNTIF($AH24:BT24,$O24)<$AA24,$O24,0)","v":""},-0.3,null,null,null,null,{"$f":"IF(C24=\"\",\"\",IF(OR(F24=\"\",G24=\"\",H24=\"\",I24=\"\",J24=\"\",K24=\"\",L24=\"\",M24=\"\",O24=\"\",W24=\"\",X24=\"\",N24=\"\",N24=\"\",Y24=\"\",Z24=\"\",AA24=\"\",AND(AB24=\"Inc\",AC24=\"\")=TRUE)=TRUE,\"ERR\",\"\"))","v":""}]
[null,17,{"$f":"IF(OR('Measure Descriptions'!C25=\"\",'Measure Descriptions'!D25=\"\",'Measure Descriptions'!E25=\"\")=TRUE,\"\",'Measure Descriptions'!C25)","v":""},{"$f":"IF(OR('Measure Descriptions'!C25=\"\",'Measure Descriptions'!D25=\"\",'Measure Descriptions'!E25=\"\")=TRUE,\"\",'Measure Descriptions'!D25)","v":""},{"$f":"IF(OR('Measure Descriptions'!C25=\"\",'Measure Descriptions'!D25=\"\",'Measure Descriptions'!E25=\"\")=TRUE,\"\",'Measure Descriptions'!E25)","v":""},null,null,null,null,null,null,null,null,null,{"$f":"IF(E25=\"\",\"\",(G25+H25)*VLOOKUP(N25,'Utility Info'!$B$15:$G$19,5,FALSE)+(I25+J25)*'Utility Info'!$F$14)","v":""},0,{"$f":"IF(N(O25)=0,\"\",F25/O25)","v":""},"",0,{"$f":"IFERROR(IF(F25=0,0,IF(OR(C25=\"Fuel Conversion\",Y25=\"Yes\")=TRUE,\"N/A\",'TRC Test'!K23/'TRC Test'!M23)),0)","v":0},{"$f":"'Measure QC'!H23","v":0},null,null,"",null,null,"","",null,"",null,null,0,"","",{"$f":"IF(COUNTIF($AH25:AI25,$O25)<$AA25,$O25,0)","v":""},{"$f":"IF(COUNTIF($AH25:AJ25,$O25)<$AA25,$O25,0)","v":""},{"$f":"IF(COUNTIF($AH25:AK25,$O25)<$AA25,$O25,0)","v":""},{"$f":"IF(COUNTIF($AH25:AL25,$O25)<$AA25,$O25,0)","v":""},{"$f":"IF(COUNTIF($AH25:AM25,$O25)<$AA25,$O25,0)","v":""},{"$f":"IF(COUNTIF($AH25:AN25,$O25)<$AA25,$O25,0)","v":""},{"$f":"IF(COUNTIF($AH25:AO25,$O25)<$AA25,$O25,0)","v":""},{"$f":"IF(COUNTIF($AH25:AP25,$O25)<$AA25,$O25,0)","v":""},{"$f":"IF(COUNTIF($AH25:AQ25,$O25)<$AA25,$O25,0)","v":""},{"$f":"IF(COUNTIF($AH25:AR25,$O25)<$AA25,$O25,0)","v":""},{"$f":"IF(COUNTIF($AH25:AS25,$O25)<$AA25,$O25,0)","v":""},{"$f":"IF(COUNTIF($AH25:AT25,$O25)<$AA25,$O25,0)","v":""},{"$f":"IF(COUNTIF($AH25:AU25,$O25)<$AA25,$O25,0)","v":""},{"$f":"IF(COUNTIF($AH25:AV25,$O25)<$AA25,$O25,0)","v":""},{"$f":"IF(COUNTIF($AH25:AW25,$O25)<$AA25,$O25,0)","v":""},{"$f":"IF(COUNTIF($AH25:AX25,$O25)<$AA25,$O25,0)","v":""},{"$f":"IF(COUNTIF($AH25:AY25,$O25)<$AA25,$O25,0)","v":""},{"$f":"IF(COUNTIF($AH25:AZ25,$O25)<$AA25,$O25,0)","v":""},{"$f":"IF(COUNTIF($AH25:BA25,$O25)<$AA25,$O25,0)","v":""},{"$f":"IF(COUNTIF($AH25:BB25,$O25)<$AA25,$O25,0)","v":""},{"$f":"IF(COUNTIF($AH25:BC25,$O25)<$AA25,$O25,0)","v":""},{"$f":"IF(COUNTIF($AH25:BD25,$O25)<$AA25,$O25,0)","v":""},{"$f":"IF(COUNTIF($AH25:BE25,$O25)<$AA25,$O25,0)","v":""},{"$f":"IF(COUNTIF($AH25:BF25,$O25)<$AA25,$O25,0)","v":""},{"$f":"IF(COUNTIF($AH25:BG25,$O25)<$AA25,$O25,0)","v":""},{"$f":"IF(COUNTIF($AH25:BH25,$O25)<$AA25,$O25,0)","v":""},{"$f":"IF(COUNTIF($AH25:BI25,$O25)<$AA25,$O25,0)","v":""},{"$f":"IF(COUNTIF($AH25:BJ25,$O25)<$AA25,$O25,0)","v":""},{"$f":"IF(COUNTIF($AH25:BK25,$O25)<$AA25,$O25,0)","v":""},{"$f":"IF(COUNTIF($AH25:BL25,$O25)<$AA25,$O25,0)","v":""},{"$f":"IF(COUNTIF($AH25:BM25,$O25)<$AA25,$O25,0)","v":""},{"$f":"IF(COUNTIF($AH25:BN25,$O25)<$AA25,$O25,0)","v":""},{"$f":"IF(COUNTIF($AH25:BO25,$O25)<$AA25,$O25,0)","v":""},{"$f":"IF(COUNTIF($AH25:BP25,$O25)<$AA25,$O25,0)","v":""},{"$f":"IF(COUNTIF($AH25:BQ25,$O25)<$AA25,$O25,0)","v":""},{"$f":"IF(COUNTIF($AH25:BR25,$O25)<$AA25,$O25,0)","v":""},{"$f":"IF(COUNTIF($AH25:BS25,$O25)<$AA25,$O25,0)","v":""},{"$f":"IF(COUNTIF($AH25:BT25,$O25)<$AA25,$O25,0)","v":""},-0.3,null,null,null,null,""]
[null,18,{"$f":"IF(OR('Measure Descriptions'!C26=\"\",'Measure Descriptions'!D26=\"\",'Measure Descriptions'!E26=\"\")=TRUE,\"\",'Measure Descriptions'!C26)","v":""},{"$f":"IF(OR('Measure Descriptions'!C26=\"\",'Measure Descriptions'!D26=\"\",'Measure Descriptions'!E26=\"\")=TRUE,\"\",'Measure Descriptions'!D26)","v":""},{"$f":"IF(OR('Measure Descriptions'!C26=\"\",'Measure Descriptions'!D26=\"\",'Measure Descriptions'!E26=\"\")=TRUE,\"\",'Measure Descriptions'!E26)","v":""},null,null,null,null,null,null,null,null,null,{"$f":"IF(E26=\"\",\"\",(G26+H26)*VLOOKUP(N26,'Utility Info'!$B$15:$G$19,5,FALSE)+(I26+J26)*'Utility Info'!$F$14)","v":""},0,"","",0,{"$f":"IFERROR(IF(F26=0,0,IF(OR(C26=\"Fuel Conversion\",Y26=\"Yes\")=TRUE,\"N/A\",'TRC Test'!K24/'TRC Test'!M24)),0)","v":0},{"$f":"'Measure QC'!H24","v":0},null,null,"",null,null,"","",null,"",null,null,0,"","",{"$f":"IF(COUNTIF($AH26:AI26,$O26)<$AA26,$O26,0)","v":""},{"$f":"IF(COUNTIF($AH26:AJ26,$O26)<$AA26,$O26,0)","v":""},{"$f":"IF(COUNTIF($AH26:AK26,$O26)<$AA26,$O26,0)","v":""},{"$f":"IF(COUNTIF($AH26:AL26,$O26)<$AA26,$O26,0)","v":""},{"$f":"IF(COUNTIF($AH26:AM26,$O26)<$AA26,$O26,0)","v":""},{"$f":"IF(COUNTIF($AH26:AN26,$O26)<$AA26,$O26,0)","v":""},{"$f":"IF(COUNTIF($AH26:AO26,$O26)<$AA26,$O26,0)","v":""},{"$f":"IF(COUNTIF($AH26:AP26,$O26)<$AA26,$O26,0)","v":""},{"$f":"IF(COUNTIF($AH26:AQ26,$O26)<$AA26,$O26,0)","v":""},{"$f":"IF(COUNTIF($AH26:AR26,$O26)<$AA26,$O26,0)","v":""},{"$f":"IF(COUNTIF($AH26:AS26,$O26)<$AA26,$O26,0)","v":""},{"$f":"IF(COUNTIF($AH26:AT26,$O26)<$AA26,$O26,0)","v":""},{"$f":"IF(COUNTIF($AH26:AU26,$O26)<$AA26,$O26,0)","v":""},{"$f":"IF(COUNTIF($AH26:AV26,$O26)<$AA26,$O26,0)","v":""},{"$f":"IF(COUNTIF($AH26:AW26,$O26)<$AA26,$O26,0)","v":""},{"$f":"IF(COUNTIF($AH26:AX26,$O26)<$AA26,$O26,0)","v":""},{"$f":"IF(COUNTIF($AH26:AY26,$O26)<$AA26,$O26,0)","v":""},{"$f":"IF(COUNTIF($AH26:AZ26,$O26)<$AA26,$O26,0)","v":""},{"$f":"IF(COUNTIF($AH26:BA26,$O26)<$AA26,$O26,0)","v":""},{"$f":"IF(COUNTIF($AH26:BB26,$O26)<$AA26,$O26,0)","v":""},{"$f":"IF(COUNTIF($AH26:BC26,$O26)<$AA26,$O26,0)","v":""},{"$f":"IF(COUNTIF($AH26:BD26,$O26)<$AA26,$O26,0)","v":""},{"$f":"IF(COUNTIF($AH26:BE26,$O26)<$AA26,$O26,0)","v":""},{"$f":"IF(COUNTIF($AH26:BF26,$O26)<$AA26,$O26,0)","v":""},{"$f":"IF(COUNTIF($AH26:BG26,$O26)<$AA26,$O26,0)","v":""},{"$f":"IF(COUNTIF($AH26:BH26,$O26)<$AA26,$O26,0)","v":""},{"$f":"IF(COUNTIF($AH26:BI26,$O26)<$AA26,$O26,0)","v":""},{"$f":"IF(COUNTIF($AH26:BJ26,$O26)<$AA26,$O26,0)","v":""},{"$f":"IF(COUNTIF($AH26:BK26,$O26)<$AA26,$O26,0)","v":""},{"$f":"IF(COUNTIF($AH26:BL26,$O26)<$AA26,$O26,0)","v":""},{"$f":"IF(COUNTIF($AH26:BM26,$O26)<$AA26,$O26,0)","v":""},{"$f":"IF(COUNTIF($AH26:BN26,$O26)<$AA26,$O26,0)","v":""},{"$f":"IF(COUNTIF($AH26:BO26,$O26)<$AA26,$O26,0)","v":""},{"$f":"IF(COUNTIF($AH26:BP26,$O26)<$AA26,$O26,0)","v":""},{"$f":"IF(COUNTIF($AH26:BQ26,$O26)<$AA26,$O26,0)","v":""},{"$f":"IF(COUNTIF($AH26:BR26,$O26)<$AA26,$O26,0)","v":""},{"$f":"IF(COUNTIF($AH26:BS26,$O26)<$AA26,$O26,0)","v":""},{"$f":"IF(COUNTIF($AH26:BT26,$O26)<$AA26,$O26,0)","v":""},-0.3,null,null,null,null,""]
[null,19,{"$f":"IF(OR('Measure Descriptions'!C27=\"\",'Measure Descriptions'!D27=\"\",'Measure Descriptions'!E27=\"\")=TRUE,\"\",'Measure Descriptions'!C27)","v":""},{"$f":"IF(OR('Measure Descriptions'!C27=\"\",'Measure Descriptions'!D27=\"\",'Measure Descriptions'!E27=\"\")=TRUE,\"\",'Measure Descriptions'!D27)","v":""},{"$f":"IF(OR('Measure Descriptions'!C27=\"\",'Measure Descriptions'!D27=\"\",'Measure Descriptions'!E27=\"\")=TRUE,\"\",'Measure Descriptions'!E27)","v":""},null,null,null,null,null,null,null,null,null,{"$f":"IF(E27=\"\",\"\",(G27+H27)*VLOOKUP(N27,'Utility Info'!$B$15:$G$19,5,FALSE)+(I27+J27)*'Utility Info'!$F$14)","v":""},0,"","",0,{"$f":"IFERROR(IF(F27=0,0,IF(OR(C27=\"Fuel Conversion\",Y27=\"Yes\")=TRUE,\"N/A\",'TRC Test'!K25/'TRC Test'!M25)),0)","v":0},{"$f":"'Measure QC'!H25","v":0},null,null,"",null,null,"","",null,"",null,null,0,"","",{"$f":"IF(COUNTIF($AH27:AI27,$O27)<$AA27,$O27,0)","v":""},{"$f":"IF(COUNTIF($AH27:AJ27,$O27)<$AA27,$O27,0)","v":""},{"$f":"IF(COUNTIF($AH27:AK27,$O27)<$AA27,$O27,0)","v":""},{"$f":"IF(COUNTIF($AH27:AL27,$O27)<$AA27,$O27,0)","v":""},{"$f":"IF(COUNTIF($AH27:AM27,$O27)<$AA27,$O27,0)","v":""},{"$f":"IF(COUNTIF($AH27:AN27,$O27)<$AA27,$O27,0)","v":""},{"$f":"IF(COUNTIF($AH27:AO27,$O27)<$AA27,$O27,0)","v":""},{"$f":"IF(COUNTIF($AH27:AP27,$O27)<$AA27,$O27,0)","v":""},{"$f":"IF(COUNTIF($AH27:AQ27,$O27)<$AA27,$O27,0)","v":""},{"$f":"IF(COUNTIF($AH27:AR27,$O27)<$AA27,$O27,0)","v":""},{"$f":"IF(COUNTIF($AH27:AS27,$O27)<$AA27,$O27,0)","v":""},{"$f":"IF(COUNTIF($AH27:AT27,$O27)<$AA27,$O27,0)","v":""},{"$f":"IF(COUNTIF($AH27:AU27,$O27)<$AA27,$O27,0)","v":""},{"$f":"IF(COUNTIF($AH27:AV27,$O27)<$AA27,$O27,0)","v":""},{"$f":"IF(COUNTIF($AH27:AW27,$O27)<$AA27,$O27,0)","v":""},{"$f":"IF(COUNTIF($AH27:AX27,$O27)<$AA27,$O27,0)","v":""},{"$f":"IF(COUNTIF($AH27:AY27,$O27)<$AA27,$O27,0)","v":""},{"$f":"IF(COUNTIF($AH27:AZ27,$O27)<$AA27,$O27,0)","v":""},{"$f":"IF(COUNTIF($AH27:BA27,$O27)<$AA27,$O27,0)","v":""},{"$f":"IF(COUNTIF($AH27:BB27,$O27)<$AA27,$O27,0)","v":""},{"$f":"IF(COUNTIF($AH27:BC27,$O27)<$AA27,$O27,0)","v":""},{"$f":"IF(COUNTIF($AH27:BD27,$O27)<$AA27,$O27,0)","v":""},{"$f":"IF(COUNTIF($AH27:BE27,$O27)<$AA27,$O27,0)","v":""},{"$f":"IF(COUNTIF($AH27:BF27,$O27)<$AA27,$O27,0)","v":""},{"$f":"IF(COUNTIF($AH27:BG27,$O27)<$AA27,$O27,0)","v":""},{"$f":"IF(COUNTIF($AH27:BH27,$O27)<$AA27,$O27,0)","v":""},{"$f":"IF(COUNTIF($AH27:BI27,$O27)<$AA27,$O27,0)","v":""},{"$f":"IF(COUNTIF($AH27:BJ27,$O27)<$AA27,$O27,0)","v":""},{"$f":"IF(COUNTIF($AH27:BK27,$O27)<$AA27,$O27,0)","v":""},{"$f":"IF(COUNTIF($AH27:BL27,$O27)<$AA27,$O27,0)","v":""},{"$f":"IF(COUNTIF($AH27:BM27,$O27)<$AA27,$O27,0)","v":""},{"$f":"IF(COUNTIF($AH27:BN27,$O27)<$AA27,$O27,0)","v":""},{"$f":"IF(COUNTIF($AH27:BO27,$O27)<$AA27,$O27,0)","v":""},{"$f":"IF(COUNTIF($AH27:BP27,$O27)<$AA27,$O27,0)","v":""},{"$f":"IF(COUNTIF($AH27:BQ27,$O27)<$AA27,$O27,0)","v":""},{"$f":"IF(COUNTIF($AH27:BR27,$O27)<$AA27,$O27,0)","v":""},{"$f":"IF(COUNTIF($AH27:BS27,$O27)<$AA27,$O27,0)","v":""},{"$f":"IF(COUNTIF($AH27:BT27,$O27)<$AA27,$O27,0)","v":""},-0.3,null,null,null,null,""]
[null,20,{"$f":"IF(OR('Measure Descriptions'!C28=\"\",'Measure Descriptions'!D28=\"\",'Measure Descriptions'!E28=\"\")=TRUE,\"\",'Measure Descriptions'!C28)","v":""},{"$f":"IF(OR('Measure Descriptions'!C28=\"\",'Measure Descriptions'!D28=\"\",'Measure Descriptions'!E28=\"\")=TRUE,\"\",'Measure Descriptions'!D28)","v":""},{"$f":"IF(OR('Measure Descriptions'!C28=\"\",'Measure Descriptions'!D28=\"\",'Measure Descriptions'!E28=\"\")=TRUE,\"\",'Measure Descriptions'!E28)","v":""},null,null,null,null,null,null,null,null,null,{"$f":"IF(E28=\"\",\"\",(G28+H28)*VLOOKUP(N28,'Utility Info'!$B$15:$G$19,5,FALSE)+(I28+J28)*'Utility Info'!$F$14)","v":""},0,"","",0,{"$f":"IFERROR(IF(F28=0,0,IF(OR(C28=\"Fuel Conversion\",Y28=\"Yes\")=TRUE,\"N/A\",'TRC Test'!K26/'TRC Test'!M26)),0)","v":0},{"$f":"'Measure QC'!H26","v":0},null,null,"",null,null,"","",null,"",null,null,0,"","",{"$f":"IF(COUNTIF($AH28:AI28,$O28)<$AA28,$O28,0)","v":""},{"$f":"IF(COUNTIF($AH28:AJ28,$O28)<$AA28,$O28,0)","v":""},{"$f":"IF(COUNTIF($AH28:AK28,$O28)<$AA28,$O28,0)","v":""},{"$f":"IF(COUNTIF($AH28:AL28,$O28)<$AA28,$O28,0)","v":""},{"$f":"IF(COUNTIF($AH28:AM28,$O28)<$AA28,$O28,0)","v":""},{"$f":"IF(COUNTIF($AH28:AN28,$O28)<$AA28,$O28,0)","v":""},{"$f":"IF(COUNTIF($AH28:AO28,$O28)<$AA28,$O28,0)","v":""},{"$f":"IF(COUNTIF($AH28:AP28,$O28)<$AA28,$O28,0)","v":""},{"$f":"IF(COUNTIF($AH28:AQ28,$O28)<$AA28,$O28,0)","v":""},{"$f":"IF(COUNTIF($AH28:AR28,$O28)<$AA28,$O28,0)","v":""},{"$f":"IF(COUNTIF($AH28:AS28,$O28)<$AA28,$O28,0)","v":""},{"$f":"IF(COUNTIF($AH28:AT28,$O28)<$AA28,$O28,0)","v":""},{"$f":"IF(COUNTIF($AH28:AU28,$O28)<$AA28,$O28,0)","v":""},{"$f":"IF(COUNTIF($AH28:AV28,$O28)<$AA28,$O28,0)","v":""},{"$f":"IF(COUNTIF($AH28:AW28,$O28)<$AA28,$O28,0)","v":""},{"$f":"IF(COUNTIF($AH28:AX28,$O28)<$AA28,$O28,0)","v":""},{"$f":"IF(COUNTIF($AH28:AY28,$O28)<$AA28,$O28,0)","v":""},{"$f":"IF(COUNTIF($AH28:AZ28,$O28)<$AA28,$O28,0)","v":""},{"$f":"IF(COUNTIF($AH28:BA28,$O28)<$AA28,$O28,0)","v":""},{"$f":"IF(COUNTIF($AH28:BB28,$O28)<$AA28,$O28,0)","v":""},{"$f":"IF(COUNTIF($AH28:BC28,$O28)<$AA28,$O28,0)","v":""},{"$f":"IF(COUNTIF($AH28:BD28,$O28)<$AA28,$O28,0)","v":""},{"$f":"IF(COUNTIF($AH28:BE28,$O28)<$AA28,$O28,0)","v":""},{"$f":"IF(COUNTIF($AH28:BF28,$O28)<$AA28,$O28,0)","v":""},{"$f":"IF(COUNTIF($AH28:BG28,$O28)<$AA28,$O28,0)","v":""},{"$f":"IF(COUNTIF($AH28:BH28,$O28)<$AA28,$O28,0)","v":""},{"$f":"IF(COUNTIF($AH28:BI28,$O28)<$AA28,$O28,0)","v":""},{"$f":"IF(COUNTIF($AH28:BJ28,$O28)<$AA28,$O28,0)","v":""},{"$f":"IF(COUNTIF($AH28:BK28,$O28)<$AA28,$O28,0)","v":""},{"$f":"IF(COUNTIF($AH28:BL28,$O28)<$AA28,$O28,0)","v":""},{"$f":"IF(COUNTIF($AH28:BM28,$O28)<$AA28,$O28,0)","v":""},{"$f":"IF(COUNTIF($AH28:BN28,$O28)<$AA28,$O28,0)","v":""},{"$f":"IF(COUNTIF($AH28:BO28,$O28)<$AA28,$O28,0)","v":""},{"$f":"IF(COUNTIF($AH28:BP28,$O28)<$AA28,$O28,0)","v":""},{"$f":"IF(COUNTIF($AH28:BQ28,$O28)<$AA28,$O28,0)","v":""},{"$f":"IF(COUNTIF($AH28:BR28,$O28)<$AA28,$O28,0)","v":""},{"$f":"IF(COUNTIF($AH28:BS28,$O28)<$AA28,$O28,0)","v":""},{"$f":"IF(COUNTIF($AH28:BT28,$O28)<$AA28,$O28,0)","v":""},-0.3,null,null,null,null,""]
[null,21,{"$f":"IF(OR('Measure Descriptions'!C29=\"\",'Measure Descriptions'!D29=\"\",'Measure Descriptions'!E29=\"\")=TRUE,\"\",'Measure Descriptions'!C29)","v":""},{"$f":"IF(OR('Measure Descriptions'!C29=\"\",'Measure Descriptions'!D29=\"\",'Measure Descriptions'!E29=\"\")=TRUE,\"\",'Measure Descriptions'!D29)","v":""},{"$f":"IF(OR('Measure Descriptions'!C29=\"\",'Measure Descriptions'!D29=\"\",'Measure Descriptions'!E29=\"\")=TRUE,\"\",'Measure Descriptions'!E29)","v":""},null,null,null,null,null,null,null,null,null,{"$f":"IF(E29=\"\",\"\",(G29+H29)*VLOOKUP(N29,'Utility Info'!$B$15:$G$19,5,FALSE)+(I29+J29)*'Utility Info'!$F$14)","v":""},0,"","",0,{"$f":"IFERROR(IF(F29=0,0,IF(OR(C29=\"Fuel Conversion\",Y29=\"Yes\")=TRUE,\"N/A\",'TRC Test'!K27/'TRC Test'!M27)),0)","v":0},{"$f":"'Measure QC'!H27","v":0},null,null,"",null,null,"","",null,"",null,null,0,"","",{"$f":"IF(COUNTIF($AH29:AI29,$O29)<$AA29,$O29,0)","v":""},{"$f":"IF(COUNTIF($AH29:AJ29,$O29)<$AA29,$O29,0)","v":""},{"$f":"IF(COUNTIF($AH29:AK29,$O29)<$AA29,$O29,0)","v":""},{"$f":"IF(COUNTIF($AH29:AL29,$O29)<$AA29,$O29,0)","v":""},{"$f":"IF(COUNTIF($AH29:AM29,$O29)<$AA29,$O29,0)","v":""},{"$f":"IF(COUNTIF($AH29:AN29,$O29)<$AA29,$O29,0)","v":""},{"$f":"IF(COUNTIF($AH29:AO29,$O29)<$AA29,$O29,0)","v":""},{"$f":"IF(COUNTIF($AH29:AP29,$O29)<$AA29,$O29,0)","v":""},{"$f":"IF(COUNTIF($AH29:AQ29,$O29)<$AA29,$O29,0)","v":""},{"$f":"IF(COUNTIF($AH29:AR29,$O29)<$AA29,$O29,0)","v":""},{"$f":"IF(COUNTIF($AH29:AS29,$O29)<$AA29,$O29,0)","v":""},{"$f":"IF(COUNTIF($AH29:AT29,$O29)<$AA29,$O29,0)","v":""},{"$f":"IF(COUNTIF($AH29:AU29,$O29)<$AA29,$O29,0)","v":""},{"$f":"IF(COUNTIF($AH29:AV29,$O29)<$AA29,$O29,0)","v":""},{"$f":"IF(COUNTIF($AH29:AW29,$O29)<$AA29,$O29,0)","v":""},{"$f":"IF(COUNTIF($AH29:AX29,$O29)<$AA29,$O29,0)","v":""},{"$f":"IF(COUNTIF($AH29:AY29,$O29)<$AA29,$O29,0)","v":""},{"$f":"IF(COUNTIF($AH29:AZ29,$O29)<$AA29,$O29,0)","v":""},{"$f":"IF(COUNTIF($AH29:BA29,$O29)<$AA29,$O29,0)","v":""},{"$f":"IF(COUNTIF($AH29:BB29,$O29)<$AA29,$O29,0)","v":""},{"$f":"IF(COUNTIF($AH29:BC29,$O29)<$AA29,$O29,0)","v":""},{"$f":"IF(COUNTIF($AH29:BD29,$O29)<$AA29,$O29,0)","v":""},{"$f":"IF(COUNTIF($AH29:BE29,$O29)<$AA29,$O29,0)","v":""},{"$f":"IF(COUNTIF($AH29:BF29,$O29)<$AA29,$O29,0)","v":""},{"$f":"IF(COUNTIF($AH29:BG29,$O29)<$AA29,$O29,0)","v":""},{"$f":"IF(COUNTIF($AH29:BH29,$O29)<$AA29,$O29,0)","v":""},{"$f":"IF(COUNTIF($AH29:BI29,$O29)<$AA29,$O29,0)","v":""},{"$f":"IF(COUNTIF($AH29:BJ29,$O29)<$AA29,$O29,0)","v":""},{"$f":"IF(COUNTIF($AH29:BK29,$O29)<$AA29,$O29,0)","v":""},{"$f":"IF(COUNTIF($AH29:BL29,$O29)<$AA29,$O29,0)","v":""},{"$f":"IF(COUNTIF($AH29:BM29,$O29)<$AA29,$O29,0)","v":""},{"$f":"IF(COUNTIF($AH29:BN29,$O29)<$AA29,$O29,0)","v":""},{"$f":"IF(COUNTIF($AH29:BO29,$O29)<$AA29,$O29,0)","v":""},{"$f":"IF(COUNTIF($AH29:BP29,$O29)<$AA29,$O29,0)","v":""},{"$f":"IF(COUNTIF($AH29:BQ29,$O29)<$AA29,$O29,0)","v":""},{"$f":"IF(COUNTIF($AH29:BR29,$O29)<$AA29,$O29,0)","v":""},{"$f":"IF(COUNTIF($AH29:BS29,$O29)<$AA29,$O29,0)","v":""},{"$f":"IF(COUNTIF($AH29:BT29,$O29)<$AA29,$O29,0)","v":""},-0.3,null,null,null,null,""]
[null,22,{"$f":"IF(OR('Measure Descriptions'!C30=\"\",'Measure Descriptions'!D30=\"\",'Measure Descriptions'!E30=\"\")=TRUE,\"\",'Measure Descriptions'!C30)","v":""},{"$f":"IF(OR('Measure Descriptions'!C30=\"\",'Measure Descriptions'!D30=\"\",'Measure Descriptions'!E30=\"\")=TRUE,\"\",'Measure Descriptions'!D30)","v":""},{"$f":"IF(OR('Measure Descriptions'!C30=\"\",'Measure Descriptions'!D30=\"\",'Measure Descriptions'!E30=\"\")=TRUE,\"\",'Measure Descriptions'!E30)","v":""},null,null,null,null,null,null,null,null,null,{"$f":"IF(E30=\"\",\"\",(G30+H30)*VLOOKUP(N30,'Utility Info'!$B$15:$G$19,5,FALSE)+(I30+J30)*'Utility Info'!$F$14)","v":""},0,"","",0,{"$f":"IFERROR(IF(F30=0,0,IF(OR(C30=\"Fuel Conversion\",Y30=\"Yes\")=TRUE,\"N/A\",'TRC Test'!K28/'TRC Test'!M28)),0)","v":0},{"$f":"'Measure QC'!H28","v":0},null,null,"",null,null,"","",null,"",null,null,0,"","",{"$f":"IF(COUNTIF($AH30:AI30,$O30)<$AA30,$O30,0)","v":""},{"$f":"IF(COUNTIF($AH30:AJ30,$O30)<$AA30,$O30,0)","v":""},{"$f":"IF(COUNTIF($AH30:AK30,$O30)<$AA30,$O30,0)","v":""},{"$f":"IF(COUNTIF($AH30:AL30,$O30)<$AA30,$O30,0)","v":""},{"$f":"IF(COUNTIF($AH30:AM30,$O30)<$AA30,$O30,0)","v":""},{"$f":"IF(COUNTIF($AH30:AN30,$O30)<$AA30,$O30,0)","v":""},{"$f":"IF(COUNTIF($AH30:AO30,$O30)<$AA30,$O30,0)","v":""},{"$f":"IF(COUNTIF($AH30:AP30,$O30)<$AA30,$O30,0)","v":""},{"$f":"IF(COUNTIF($AH30:AQ30,$O30)<$AA30,$O30,0)","v":""},{"$f":"IF(COUNTIF($AH30:AR30,$O30)<$AA30,$O30,0)","v":""},{"$f":"IF(COUNTIF($AH30:AS30,$O30)<$AA30,$O30,0)","v":""},{"$f":"IF(COUNTIF($AH30:AT30,$O30)<$AA30,$O30,0)","v":""},{"$f":"IF(COUNTIF($AH30:AU30,$O30)<$AA30,$O30,0)","v":""},{"$f":"IF(COUNTIF($AH30:AV30,$O30)<$AA30,$O30,0)","v":""},{"$f":"IF(COUNTIF($AH30:AW30,$O30)<$AA30,$O30,0)","v":""},{"$f":"IF(COUNTIF($AH30:AX30,$O30)<$AA30,$O30,0)","v":""},{"$f":"IF(COUNTIF($AH30:AY30,$O30)<$AA30,$O30,0)","v":""},{"$f":"IF(COUNTIF($AH30:AZ30,$O30)<$AA30,$O30,0)","v":""},{"$f":"IF(COUNTIF($AH30:BA30,$O30)<$AA30,$O30,0)","v":""},{"$f":"IF(COUNTIF($AH30:BB30,$O30)<$AA30,$O30,0)","v":""},{"$f":"IF(COUNTIF($AH30:BC30,$O30)<$AA30,$O30,0)","v":""},{"$f":"IF(COUNTIF($AH30:BD30,$O30)<$AA30,$O30,0)","v":""},{"$f":"IF(COUNTIF($AH30:BE30,$O30)<$AA30,$O30,0)","v":""},{"$f":"IF(COUNTIF($AH30:BF30,$O30)<$AA30,$O30,0)","v":""},{"$f":"IF(COUNTIF($AH30:BG30,$O30)<$AA30,$O30,0)","v":""},{"$f":"IF(COUNTIF($AH30:BH30,$O30)<$AA30,$O30,0)","v":""},{"$f":"IF(COUNTIF($AH30:BI30,$O30)<$AA30,$O30,0)","v":""},{"$f":"IF(COUNTIF($AH30:BJ30,$O30)<$AA30,$O30,0)","v":""},{"$f":"IF(COUNTIF($AH30:BK30,$O30)<$AA30,$O30,0)","v":""},{"$f":"IF(COUNTIF($AH30:BL30,$O30)<$AA30,$O30,0)","v":""},{"$f":"IF(COUNTIF($AH30:BM30,$O30)<$AA30,$O30,0)","v":""},{"$f":"IF(COUNTIF($AH30:BN30,$O30)<$AA30,$O30,0)","v":""},{"$f":"IF(COUNTIF($AH30:BO30,$O30)<$AA30,$O30,0)","v":""},{"$f":"IF(COUNTIF($AH30:BP30,$O30)<$AA30,$O30,0)","v":""},{"$f":"IF(COUNTIF($AH30:BQ30,$O30)<$AA30,$O30,0)","v":""},{"$f":"IF(COUNTIF($AH30:BR30,$O30)<$AA30,$O30,0)","v":""},{"$f":"IF(COUNTIF($AH30:BS30,$O30)<$AA30,$O30,0)","v":""},{"$f":"IF(COUNTIF($AH30:BT30,$O30)<$AA30,$O30,0)","v":""},-0.3,null,null,null,null,""]
[null,23,{"$f":"IF(OR('Measure Descriptions'!C31=\"\",'Measure Descriptions'!D31=\"\",'Measure Descriptions'!E31=\"\")=TRUE,\"\",'Measure Descriptions'!C31)","v":""},{"$f":"IF(OR('Measure Descriptions'!C31=\"\",'Measure Descriptions'!D31=\"\",'Measure Descriptions'!E31=\"\")=TRUE,\"\",'Measure Descriptions'!D31)","v":""},{"$f":"IF(OR('Measure Descriptions'!C31=\"\",'Measure Descriptions'!D31=\"\",'Measure Descriptions'!E31=\"\")=TRUE,\"\",'Measure Descriptions'!E31)","v":""},null,null,null,null,null,null,null,null,null,{"$f":"IF(E31=\"\",\"\",(G31+H31)*VLOOKUP(N31,'Utility Info'!$B$15:$G$19,5,FALSE)+(I31+J31)*'Utility Info'!$F$14)","v":""},0,"","",0,{"$f":"IFERROR(IF(F31=0,0,IF(OR(C31=\"Fuel Conversion\",Y31=\"Yes\")=TRUE,\"N/A\",'TRC Test'!K29/'TRC Test'!M29)),0)","v":0},{"$f":"'Measure QC'!H29","v":0},null,null,"",null,null,"","",null,"",null,null,0,"","",{"$f":"IF(COUNTIF($AH31:AI31,$O31)<$AA31,$O31,0)","v":""},{"$f":"IF(COUNTIF($AH31:AJ31,$O31)<$AA31,$O31,0)","v":""},{"$f":"IF(COUNTIF($AH31:AK31,$O31)<$AA31,$O31,0)","v":""},{"$f":"IF(COUNTIF($AH31:AL31,$O31)<$AA31,$O31,0)","v":""},{"$f":"IF(COUNTIF($AH31:AM31,$O31)<$AA31,$O31,0)","v":""},{"$f":"IF(COUNTIF($AH31:AN31,$O31)<$AA31,$O31,0)","v":""},{"$f":"IF(COUNTIF($AH31:AO31,$O31)<$AA31,$O31,0)","v":""},{"$f":"IF(COUNTIF($AH31:AP31,$O31)<$AA31,$O31,0)","v":""},{"$f":"IF(COUNTIF($AH31:AQ31,$O31)<$AA31,$O31,0)","v":""},{"$f":"IF(COUNTIF($AH31:AR31,$O31)<$AA31,$O31,0)","v":""},{"$f":"IF(COUNTIF($AH31:AS31,$O31)<$AA31,$O31,0)","v":""},{"$f":"IF(COUNTIF($AH31:AT31,$O31)<$AA31,$O31,0)","v":""},{"$f":"IF(COUNTIF($AH31:AU31,$O31)<$AA31,$O31,0)","v":""},{"$f":"IF(COUNTIF($AH31:AV31,$O31)<$AA31,$O31,0)","v":""},{"$f":"IF(COUNTIF($AH31:AW31,$O31)<$AA31,$O31,0)","v":""},{"$f":"IF(COUNTIF($AH31:AX31,$O31)<$AA31,$O31,0)","v":""},{"$f":"IF(COUNTIF($AH31:AY31,$O31)<$AA31,$O31,0)","v":""},{"$f":"IF(COUNTIF($AH31:AZ31,$O31)<$AA31,$O31,0)","v":""},{"$f":"IF(COUNTIF($AH31:BA31,$O31)<$AA31,$O31,0)","v":""},{"$f":"IF(COUNTIF($AH31:BB31,$O31)<$AA31,$O31,0)","v":""},{"$f":"IF(COUNTIF($AH31:BC31,$O31)<$AA31,$O31,0)","v":""},{"$f":"IF(COUNTIF($AH31:BD31,$O31)<$AA31,$O31,0)","v":""},{"$f":"IF(COUNTIF($AH31:BE31,$O31)<$AA31,$O31,0)","v":""},{"$f":"IF(COUNTIF($AH31:BF31,$O31)<$AA31,$O31,0)","v":""},{"$f":"IF(COUNTIF($AH31:BG31,$O31)<$AA31,$O31,0)","v":""},{"$f":"IF(COUNTIF($AH31:BH31,$O31)<$AA31,$O31,0)","v":""},{"$f":"IF(COUNTIF($AH31:BI31,$O31)<$AA31,$O31,0)","v":""},{"$f":"IF(COUNTIF($AH31:BJ31,$O31)<$AA31,$O31,0)","v":""},{"$f":"IF(COUNTIF($AH31:BK31,$O31)<$AA31,$O31,0)","v":""},{"$f":"IF(COUNTIF($AH31:BL31,$O31)<$AA31,$O31,0)","v":""},{"$f":"IF(COUNTIF($AH31:BM31,$O31)<$AA31,$O31,0)","v":""},{"$f":"IF(COUNTIF($AH31:BN31,$O31)<$AA31,$O31,0)","v":""},{"$f":"IF(COUNTIF($AH31:BO31,$O31)<$AA31,$O31,0)","v":""},{"$f":"IF(COUNTIF($AH31:BP31,$O31)<$AA31,$O31,0)","v":""},{"$f":"IF(COUNTIF($AH31:BQ31,$O31)<$AA31,$O31,0)","v":""},{"$f":"IF(COUNTIF($AH31:BR31,$O31)<$AA31,$O31,0)","v":""},{"$f":"IF(COUNTIF($AH31:BS31,$O31)<$AA31,$O31,0)","v":""},{"$f":"IF(COUNTIF($AH31:BT31,$O31)<$AA31,$O31,0)","v":""},-0.3,null,null,null,null,""]
[null,24,{"$f":"IF(OR('Measure Descriptions'!C32=\"\",'Measure Descriptions'!D32=\"\",'Measure Descriptions'!E32=\"\")=TRUE,\"\",'Measure Descriptions'!C32)","v":""},{"$f":"IF(OR('Measure Descriptions'!C32=\"\",'Measure Descriptions'!D32=\"\",'Measure Descriptions'!E32=\"\")=TRUE,\"\",'Measure Descriptions'!D32)","v":""},{"$f":"IF(OR('Measure Descriptions'!C32=\"\",'Measure Descriptions'!D32=\"\",'Measure Descriptions'!E32=\"\")=TRUE,\"\",'Measure Descriptions'!E32)","v":""},null,null,null,null,null,null,null,null,null,{"$f":"IF(E32=\"\",\"\",(G32+H32)*VLOOKUP(N32,'Utility Info'!$B$15:$G$19,5,FALSE)+(I32+J32)*'Utility Info'!$F$14)","v":""},0,"","",0,{"$f":"IFERROR(IF(F32=0,0,IF(OR(C32=\"Fuel Conversion\",Y32=\"Yes\")=TRUE,\"N/A\",'TRC Test'!K30/'TRC Test'!M30)),0)","v":0},{"$f":"'Measure QC'!H30","v":0},null,null,"",null,null,"","",null,"",null,null,0,"","",{"$f":"IF(COUNTIF($AH32:AI32,$O32)<$AA32,$O32,0)","v":""},{"$f":"IF(COUNTIF($AH32:AJ32,$O32)<$AA32,$O32,0)","v":""},{"$f":"IF(COUNTIF($AH32:AK32,$O32)<$AA32,$O32,0)","v":""},{"$f":"IF(COUNTIF($AH32:AL32,$O32)<$AA32,$O32,0)","v":""},{"$f":"IF(COUNTIF($AH32:AM32,$O32)<$AA32,$O32,0)","v":""},{"$f":"IF(COUNTIF($AH32:AN32,$O32)<$AA32,$O32,0)","v":""},{"$f":"IF(COUNTIF($AH32:AO32,$O32)<$AA32,$O32,0)","v":""},{"$f":"IF(COUNTIF($AH32:AP32,$O32)<$AA32,$O32,0)","v":""},{"$f":"IF(COUNTIF($AH32:AQ32,$O32)<$AA32,$O32,0)","v":""},{"$f":"IF(COUNTIF($AH32:AR32,$O32)<$AA32,$O32,0)","v":""},{"$f":"IF(COUNTIF($AH32:AS32,$O32)<$AA32,$O32,0)","v":""},{"$f":"IF(COUNTIF($AH32:AT32,$O32)<$AA32,$O32,0)","v":""},{"$f":"IF(COUNTIF($AH32:AU32,$O32)<$AA32,$O32,0)","v":""},{"$f":"IF(COUNTIF($AH32:AV32,$O32)<$AA32,$O32,0)","v":""},{"$f":"IF(COUNTIF($AH32:AW32,$O32)<$AA32,$O32,0)","v":""},{"$f":"IF(COUNTIF($AH32:AX32,$O32)<$AA32,$O32,0)","v":""},{"$f":"IF(COUNTIF($AH32:AY32,$O32)<$AA32,$O32,0)","v":""},{"$f":"IF(COUNTIF($AH32:AZ32,$O32)<$AA32,$O32,0)","v":""},{"$f":"IF(COUNTIF($AH32:BA32,$O32)<$AA32,$O32,0)","v":""},{"$f":"IF(COUNTIF($AH32:BB32,$O32)<$AA32,$O32,0)","v":""},{"$f":"IF(COUNTIF($AH32:BC32,$O32)<$AA32,$O32,0)","v":""},{"$f":"IF(COUNTIF($AH32:BD32,$O32)<$AA32,$O32,0)","v":""},{"$f":"IF(COUNTIF($AH32:BE32,$O32)<$AA32,$O32,0)","v":""},{"$f":"IF(COUNTIF($AH32:BF32,$O32)<$AA32,$O32,0)","v":""},{"$f":"IF(COUNTIF($AH32:BG32,$O32)<$AA32,$O32,0)","v":""},{"$f":"IF(COUNTIF($AH32:BH32,$O32)<$AA32,$O32,0)","v":""},{"$f":"IF(COUNTIF($AH32:BI32,$O32)<$AA32,$O32,0)","v":""},{"$f":"IF(COUNTIF($AH32:BJ32,$O32)<$AA32,$O32,0)","v":""},{"$f":"IF(COUNTIF($AH32:BK32,$O32)<$AA32,$O32,0)","v":""},{"$f":"IF(COUNTIF($AH32:BL32,$O32)<$AA32,$O32,0)","v":""},{"$f":"IF(COUNTIF($AH32:BM32,$O32)<$AA32,$O32,0)","v":""},{"$f":"IF(COUNTIF($AH32:BN32,$O32)<$AA32,$O32,0)","v":""},{"$f":"IF(COUNTIF($AH32:BO32,$O32)<$AA32,$O32,0)","v":""},{"$f":"IF(COUNTIF($AH32:BP32,$O32)<$AA32,$O32,0)","v":""},{"$f":"IF(COUNTIF($AH32:BQ32,$O32)<$AA32,$O32,0)","v":""},{"$f":"IF(COUNTIF($AH32:BR32,$O32)<$AA32,$O32,0)","v":""},{"$f":"IF(COUNTIF($AH32:BS32,$O32)<$AA32,$O32,0)","v":""},{"$f":"IF(COUNTIF($AH32:BT32,$O32)<$AA32,$O32,0)","v":""},-0.3,null,null,null,null,""]
[null,25,{"$f":"IF(OR('Measure Descriptions'!C33=\"\",'Measure Descriptions'!D33=\"\",'Measure Descriptions'!E33=\"\")=TRUE,\"\",'Measure Descriptions'!C33)","v":""},{"$f":"IF(OR('Measure Descriptions'!C33=\"\",'Measure Descriptions'!D33=\"\",'Measure Descriptions'!E33=\"\")=TRUE,\"\",'Measure Descriptions'!D33)","v":""},{"$f":"IF(OR('Measure Descriptions'!C33=\"\",'Measure Descriptions'!D33=\"\",'Measure Descriptions'!E33=\"\")=TRUE,\"\",'Measure Descriptions'!E33)","v":""},null,null,null,null,null,null,null,null,null,{"$f":"IF(E33=\"\",\"\",(G33+H33)*VLOOKUP(N33,'Utility Info'!$B$15:$G$19,5,FALSE)+(I33+J33)*'Utility Info'!$F$14)","v":""},0,"","",0,{"$f":"IFERROR(IF(F33=0,0,IF(OR(C33=\"Fuel Conversion\",Y33=\"Yes\")=TRUE,\"N/A\",'TRC Test'!K31/'TRC Test'!M31)),0)","v":0},{"$f":"'Measure QC'!H31","v":0},null,null,"",null,null,"","",null,"",null,null,0,"","",{"$f":"IF(COUNTIF($AH33:AI33,$O33)<$AA33,$O33,0)","v":""},{"$f":"IF(COUNTIF($AH33:AJ33,$O33)<$AA33,$O33,0)","v":""},{"$f":"IF(COUNTIF($AH33:AK33,$O33)<$AA33,$O33,0)","v":""},{"$f":"IF(COUNTIF($AH33:AL33,$O33)<$AA33,$O33,0)","v":""},{"$f":"IF(COUNTIF($AH33:AM33,$O33)<$AA33,$O33,0)","v":""},{"$f":"IF(COUNTIF($AH33:AN33,$O33)<$AA33,$O33,0)","v":""},{"$f":"IF(COUNTIF($AH33:AO33,$O33)<$AA33,$O33,0)","v":""},{"$f":"IF(COUNTIF($AH33:AP33,$O33)<$AA33,$O33,0)","v":""},{"$f":"IF(COUNTIF($AH33:AQ33,$O33)<$AA33,$O33,0)","v":""},{"$f":"IF(COUNTIF($AH33:AR33,$O33)<$AA33,$O33,0)","v":""},{"$f":"IF(COUNTIF($AH33:AS33,$O33)<$AA33,$O33,0)","v":""},{"$f":"IF(COUNTIF($AH33:AT33,$O33)<$AA33,$O33,0)","v":""},{"$f":"IF(COUNTIF($AH33:AU33,$O33)<$AA33,$O33,0)","v":""},{"$f":"IF(COUNTIF($AH33:AV33,$O33)<$AA33,$O33,0)","v":""},{"$f":"IF(COUNTIF($AH33:AW33,$O33)<$AA33,$O33,0)","v":""},{"$f":"IF(COUNTIF($AH33:AX33,$O33)<$AA33,$O33,0)","v":""},{"$f":"IF(COUNTIF($AH33:AY33,$O33)<$AA33,$O33,0)","v":""},{"$f":"IF(COUNTIF($AH33:AZ33,$O33)<$AA33,$O33,0)","v":""},{"$f":"IF(COUNTIF($AH33:BA33,$O33)<$AA33,$O33,0)","v":""},{"$f":"IF(COUNTIF($AH33:BB33,$O33)<$AA33,$O33,0)","v":""},{"$f":"IF(COUNTIF($AH33:BC33,$O33)<$AA33,$O33,0)","v":""},{"$f":"IF(COUNTIF($AH33:BD33,$O33)<$AA33,$O33,0)","v":""},{"$f":"IF(COUNTIF($AH33:BE33,$O33)<$AA33,$O33,0)","v":""},{"$f":"IF(COUNTIF($AH33:BF33,$O33)<$AA33,$O33,0)","v":""},{"$f":"IF(COUNTIF($AH33:BG33,$O33)<$AA33,$O33,0)","v":""},{"$f":"IF(COUNTIF($AH33:BH33,$O33)<$AA33,$O33,0)","v":""},{"$f":"IF(COUNTIF($AH33:BI33,$O33)<$AA33,$O33,0)","v":""},{"$f":"IF(COUNTIF($AH33:BJ33,$O33)<$AA33,$O33,0)","v":""},{"$f":"IF(COUNTIF($AH33:BK33,$O33)<$AA33,$O33,0)","v":""},{"$f":"IF(COUNTIF($AH33:BL33,$O33)<$AA33,$O33,0)","v":""},{"$f":"IF(COUNTIF($AH33:BM33,$O33)<$AA33,$O33,0)","v":""},{"$f":"IF(COUNTIF($AH33:BN33,$O33)<$AA33,$O33,0)","v":""},{"$f":"IF(COUNTIF($AH33:BO33,$O33)<$AA33,$O33,0)","v":""},{"$f":"IF(COUNTIF($AH33:BP33,$O33)<$AA33,$O33,0)","v":""},{"$f":"IF(COUNTIF($AH33:BQ33,$O33)<$AA33,$O33,0)","v":""},{"$f":"IF(COUNTIF($AH33:BR33,$O33)<$AA33,$O33,0)","v":""},{"$f":"IF(COUNTIF($AH33:BS33,$O33)<$AA33,$O33,0)","v":""},{"$f":"IF(COUNTIF($AH33:BT33,$O33)<$AA33,$O33,0)","v":""},-0.3,null,null,null,null,""]
[]
[null,"Total for Improvements",null,null,null,{"$f":"SUM(F8:F33)","v":0},null,null,null,null,null,null,null,null,null,null,null,null,null,null,null,null,null,null,null,{"$f":"SUM(Z8:Z33)","v":0},{"$f":"IF(AD35<>0,NPER($Y$42,-O41,AD35+F41),0)","v":0},null,null,{"$f":"SUM(AD8:AD33)-SUM(F36:F39)","v":0}]
[null,"Provider Fees - SAV-IT",null,null,null,0,null,null,null,null,null,null,null,null,null,null,null,null,null,null,null,null,"Measure Data"]
[null,"Provider Fees - Construction Period",null,null,null,0,"Overall project management, all fees associated with specific measures should be noted above.",null,null,null,null,null,null,null,null,null,null,null,null,null,null,null,"If one of the following measures is in your workscope, you must provide the following:"]
[null,"Provider Fees - Post-Construction",null,null,null,0,null,null,null,null,null,null,null,null,null,null,null,null,null,null,null,null,"Gas Furnace AFUE"]
[null,"Construction Management Fees",null,null,null,0,"Overall construction management, all fees associated with specific measures should be noted above.",null,null,null,null,null,null,null,null,null,null,null,null,null,null,null,"Chiller Type/Capacity"]
[null,null,null,null,null,null,null,null,null,null,null,null,null,null,null,null,null,null,null,null,null,null,"Central AC/HP SEER"]
[null,"TOTALS",null,null,null,{"$f":"SUM(F35:F39)","v":0},{"$f":"SUM(G8:G33)","v":0},0,0,0,0,0,{"$f":"SUM(M8:M33)","v":0},null,{"$f":"SUM(O8:O33)","v":0},null,{"$f":"IF(O41=0,0,F41/O41)","v":0},{"$f":"IF(F41=0,0,AD35/F41+1)","v":0},{"$f":"IF(O41=0,0,(IRR(AG41:BU41,BV41)))","v":0},{"$f":"IFERROR(#REF!,0)","v":0},{"$f":"SUM(U8:U33)","v":0},null,null,null,null,null,null,null,null,null,null,null,{"$f":"-F41","v":0},{"$f":"SUM(AH8:AH33)","v":0},{"$f":"SUM(AI8:AI33)","v":0},0,0,0,0,0,0,0,0,0,0,0,0,0,0,0,0,0,0,0,0,0,0,0,0,0,0,0,0,0,0,0,0,0,0,0,0,0,0,{"$f":"IF(O41*AC41>F41,0.3,-0.3)","v":-0.3}]
[null,null,null,null,null,null,null,null,null,null,null,null,null,null,null,null,null,null,null,null,null,null,"Discount Rate for SIR",null,0.03]
[null,"Incentive Details"]
[null,"Analysis Payment",null,null,null,{"$f":"IF($F$48<Incentives!$C$40,\"\",IF(OR(Incentives!$C$30>50,'General Project Info'!$C$24=\"Yes\")=TRUE,\"\",Incentives!C36))","v":0},{"$f":"IF(F44=\"\",\"This project is not eligible for an Analysis payment.\",\"\")","v":""}]
[null,"Construction Management Payment",null,null,null,{"$f":"IF($F$48<Incentives!$C$40,\"\",IF('General Project Info'!C23=\"Yes\",Incentives!C37,\"\"))","v":""},{"$f":"IF(F45=\"\",\"Construction Management is not part of this project. The value of the Construction Management payment (\"&TEXT(Incentives!C37,\"$#,##0\")&\") has been added to the Construction Complete payment.\",\"\")","v":"Construction Management is not part of this project. The value of the Construction Management payment ($0) has been added to the Construction Complete payment."}]
[null,"Construction Complete Payment",null,null,null,{"$f":"IF($F$48<Incentives!$C$40,\"\",IF('General Project Info'!C23=\"Yes\",Incentives!C38,Incentives!C37+Incentives!C38))","v":0}]
[null,"Performance Payment",null,null,null,{"$f":"IF($F$48<Incentives!$C$40,\"\",Incentives!C39)","v":0}]
[null,"Total Funding Eligibility",null,null,null,{"$f":"MIN(0.5*(F35-SUMIF(Y8:Y22,\"Yes\",F8:F22)-SUMIF(Y24:Y33,\"Yes\",F24:F33)),Incentives!$C$40-Z35)","v":0},{"$f":"IF($F$48<Incentives!$C$40,\"The project's incentives are being capped. Please contact your Case Manager or Project Manager for more information.\",\"\")","v":""}]
[]
[null,null,null,null,null,null,null,null,null,null,null,null,null," "]

{"sheet":"Measure QC","index":7,"n_rows":37,"n_cols":57,"rows_kept":37,"cut":false,"hidden":false,"merged":[[32,10,33,10],[33,1,33,2],[34,1,34,2],[35,1,35,2],[36,1,36,2],[32,9,33,9],[32,1,32,5],[3,38,3,40],[20,17,20,44],[2,1,2,10],[3,12,3,13],[3,14,3,15],[3,17,3,21],[3,22,3,27],[20,1,20,7],[20,12,20,15],[3,30,3,35],[3,36,3,37],[4,1,4,2],[3,28,3,29]]}
[null,"Measure Savings Quality Control"]
[null,"Instructions"]
[null,"1) Measure Check (rows 5-31): Typical data ranges were determined based on approved MPP projects and are meant to indicate typical values.  If the value falls outside of the range, it does not mean that it is \"wrong\", just that it is outside of typical values.  Likewise, if the value is inside the range, it does not mean that it is \"right\" for the conditions in a particular project. All columns are linked to pull information from other tabs in this workbook.\n2) Values will be highlighted in red (above) or blue (below) if they are outside the range of expected values, based on a database of approved existing building projects. Required Response fields will be highlighted in orange. Other conditional formatting is for administrative purposes only.\n3) If the Response column is highlighted, provide justification/explanation for why the value(s) may be out of range for typical projects. Explanations must include details regarding savings calculation assumptions, detailed building information, testing results, etc. This should be done before submitting the SAV-IT for review. Acceptance of the explanations is at the discretion of the reviewer. More information may be requested. Certain measures will have the maximum savings and total source energy savings capped. In these cases, Providers are encouraged to review assumptions and inputs and reduce the savings accordingly. The SAV-IT will not be approved until the savings are brought below the cap.\n4) End Use Savings Check (rows 33-37): Aggregate measure savings are evaluated to ensure estimated savings are realistic. Review this section and follow instructions in the \"Comment\" column, revising tool inputs and providing responses as necessary.",null,null,null,null,null,null,null,null,null,null,"Reviewer Guide",null,null,null,null,"Project Measure QC Calculations"]
[null,null,null,null,null,null,null,null,null,null,null,null," Cost Range",null," Savings Range",null,null,"Detailed Measures",null,null,null,null,"Cost QC Calcs",null,null,null,null,null,"Measure Cost Range",null,"Energy Savings Calcs",null,null,null,null,null,"Measure Savings Range",null,"Upper Savings Limits"]
[null,"Measure Classification",null,"Measure Name","Cost","Site Energy Savings\n(MMBtu)","Source Energy Savings\n(MMBtu)","Source Energy Savings\n(%)",null,"Comment","Response",null,"Min \nCost","Max  \nCost","Min \nSavings\n(MMBtu)","Max \nSavings\n(MMBtu)",null,"Total Qty","Units","No. of Apartment\nUnits","Total SqFt","Lowrise/\nHighrise","QC Check?","Cost \nUnits","Min Measure\nCost (Upstate)","Max Measure\nCost (Upstate)","Min Measure\nCost (Downstate)","Max Measure\nCost (Downstate)","Min Measure\nCost","Max Measure \nCost","Savings\nUnits","EMS/Air Sealing/INS. $ Spent","Min Measure\nSavings Btu (Lowrise)","Max Measure\nSavings Btu (Lowrise)","Min Measure\nSavings Btu (Highrise)","Max Measure\nSavings Btu (Highrise)","Min Measure\nSavings\n(MMBtu)","Max Measure\nSavings\n(MMBtu)","Upper Limit Check?","Upper Limit Units","Upper Limit Savings\n(MMBtu)","Max Source Energy (%)","Cost Low?","Savings High?","Exceeds Upper Limit?",null,null,null,null,null,null,null,null,null,null,null,"Row Check"]
[null,{"$f":"'Measure Descriptions'!B8","v":1},{"$f":"'Measure Summary'!E8","v":""},{"$f":"'Measure Summary'!C8","v":""},{"$f":"'Measure Summary'!F8","v":0},{"$f":"'Measure Summary'!G8+'Measure Summary'!H8+('Measure Summary'!J8+'Measure Summary'!I8)*Calcs!$B$88","v":0},{"$f":"IFERROR(('Measure Summary'!I8+'Measure Summary'!J8)*Calcs!$B$88*Calcs!$B$89+('Measure Summary'!G8+'Measure Summary'!H8)*IF('Measure Summary'!N8=\"Natural Gas\",Calcs!$B$90,IF('Measure Summary'!N8=\"Fuel Oil\",Calcs!$B$91,IF('Measure Summary'!N8=\"Steam\",Calcs!$B$92,IF('Measure Summary'!N8=\"Propane\",Calcs!$B$93,Calcs!$B$94)))),0)","v":0},{"$f":"IF('Utility Info'!$E$20>0,G6/'Utility Info'!$E$20,0)","v":0},"*\n*\n*\n*\n*\n*",{"$f":"IFERROR(IF(AS6=\"Y\",\"This measure is being flagged as projecting savings above the maximum allowable site savings of \"&TEXT(AO6,\"#,###\")&\" MMBtu. Please check your assumptions and data inputs to lower the savings accordingly. This SAV-IT will not be approved until the savings are brought below the cap.\",IF(OR(AQ6=\"Y\",AR6=\"Y\")=TRUE,\"This measure is being flagged as either falling outside of the cost, site energy savings, or source energy savings typical values. Please refer to the guidance in the above instructions and respond accordingly.\",\"\")),\"\")","v":""},null,null,{"$f":"IF(ISERROR(AC6),\"\",AC6)","v":""},{"$f":"IF(ISERROR(AD6),\"\",AD6)","v":""},{"$f":"IF(ISERROR(AK6),\"\",AK6)","v":""},{"$f":"IF(ISERROR(AL6),\"\",AL6)","v":""},null,{"$f":"'Measure Summary'!W8","v":0},{"$f":"IF(C6=\"Other\",\"N/A\",VLOOKUP($C6,MeasureQCData,2,FALSE))","v":{"$error":"#N/A"}},{"$f":"Units","v":0},{"$f":"SqFt","v":0},{"$f":"Rise","v":0},{"$f":"IF(C6=\"Other\",\"Y\",VLOOKUP($C6,MeasureQCData,4,FALSE))","v":{"$error":"#N/A"}},{"$f":"IF(C6=\"Other\",\"N/A\",VLOOKUP($C6,MeasureQCData,9,FALSE))","v":{"$error":"#N/A"}},{"$f":"IF($X6=\"Each\",(VLOOKUP($C6,MeasureQCData,5,FALSE)*$R6),IF($X6=\"Unit\",(VLOOKUP($C6,MeasureQCData,5,FALSE)*$T6),IF($X6=\"Sqft\",(VLOOKUP($C6,MeasureQCData,5,FALSE)*$U6),IF($X6=\"MBH\",(VLOOKUP($C6,MeasureQCData,5,FALSE)*$R6),IF($X6=\"Ins. Sqft\",(VLOOKUP($C6,MeasureQCData,5,FALSE)*$R6),IF(X6=\"N/A\",\"N/A\",0))))))","v":{"$error":"#N/A"}},{"$f":"IF($X6=\"Each\",(VLOOKUP($C6,MeasureQCData,6,FALSE)*$R6),IF($X6=\"Unit\",(VLOOKUP($C6,MeasureQCData,6,FALSE)*$T6),IF($X6=\"Sqft\",(VLOOKUP($C6,MeasureQCData,6,FALSE)*$U6),IF($X6=\"MBH\",(VLOOKUP($C6,MeasureQCData,6,FALSE)*$R6),IF($X6=\"Ins. Sqft\",(VLOOKUP($C6,MeasureQCData,6,FALSE)*$R6),IF(X6=\"N/A\",\"N/A\",0))))))","v":{"$error":"#N/A"}},{"$f":"IF($X6=\"Each\",(VLOOKUP($C6,MeasureQCData,7,FALSE)*$R6),IF($X6=\"Unit\",(VLOOKUP($C6,MeasureQCData,7,FALSE)*$T6),IF($X6=\"Sqft\",(VLOOKUP($C6,MeasureQCData,7,FALSE)*$U6),IF($X6=\"MBH\",(VLOOKUP($C6,MeasureQCData,7,FALSE)*$R6),IF($X6=\"Ins. Sqft\",(VLOOKUP($C6,MeasureQCData,7,FALSE)*$R6),IF(X6=\"N/A\",\"N/A\",0))))))","v":{"$error":"#N/A"}},{"$f":"IF($X6=\"Each\",(VLOOKUP($C6,MeasureQCData,8,FALSE)*$R6),IF($X6=\"Unit\",(VLOOKUP($C6,MeasureQCData,8,FALSE)*$T6),IF($X6=\"Sqft\",(VLOOKUP($C6,MeasureQCData,8,FALSE)*$U6),IF($X6=\"MBH\",(VLOOKUP($C6,MeasureQCData,8,FALSE)*$R6),IF($X6=\"Ins. Sqft\",(VLOOKUP($C6,MeasureQCData,8,FALSE)*$R6),IF(X6=\"N/A\",\"N/A\",0))))))","v":{"$error":"#N/A"}},{"$f":"IF(Location=\"Upstate\",Y6,IF(Location=\"Downstate\",AA6,\"\"))","v":{"$error":"#N/A"}},{"$f":"IF(Location=\"Upstate\",Z6,IF(Location=\"Downstate\",AB6,\"\"))","v":{"$error":"#N/A"}},{"$f":"IF(C6=\"Other\",\"N/A\",VLOOKUP($C6,MeasureQCData,14,FALSE))","v":{"$error":"#N/A"}},{"$f":"IF(OR(C6=\"Energy Management System (EMS), Install\",C6=\"Air Sealing\",C6=\"Piping, DHW, Insulate\",C6=\"Piping, Heating, Insulate\",C6=\"Windows, Weatherstrip or Airseal\"),E6,\"N/A\")","v":"N/A"},{"$f":"IF($AE6=\"Each\",(VLOOKUP($C6,MeasureQCData,10,FALSE)*$R6),IF($AE6=\"Unit\",(VLOOKUP($C6,MeasureQCData,10,FALSE)*$T6),IF($AE6=\"Sqft\",(VLOOKUP($C6,MeasureQCData,10,FALSE)*$U6),IF($AE6=\"MBH\",(VLOOKUP($C6,MeasureQCData,10,FALSE)*$R6),IF($AE6=\"Ins. Sqft\",(VLOOKUP($C6,MeasureQCData,10,FALSE)*$R6),IF($AE6=\"$\",(VLOOKUP($C6,MeasureQCData,10,FALSE)*$AF6),IF($AE6=\"N/A\",\"N/A\",0)))))))","v":{"$error":"#N/A"}},{"$f":"IF($AE6=\"Each\",(VLOOKUP($C6,MeasureQCData,11,FALSE)*$R6),IF($AE6=\"Unit\",(VLOOKUP($C6,MeasureQCData,11,FALSE)*$T6),IF($AE6=\"Sqft\",(VLOOKUP($C6,MeasureQCData,11,FALSE)*$U6),IF($AE6=\"MBH\",(VLOOKUP($C6,MeasureQCData,11,FALSE)*$R6),IF($AE6=\"Ins. Sqft\",(VLOOKUP($C6,MeasureQCData,11,FALSE)*$R6),IF($AE6=\"$\",(VLOOKUP($C6,MeasureQCData,11,FALSE)*$AF6),IF($AE6=\"N/A\",\"N/A\",0)))))))","v":{"$error":"#N/A"}},{"$f":"IF($AE6=\"Each\",(VLOOKUP($C6,MeasureQCData,12,FALSE)*$R6),IF($AE6=\"Unit\",(VLOOKUP($C6,MeasureQCData,12,FALSE)*$T6),IF($AE6=\"Sqft\",(VLOOKUP($C6,MeasureQCData,12,FALSE)*$U6),IF($AE6=\"MBH\",(VLOOKUP($C6,MeasureQCData,12,FALSE)*$R6),IF($AE6=\"Ins. Sqft\",(VLOOKUP($C6,MeasureQCData,12,FALSE)*$R6),IF($AE6=\"$\",(VLOOKUP($C6,MeasureQCData,12,FALSE)*$AF6),IF($AE6=\"N/A\",\"N/A\",0)))))))","v":{"$error":"#N/A"}},{"$f":"IF($AE6=\"Each\",(VLOOKUP($C6,MeasureQCData,13,FALSE)*$R6),IF($AE6=\"Unit\",(VLOOKUP($C6,MeasureQCData,13,FALSE)*$T6),IF($AE6=\"Sqft\",(VLOOKUP($C6,MeasureQCData,13,FALSE)*$U6),IF($AE6=\"MBH\",(VLOOKUP($C6,MeasureQCData,13,FALSE)*$R6),IF($AE6=\"Ins. Sqft\",(VLOOKUP($C6,MeasureQCData,13,FALSE)*$R6),IF($AE6=\"$\",(VLOOKUP($C6,MeasureQCData,13,FALSE)*$AF6),IF($AE6=\"N/A\",\"N/A\",0)))))))","v":{"$error":"#N/A"}},{"$f":"IF(AE6=\"N/A\",\"N/A\",IF(Rise=\"Low\",AG6/1000000,IF(Rise=\"High\",AI6/1000000,\"\")))","v":{"$error":"#N/A"}},{"$f":"IF(AE6=\"N/A\",\"N/A\",IF(Rise=\"Low\",AH6/1000000,IF(Rise=\"High\",AJ6/1000000,\"\")))","v":{"$error":"#N/A"}},{"$f":"IF(C6=\"Other\",\"N\",VLOOKUP($C6,MeasureQCData,105,FALSE))","v":{"$error":"#N/A"}},{"$f":"IF(C6=\"Other\",\"N/A\",VLOOKUP($C6,MeasureQCData,107,FALSE))","v":{"$error":"#N/A"}},{"$f":"IF($AN6=\"Each\",(VLOOKUP($C6,MeasureQCData,106,FALSE)*$R6)/1000000,IF($AN6=\"Unit\",(VLOOKUP($C6,MeasureQCData,106,FALSE)*$T6)/1000000,IF($AN6=\"Sqft\",(VLOOKUP($C6,MeasureQCData,106,FALSE)*$U6)/1000000,IF($AN6=\"MBH\",(VLOOKUP($C6,MeasureQCData,106,FALSE)*$R6)/1000000,IF($AN6=\"Ins. Sqft\",(VLOOKUP($C6,MeasureQCData,106,FALSE)*$R6)/1000000,IF($AN6=\"Tons\",(VLOOKUP($C6,MeasureQCData,106,FALSE)*$R6)/1000000,IF($AN6=\"Total\",VLOOKUP($C6,MeasureQCData,106,FALSE)/1000000,\"N/A\")))))))","v":{"$error":"#N/A"}},{"$f":"IF(C6=\"Other\",\"N/A\",VLOOKUP($C6,MeasureQCData,16,FALSE))","v":{"$error":"#N/A"}},{"$f":"IF(W6=\"N\",\"N\",IF(E6<AC6,\"Y\",\"N\"))","v":{"$error":"#N/A"}},{"$f":"IF(W6=\"N\",\"N\",IF(OR(F6>AL6,H6>AP6),\"Y\",\"N\"))","v":{"$error":"#N/A"}},{"$f":"IF(AM6=\"N\",\"N\",IF(F6>AO6,\"Y\",\"N\"))","v":{"$error":"#N/A"}},null,null,null,null,null,null,null,null,null,null,null,{"$f":"IFERROR(IF(AND(OR(AQ6=\"y\",AR6=\"y\")=TRUE,K6=\"\")=TRUE,\"ERR\",\"\"),\"\")","v":""}]
[null,{"$f":"'Measure Descriptions'!B9","v":2},{"$f":"'Measure Summary'!E9","v":""},{"$f":"'Measure Summary'!C9","v":""},{"$f":"'Measure Summary'!F9","v":0},{"$f":"'Measure Summary'!G9+'Measure Summary'!H9+('Measure Summary'!J9+'Measure Summary'!I9)*Calcs!$B$88","v":0},{"$f":"IFERROR(('Measure Summary'!I9+'Measure Summary'!J9)*Calcs!$B$88*Calcs!$B$89+('Measure Summary'!G9+'Measure Summary'!H9)*IF('Measure Summary'!N9=\"Natural Gas\",Calcs!$B$90,IF('Measure Summary'!N9=\"Fuel Oil\",Calcs!$B$91,IF('Measure Summary'!N9=\"Steam\",Calcs!$B$92,IF('Measure Summary'!N9=\"Propane\",Calcs!$B$93,Calcs!$B$94)))),0)","v":0},{"$f":"IF('Utility Info'!$E$20>0,G7/'Utility Info'!$E$20,0)","v":0},"*\n*\n*\n*\n*\n*",{"$f":"IFERROR(IF(AS7=\"Y\",\"This measure is being flagged as projecting savings above the maximum allowable site savings of \"&TEXT(AO7,\"#,###\")&\" MMBtu. Please check your assumptions and data inputs to lower the savings accordingly. This SAV-IT will not be approved until the savings are brought below the cap.\",IF(OR(AQ7=\"Y\",AR7=\"Y\")=TRUE,\"This measure is being flagged as either falling outside of the cost, site energy savings, or source energy savings typical values. Please refer to the guidance in the above instructions and respond accordingly.\",\"\")),\"\")","v":""},null,null,{"$f":"IF(ISERROR(AC7),\"\",AC7)","v":""},"",{"$f":"IF(ISERROR(AK7),\"\",AK7)","v":""},"",null,{"$f":"'Measure Summary'!W9","v":0},{"$error":"#N/A"},0,0,0,{"$error":"#N/A"},{"$f":"IF(C7=\"Other\",\"N/A\",VLOOKUP($C7,MeasureQCData,9,FALSE))","v":{"$error":"#N/A"}},{"$error":"#N/A"},{"$error":"#N/A"},{"$error":"#N/A"},{"$error":"#N/A"},{"$error":"#N/A"},{"$error":"#N/A"},{"$f":"IF(C7=\"other\",\"N/A\",VLOOKUP($C7,MeasureQCData,14))","v":{"$error":"#N/A"}},"N/A",{"$error":"#N/A"},{"$error":"#N/A"},{"$error":"#N/A"},{"$error":"#N/A"},{"$error":"#N/A"},{"$error":"#N/A"},{"$error":"#N/A"},{"$error":"#N/A"},{"$error":"#N/A"},{"$error":"#N/A"},{"$error":"#N/A"},{"$error":"#N/A"},{"$f":"IF(AM7=\"N\",\"N\",IF(F7>AO7,\"Y\",\"N\"))","v":{"$error":"#N/A"}},null,null,null,null,null,null,null,null,null,null,null,{"$f":"IFERROR(IF(AND(OR(AQ7=\"y\",AR7=\"y\")=TRUE,K7=\"\")=TRUE,\"ERR\",\"\"),\"\")","v":""}]
[null,{"$f":"'Measure Descriptions'!B10","v":3},{"$f":"'Measure Summary'!E10","v":""},{"$f":"'Measure Summary'!C10","v":""},{"$f":"'Measure Summary'!F10","v":0},{"$f":"'Measure Summary'!G10+'Measure Summary'!H10+('Measure Summary'!J10+'Measure Summary'!I10)*Calcs!$B$88","v":0},{"$f":"IFERROR(('Measure Summary'!I10+'Measure Summary'!J10)*Calcs!$B$88*Calcs!$B$89+('Measure Summary'!G10+'Measure Summary'!H10)*IF('Measure Summary'!N10=\"Natural Gas\",Calcs!$B$90,IF('Measure Summary'!N10=\"Fuel Oil\",Calcs!$B$91,IF('Measure Summary'!N10=\"Steam\",Calcs!$B$92,IF('Measure Summary'!N10=\"Propane\",Calcs!$B$93,Calcs!$B$94)))),0)","v":0},{"$f":"IF('Utility Info'!$E$20>0,G8/'Utility Info'!$E$20,0)","v":0},"*\n*\n*\n*\n*\n*","",null,null,"","","","",null,{"$f":"'Measure Summary'!W10","v":0},{"$error":"#N/A"},0,0,0,{"$error":"#N/A"},{"$f":"IF(C8=\"Other\",\"N/A\",VLOOKUP($C8,MeasureQCData,9))","v":{"$error":"#N/A"}},{"$error":"#N/A"},{"$error":"#N/A"},{"$error":"#N/A"},{"$error":"#N/A"},{"$error":"#N/A"},{"$error":"#N/A"},{"$error":"#N/A"},"N/A",{"$error":"#N/A"},{"$error":"#N/A"},{"$error":"#N/A"},{"$error":"#N/A"},{"$error":"#N/A"},{"$error":"#N/A"},{"$error":"#N/A"},{"$error":"#N/A"},{"$error":"#N/A"},{"$error":"#N/A"},{"$error":"#N/A"},{"$error":"#N/A"},{"$error":"#N/A"},null,null,null,null,null,null,null,null,null,null,null,""]
[null,{"$f":"'Measure Descriptions'!B11","v":4},{"$f":"'Measure Summary'!E11","v":""},{"$f":"'Measure Summary'!C11","v":""},{"$f":"'Measure Summary'!F11","v":0},{"$f":"'Measure Summary'!G11+'Measure Summary'!H11+('Measure Summary'!J11+'Measure Summary'!I11)*Calcs!$B$88","v":0},{"$f":"IFERROR(('Measure Summary'!I11+'Measure Summary'!J11)*Calcs!$B$88*Calcs!$B$89+('Measure Summary'!G11+'Measure Summary'!H11)*IF('Measure Summary'!N11=\"Natural Gas\",Calcs!$B$90,IF('Measure Summary'!N11=\"Fuel Oil\",Calcs!$B$91,IF('Measure Summary'!N11=\"Steam\",Calcs!$B$92,IF('Measure Summary'!N11=\"Propane\",Calcs!$B$93,Calcs!$B$94)))),0)","v":0},{"$f":"IF('Utility Info'!$E$20>0,G9/'Utility Info'!$E$20,0)","v":0},"*\n*\n*\n*\n*\n*","",null,null,"","","","",null,{"$f":"'Measure Summary'!W11","v":0},{"$error":"#N/A"},0,0,0,{"$error":"#N/A"},{"$error":"#N/A"},{"$error":"#N/A"},{"$error":"#N/A"},{"$error":"#N/A"},{"$error":"#N/A"},{"$error":"#N/A"},{"$error":"#N/A"},{"$error":"#N/A"},"N/A",{"$error":"#N/A"},{"$error":"#N/A"},{"$error":"#N/A"},{"$error":"#N/A"},{"$error":"#N/A"},{"$error":"#N/A"},{"$error":"#N/A"},{"$error":"#N/A"},{"$error":"#N/A"},{"$error":"#N/A"},{"$error":"#N/A"},{"$error":"#N/A"},{"$error":"#N/A"},null,null,null,null,null,null,null,null,null,null,null,""]
[null,{"$f":"'Measure Descriptions'!B12","v":5},{"$f":"'Measure Summary'!E12","v":""},{"$f":"'Measure Summary'!C12","v":""},{"$f":"'Measure Summary'!F12","v":0},{"$f":"'Measure Summary'!G12+'Measure Summary'!H12+('Measure Summary'!J12+'Measure Summary'!I12)*Calcs!$B$88","v":0},{"$f":"IFERROR(('Measure Summary'!I12+'Measure Summary'!J12)*Calcs!$B$88*Calcs!$B$89+('Measure Summary'!G12+'Measure Summary'!H12)*IF('Measure Summary'!N12=\"Natural Gas\",Calcs!$B$90,IF('Measure Summary'!N12=\"Fuel Oil\",Calcs!$B$91,IF('Measure Summary'!N12=\"Steam\",Calcs!$B$92,IF('Measure Summary'!N12=\"Propane\",Calcs!$B$93,Calcs!$B$94)))),0)","v":0},{"$f":"IF('Utility Info'!$E$20>0,G10/'Utility Info'!$E$20,0)","v":0},"*\n*\n*\n*\n*\n*","",null,null,"","","","",null,{"$f":"'Measure Summary'!W12","v":0},{"$error":"#N/A"},0,0,0,{"$error":"#N/A"},{"$error":"#N/A"},{"$error":"#N/A"},{"$error":"#N/A"},{"$error":"#N/A"},{"$error":"#N/A"},{"$error":"#N/A"},{"$error":"#N/A"},{"$error":"#N/A"},"N/A",{"$error":"#N/A"},{"$error":"#N/A"},{"$error":"#N/A"},{"$error":"#N/A"},{"$error":"#N/A"},{"$error":"#N/A"},{"$error":"#N/A"},{"$error":"#N/A"},{"$error":"#N/A"},{"$error":"#N/A"},{"$error":"#N/A"},{"$error":"#N/A"},{"$error":"#N/A"},null,null,null,null,null,null,null,null,null,null,null,""]
[null,{"$f":"'Measure Descriptions'!B13","v":6},{"$f":"'Measure Summary'!E13","v":""},{"$f":"'Measure Summary'!C13","v":""},{"$f":"'Measure Summary'!F13","v":0},{"$f":"'Measure Summary'!G13+'Measure Summary'!H13+('Measure Summary'!J13+'Measure Summary'!I13)*Calcs!$B$88","v":0},{"$f":"IFERROR(('Measure Summary'!I13+'Measure Summary'!J13)*Calcs!$B$88*Calcs!$B$89+('Measure Summary'!G13+'Measure Summary'!H13)*IF('Measure Summary'!N13=\"Natural Gas\",Calcs!$B$90,IF('Measure Summary'!N13=\"Fuel Oil\",Calcs!$B$91,IF('Measure Summary'!N13=\"Steam\",Calcs!$B$92,IF('Measure Summary'!N13=\"Propane\",Calcs!$B$93,Calcs!$B$94)))),0)","v":0},{"$f":"IF('Utility Info'!$E$20>0,G11/'Utility Info'!$E$20,0)","v":0},"*\n*\n*\n*\n*\n*","",null,null,"","","","",null,{"$f":"'Measure Summary'!W13","v":0},{"$error":"#N/A"},0,0,0,{"$error":"#N/A"},{"$error":"#N/A"},{"$error":"#N/A"},{"$error":"#N/A"},{"$error":"#N/A"},{"$error":"#N/A"},{"$error":"#N/A"},{"$error":"#N/A"},{"$error":"#N/A"},"N/A",{"$error":"#N/A"},{"$error":"#N/A"},{"$error":"#N/A"},{"$error":"#N/A"},{"$error":"#N/A"},{"$error":"#N/A"},{"$error":"#N/A"},{"$error":"#N/A"},{"$error":"#N/A"},{"$error":"#N/A"},{"$error":"#N/A"},{"$error":"#N/A"},{"$error":"#N/A"},null,null,null,null,null,null,null,null,null,null,null,""]
[null,{"$f":"'Measure Descriptions'!B14","v":7},{"$f":"'Measure Summary'!E14","v":""},{"$f":"'Measure Summary'!C14","v":""},{"$f":"'Measure Summary'!F14","v":0},{"$f":"'Measure Summary'!G14+'Measure Summary'!H14+('Measure Summary'!J14+'Measure Summary'!I14)*Calcs!$B$88","v":0},{"$f":"IFERROR(('Measure Summary'!I14+'Measure Summary'!J14)*Calcs!$B$88*Calcs!$B$89+('Measure Summary'!G14+'Measure Summary'!H14)*IF('Measure Summary'!N14=\"Natural Gas\",Calcs!$B$90,IF('Measure Summary'!N14=\"Fuel Oil\",Calcs!$B$91,IF('Measure Summary'!N14=\"Steam\",Calcs!$B$92,IF('Measure Summary'!N14=\"Propane\",Calcs!$B$93,Calcs!$B$94)))),0)","v":0},{"$f":"IF('Utility Info'!$E$20>0,G12/'Utility Info'!$E$20,0)","v":0},"*\n*\n*\n*\n*\n*","",null,null,"","","","",null,{"$f":"'Measure Summary'!W14","v":0},{"$error":"#N/A"},0,0,0,{"$error":"#N/A"},{"$error":"#N/A"},{"$error":"#N/A"},{"$error":"#N/A"},{"$error":"#N/A"},{"$error":"#N/A"},{"$error":"#N/A"},{"$error":"#N/A"},{"$error":"#N/A"},"N/A",{"$error":"#N/A"},{"$error":"#N/A"},{"$error":"#N/A"},{"$error":"#N/A"},{"$error":"#N/A"},{"$error":"#N/A"},{"$error":"#N/A"},{"$error":"#N/A"},{"$error":"#N/A"},{"$error":"#N/A"},{"$error":"#N/A"},{"$error":"#N/A"},{"$error":"#N/A"},null,null,null,null,null,null,null,null,null,null,null,""]
[null,{"$f":"'Measure Descriptions'!B15","v":8},{"$f":"'Measure Summary'!E15","v":""},{"$f":"'Measure Summary'!C15","v":""},{"$f":"'Measure Summary'!F15","v":0},{"$f":"'Measure Summary'!G15+'Measure Summary'!H15+('Measure Summary'!J15+'Measure Summary'!I15)*Calcs!$B$88","v":0},{"$f":"IFERROR(('Measure Summary'!I15+'Measure Summary'!J15)*Calcs!$B$88*Calcs!$B$89+('Measure Summary'!G15+'Measure Summary'!H15)*IF('Measure Summary'!N15=\"Natural Gas\",Calcs!$B$90,IF('Measure Summary'!N15=\"Fuel Oil\",Calcs!$B$91,IF('Measure Summary'!N15=\"Steam\",Calcs!$B$92,IF('Measure Summary'!N15=\"Propane\",Calcs!$B$93,Calcs!$B$94)))),0)","v":0},{"$f":"IF('Utility Info'!$E$20>0,G13/'Utility Info'!$E$20,0)","v":0},"*\n*\n*\n*\n*\n*","",null,null,"","","","",null,{"$f":"'Measure Summary'!W15","v":0},{"$error":"#N/A"},0,0,0,{"$error":"#N/A"},{"$error":"#N/A"},{"$error":"#N/A"},{"$error":"#N/A"},{"$error":"#N/A"},{"$error":"#N/A"},{"$error":"#N/A"},{"$error":"#N/A"},{"$error":"#N/A"},"N/A",{"$error":"#N/A"},{"$error":"#N/A"},{"$error":"#N/A"},{"$error":"#N/A"},{"$error":"#N/A"},{"$error":"#N/A"},{"$error":"#N/A"},{"$error":"#N/A"},{"$error":"#N/A"},{"$error":"#N/A"},{"$error":"#N/A"},{"$error":"#N/A"},{"$error":"#N/A"},null,null,null,null,null,null,null,null,null,null,null,""]
[null,{"$f":"'Measure Descriptions'!B16","v":9},{"$f":"'Measure Summary'!E16","v":""},{"$f":"'Measure Summary'!C16","v":""},{"$f":"'Measure Summary'!F16","v":0},{"$f":"'Measure Summary'!G16+'Measure Summary'!H16+('Measure Summary'!J16+'Measure Summary'!I16)*Calcs!$B$88","v":0},{"$f":"IFERROR(('Measure Summary'!I16+'Measure Summary'!J16)*Calcs!$B$88*Calcs!$B$89+('Measure Summary'!G16+'Measure Summary'!H16)*IF('Measure Summary'!N16=\"Natural Gas\",Calcs!$B$90,IF('Measure Summary'!N16=\"Fuel Oil\",Calcs!$B$91,IF('Measure Summary'!N16=\"Steam\",Calcs!$B$92,IF('Measure Summary'!N16=\"Propane\",Calcs!$B$93,Calcs!$B$94)))),0)","v":0},{"$f":"IF('Utility Info'!$E$20>0,G14/'Utility Info'!$E$20,0)","v":0},"*\n*\n*\n*\n*\n*","",null,null,"","","","",null,{"$f":"'Measure Summary'!W16","v":0},{"$error":"#N/A"},0,0,0,{"$error":"#N/A"},{"$error":"#N/A"},{"$error":"#N/A"},{"$error":"#N/A"},{"$error":"#N/A"},{"$error":"#N/A"},{"$error":"#N/A"},{"$error":"#N/A"},{"$error":"#N/A"},"N/A",{"$error":"#N/A"},{"$error":"#N/A"},{"$error":"#N/A"},{"$error":"#N/A"},{"$error":"#N/A"},{"$error":"#N/A"},{"$error":"#N/A"},{"$error":"#N/A"},{"$error":"#N/A"},{"$error":"#N/A"},{"$error":"#N/A"},{"$error":"#N/A"},{"$error":"#N/A"},null,null,null,null,null,null,null,null,null,null,null,""]
[null,{"$f":"'Measure Descriptions'!B17","v":10},{"$f":"'Measure Summary'!E17","v":""},{"$f":"'Measure Summary'!C17","v":""},{"$f":"'Measure Summary'!F17","v":0},{"$f":"'Measure Summary'!G17+'Measure Summary'!H17+('Measure Summary'!J17+'Measure Summary'!I17)*Calcs!$B$88","v":0},{"$f":"IFERROR(('Measure Summary'!I17+'Measure Summary'!J17)*Calcs!$B$88*Calcs!$B$89+('Measure Summary'!G17+'Measure Summary'!H17)*IF('Measure Summary'!N17=\"Natural Gas\",Calcs!$B$90,IF('Measure Summary'!N17=\"Fuel Oil\",Calcs!$B$91,IF('Measure Summary'!N17=\"Steam\",Calcs!$B$92,IF('Measure Summary'!N17=\"Propane\",Calcs!$B$93,Calcs!$B$94)))),0)","v":0},{"$f":"IF('Utility Info'!$E$20>0,G15/'Utility Info'!$E$20,0)","v":0},"*\n*\n*\n*\n*\n*","",null,null,"","","","",null,{"$f":"'Measure Summary'!W17","v":0},{"$error":"#N/A"},0,0,0,{"$error":"#N/A"},{"$error":"#N/A"},{"$error":"#N/A"},{"$error":"#N/A"},{"$error":"#N/A"},{"$error":"#N/A"},{"$error":"#N/A"},{"$error":"#N/A"},{"$error":"#N/A"},"N/A",{"$error":"#N/A"},{"$error":"#N/A"},{"$error":"#N/A"},{"$error":"#N/A"},{"$error":"#N/A"},{"$error":"#N/A"},{"$error":"#N/A"},{"$error":"#N/A"},{"$error":"#N/A"},{"$error":"#N/A"},{"$error":"#N/A"},{"$error":"#N/A"},{"$error":"#N/A"},null,null,null,null,null,null,null,null,null,null,null,""]
[null,{"$f":"'Measure Descriptions'!B18","v":11},{"$f":"'Measure Summary'!E18","v":""},{"$f":"'Measure Summary'!C18","v":""},{"$f":"'Measure Summary'!F18","v":0},{"$f":"'Measure Summary'!G18+'Measure Summary'!H18+('Measure Summary'!J18+'Measure Summary'!I18)*Calcs!$B$88","v":0},{"$f":"IFERROR(('Measure Summary'!I18+'Measure Summary'!J18)*Calcs!$B$88*Calcs!$B$89+('Measure Summary'!G18+'Measure Summary'!H18)*IF('Measure Summary'!N18=\"Natural Gas\",Calcs!$B$90,IF('Measure Summary'!N18=\"Fuel Oil\",Calcs!$B$91,IF('Measure Summary'!N18=\"Steam\",Calcs!$B$92,IF('Measure Summary'!N18=\"Propane\",Calcs!$B$93,Calcs!$B$94)))),0)","v":0},{"$f":"IF('Utility Info'!$E$20>0,G16/'Utility Info'!$E$20,0)","v":0},"*\n*\n*\n*\n*\n*","",null,null,"","","","",null,{"$f":"'Measure Summary'!W18","v":0},{"$error":"#N/A"},0,0,0,{"$error":"#N/A"},{"$error":"#N/A"},{"$error":"#N/A"},{"$error":"#N/A"},{"$error":"#N/A"},{"$error":"#N/A"},{"$error":"#N/A"},{"$error":"#N/A"},{"$error":"#N/A"},"N/A",{"$error":"#N/A"},{"$error":"#N/A"},{"$error":"#N/A"},{"$error":"#N/A"},{"$error":"#N/A"},{"$error":"#N/A"},{"$error":"#N/A"},{"$error":"#N/A"},{"$error":"#N/A"},{"$error":"#N/A"},{"$error":"#N/A"},{"$error":"#N/A"},{"$error":"#N/A"},null,null,null,null,null,null,null,null,null,null,null,""]
[null,{"$f":"'Measure Descriptions'!B19","v":12},{"$f":"'Measure Summary'!E19","v":""},{"$f":"'Measure Summary'!C19","v":""},{"$f":"'Measure Summary'!F19","v":0},{"$f":"'Measure Summary'!G19+'Measure Summary'!H19+('Measure Summary'!J19+'Measure Summary'!I19)*Calcs!$B$88","v":0},{"$f":"IFERROR(('Measure Summary'!I19+'Measure Summary'!J19)*Calcs!$B$88*Calcs!$B$89+('Measure Summary'!G19+'Measure Summary'!H19)*IF('Measure Summary'!N19=\"Natural Gas\",Calcs!$B$90,IF('Measure Summary'!N19=\"Fuel Oil\",Calcs!$B$91,IF('Measure Summary'!N19=\"Steam\",Calcs!$B$92,IF('Measure Summary'!N19=\"Propane\",Calcs!$B$93,Calcs!$B$94)))),0)","v":0},{"$f":"IF('Utility Info'!$E$20>0,G17/'Utility Info'!$E$20,0)","v":0},"*\n*\n*\n*\n*\n*","",null,null,"","","","",null,{"$f":"'Measure Summary'!W19","v":0},{"$error":"#N/A"},0,0,0,{"$error":"#N/A"},{"$error":"#N/A"},{"$error":"#N/A"},{"$error":"#N/A"},{"$error":"#N/A"},{"$error":"#N/A"},{"$error":"#N/A"},{"$error":"#N/A"},{"$error":"#N/A"},"N/A",{"$error":"#N/A"},{"$error":"#N/A"},{"$error":"#N/A"},{"$error":"#N/A"},{"$error":"#N/A"},{"$error":"#N/A"},{"$error":"#N/A"},{"$error":"#N/A"},{"$error":"#N/A"},{"$error":"#N/A"},{"$error":"#N/A"},{"$error":"#N/A"},{"$error":"#N/A"},null,null,null,null,null,null,null,null,null,null,null,""]
[null,{"$f":"'Measure Descriptions'!B20","v":13},{"$f":"'Measure Summary'!E20","v":""},{"$f":"'Measure Summary'!C20","v":""},{"$f":"'Measure Summary'!F20","v":0},{"$f":"'Measure Summary'!G20+'Measure Summary'!H20+('Measure Summary'!J20+'Measure Summary'!I20)*Calcs!$B$88","v":0},{"$f":"IFERROR(('Measure Summary'!I20+'Measure Summary'!J20)*Calcs!$B$88*Calcs!$B$89+('Measure Summary'!G20+'Measure Summary'!H20)*IF('Measure Summary'!N20=\"Natural Gas\",Calcs!$B$90,IF('Measure Summary'!N20=\"Fuel Oil\",Calcs!$B$91,IF('Measure Summary'!N20=\"Steam\",Calcs!$B$92,IF('Measure Summary'!N20=\"Propane\",Calcs!$B$93,Calcs!$B$94)))),0)","v":0},{"$f":"IF('Utility Info'!$E$20>0,G18/'Utility Info'!$E$20,0)","v":0},"*\n*\n*\n*\n*\n*","",null,null,"","","","",null,{"$f":"'Measure Summary'!W20","v":0},{"$error":"#N/A"},0,0,0,{"$error":"#N/A"},{"$error":"#N/A"},{"$error":"#N/A"},{"$error":"#N/A"},{"$error":"#N/A"},{"$error":"#N/A"},{"$error":"#N/A"},{"$error":"#N/A"},{"$error":"#N/A"},"N/A",{"$error":"#N/A"},{"$error":"#N/A"},{"$error":"#N/A"},{"$error":"#N/A"},{"$error":"#N/A"},{"$error":"#N/A"},{"$error":"#N/A"},{"$error":"#N/A"},{"$error":"#N/A"},{"$error":"#N/A"},{"$error":"#N/A"},{"$error":"#N/A"},{"$error":"#N/A"},null,null,null,null,null,null,null,null,null,null,null,""]
[null,{"$f":"'Measure Descriptions'!B21","v":14},{"$f":"'Measure Summary'!E21","v":""},{"$f":"'Measure Summary'!C21","v":""},{"$f":"'Measure Summary'!F21","v":0},{"$f":"'Measure Summary'!G21+'Measure Summary'!H21+('Measure Summary'!J21+'Measure Summary'!I21)*Calcs!$B$88","v":0},{"$f":"IFERROR(('Measure Summary'!I21+'Measure Summary'!J21)*Calcs!$B$88*Calcs!$B$89+('Measure Summary'!G21+'Measure Summary'!H21)*IF('Measure Summary'!N21=\"Natural Gas\",Calcs!$B$90,IF('Measure Summary'!N21=\"Fuel Oil\",Calcs!$B$91,IF('Measure Summary'!N21=\"Steam\",Calcs!$B$92,IF('Measure Summary'!N21=\"Propane\",Calcs!$B$93,Calcs!$B$94)))),0)","v":0},{"$f":"IF('Utility Info'!$E$20>0,G19/'Utility Info'!$E$20,0)","v":0},"*\n*\n*\n*\n*\n*","",null,null,"","","","",null,{"$f":"'Measure Summary'!W21","v":0},{"$error":"#N/A"},0,0,0,{"$error":"#N/A"},{"$error":"#N/A"},{"$error":"#N/A"},{"$error":"#N/A"},{"$error":"#N/A"},{"$error":"#N/A"},{"$error":"#N/A"},{"$error":"#N/A"},{"$error":"#N/A"},"N/A",{"$error":"#N/A"},{"$error":"#N/A"},{"$error":"#N/A"},{"$error":"#N/A"},{"$error":"#N/A"},{"$error":"#N/A"},{"$error":"#N/A"},{"$error":"#N/A"},{"$error":"#N/A"},{"$error":"#N/A"},{"$error":"#N/A"},{"$error":"#N/A"},{"$error":"#N/A"},null,null,null,null,null,null,null,null,null,null,null,""]
[null,{"$f":"'Measure Descriptions'!B22","v":15},{"$f":"'Measure Summary'!E22","v":""},{"$f":"'Measure Summary'!C22","v":""},{"$f":"'Measure Summary'!F22","v":0},{"$f":"'Measure Summary'!G22+'Measure Summary'!H22+('Measure Summary'!J22+'Measure Summary'!I22)*Calcs!$B$88","v":0},{"$f":"IFERROR(('Measure Summary'!I22+'Measure Summary'!J22)*Calcs!$B$88*Calcs!$B$89+('Measure Summary'!G22+'Measure Summary'!H22)*IF('Measure Summary'!N22=\"Natural Gas\",Calcs!$B$90,IF('Measure Summary'!N22=\"Fuel Oil\",Calcs!$B$91,IF('Measure Summary'!N22=\"Steam\",Calcs!$B$92,IF('Measure Summary'!N22=\"Propane\",Calcs!$B$93,Calcs!$B$94)))),0)","v":0},{"$f":"IF('Utility Info'!$E$20>0,G20/'Utility Info'!$E$20,0)","v":0},"*\n*\n*\n*\n*\n*","",null,null,"","","","",null,{"$f":"'Measure Summary'!W22","v":0},{"$error":"#N/A"},0,0,0,{"$error":"#N/A"},{"$error":"#N/A"},{"$error":"#N/A"},{"$error":"#N/A"},{"$error":"#N/A"},{"$error":"#N/A"},{"$error":"#N/A"},{"$error":"#N/A"},{"$error":"#N/A"},"N/A",{"$error":"#N/A"},{"$error":"#N/A"},{"$error":"#N/A"},{"$error":"#N/A"},{"$error":"#N/A"},{"$error":"#N/A"},{"$error":"#N/A"},{"$f":"IF(C20=\"Other\",\"N\",VLOOKUP($C20,MeasureQCData,107,FALSE))","v":{"$error":"#N/A"}},{"$error":"#N/A"},{"$error":"#N/A"},{"$error":"#N/A"},{"$error":"#N/A"},{"$error":"#N/A"},null,null,null,null,null,null,null,null,null,null,null,""]
[]
[null,{"$f":"'Measure Descriptions'!B24","v":16},{"$f":"'Measure Summary'!E24","v":""},{"$f":"'Measure Summary'!C24","v":""},{"$f":"'Measure Summary'!F24","v":0},{"$f":"'Measure Summary'!G24+'Measure Summary'!H24+('Measure Summary'!J24+'Measure Summary'!I24)*Calcs!$B$88","v":0},{"$f":"IFERROR(('Measure Summary'!I24+'Measure Summary'!J24)*Calcs!$B$88*Calcs!$B$89+('Measure Summary'!G24+'Measure Summary'!H24)*IF('Measure Summary'!N24=\"Natural Gas\",Calcs!$B$90,IF('Measure Summary'!N24=\"Fuel Oil\",Calcs!$B$91,IF('Measure Summary'!N24=\"Steam\",Calcs!$B$92,IF('Measure Summary'!N24=\"Propane\",Calcs!$B$93,Calcs!$B$94)))),0)","v":0},{"$f":"IF('Utility Info'!$E$20>0,G22/'Utility Info'!$E$20,0)","v":0},"*\n*\n*\n*\n*\n*","",null,null,"","","","",null,{"$f":"'Measure Summary'!W24","v":0},{"$f":"IF(C22=\"Other\",\"N/A\",VLOOKUP($C22,MeasureQCData,2,FALSE))","v":{"$error":"#N/A"}},0,0,0,{"$f":"IF(C22=\"Other\",\"Y\",VLOOKUP($C22,MeasureQCData,4,FALSE))","v":{"$error":"#N/A"}},{"$f":"IF(C22=\"Other\",\"N/A\",VLOOKUP($C22,MeasureQCData,9))","v":{"$error":"#N/A"}},{"$f":"IF($X22=\"Each\",(VLOOKUP($C22,MeasureQCData,5,FALSE)*$R22),IF($X22=\"Unit\",(VLOOKUP($C22,MeasureQCData,5,FALSE)*$T22),IF($X22=\"Sqft\",(VLOOKUP($C22,MeasureQCData,5,FALSE)*$U22),IF($X22=\"MBH\",(VLOOKUP($C22,MeasureQCData,5,FALSE)*$R22),IF($X22=\"Ins. Sqft\",(VLOOKUP($C22,MeasureQCData,5,FALSE)*$R22),IF(X22=\"N/A\",\"N/A\",0))))))","v":{"$error":"#N/A"}},{"$f":"IF($X22=\"Each\",(VLOOKUP($C22,MeasureQCData,6,FALSE)*$R22),IF($X22=\"Unit\",(VLOOKUP($C22,MeasureQCData,6,FALSE)*$T22),IF($X22=\"Sqft\",(VLOOKUP($C22,MeasureQCData,6,FALSE)*$U22),IF($X22=\"MBH\",(VLOOKUP($C22,MeasureQCData,6,FALSE)*$R22),IF($X22=\"Ins. Sqft\",(VLOOKUP($C22,MeasureQCData,6,FALSE)*$R22),IF(X22=\"N/A\",\"N/A\",0))))))","v":{"$error":"#N/A"}},{"$f":"IF($X22=\"Each\",(VLOOKUP($C22,MeasureQCData,7,FALSE)*$R22),IF($X22=\"Unit\",(VLOOKUP($C22,MeasureQCData,7,FALSE)*$T22),IF($X22=\"Sqft\",(VLOOKUP($C22,MeasureQCData,7,FALSE)*$U22),IF($X22=\"MBH\",(VLOOKUP($C22,MeasureQCData,7,FALSE)*$R22),IF($X22=\"Ins. Sqft\",(VLOOKUP($C22,MeasureQCData,7,FALSE)*$R22),IF(X22=\"N/A\",\"N/A\",0))))))","v":{"$error":"#N/A"}},{"$f":"IF($X22=\"Each\",(VLOOKUP($C22,MeasureQCData,8,FALSE)*$R22),IF($X22=\"Unit\",(VLOOKUP($C22,MeasureQCData,8,FALSE)*$T22),IF($X22=\"Sqft\",(VLOOKUP($C22,MeasureQCData,8,FALSE)*$U22),IF($X22=\"MBH\",(VLOOKUP($C22,MeasureQCData,8,FALSE)*$R22),IF($X22=\"Ins. Sqft\",(VLOOKUP($C22,MeasureQCData,8,FALSE)*$R22),IF(X22=\"N/A\",\"N/A\",0))))))","v":{"$error":"#N/A"}},{"$error":"#N/A"},{"$error":"#N/A"},{"$f":"IF(C22=\"other\",\"N/A\",VLOOKUP($C22,MeasureQCData,14))","v":{"$error":"#N/A"}},{"$f":"IF(OR(C22=\"Energy Management System (EMS), Install\",C22=\"Air Sealing\",C22=\"Piping, DHW, Insulate\",C22=\"Piping, Heating, Insulate\",C22=\"Windows, Weatherstrip or Airseal\"),E22,\"N/A\")","v":"N/A"},{"$f":"IF($AE22=\"Each\",(VLOOKUP($C22,MeasureQCData,10,FALSE)*$R22),IF($AE22=\"Unit\",(VLOOKUP($C22,MeasureQCData,10,FALSE)*$T22),IF($AE22=\"Sqft\",(VLOOKUP($C22,MeasureQCData,10,FALSE)*$U22),IF($AE22=\"MBH\",(VLOOKUP($C22,MeasureQCData,10,FALSE)*$R22),IF($AE22=\"Ins. Sqft\",(VLOOKUP($C22,MeasureQCData,10,FALSE)*$R22),IF($AE22=\"$\",(VLOOKUP($C22,MeasureQCData,10,FALSE)*$AF22),IF($AE22=\"N/A\",\"N/A\",0)))))))","v":{"$error":"#N/A"}},{"$f":"IF($AE22=\"Each\",(VLOOKUP($C22,MeasureQCData,11,FALSE)*$R22),IF($AE22=\"Unit\",(VLOOKUP($C22,MeasureQCData,11,FALSE)*$T22),IF($AE22=\"Sqft\",(VLOOKUP($C22,MeasureQCData,11,FALSE)*$U22),IF($AE22=\"MBH\",(VLOOKUP($C22,MeasureQCData,11,FALSE)*$R22),IF($AE22=\"Ins. Sqft\",(VLOOKUP($C22,MeasureQCData,11,FALSE)*$R22),IF($AE22=\"$\",(VLOOKUP($C22,MeasureQCData,11,FALSE)*$AF22),IF($AE22=\"N/A\",\"N/A\",0)))))))","v":{"$error":"#N/A"}},{"$f":"IF($AE22=\"Each\",(VLOOKUP($C22,MeasureQCData,12,FALSE)*$R22),IF($AE22=\"Unit\",(VLOOKUP($C22,MeasureQCData,12,FALSE)*$T22),IF($AE22=\"Sqft\",(VLOOKUP($C22,MeasureQCData,12,FALSE)*$U22),IF($AE22=\"MBH\",(VLOOKUP($C22,MeasureQCData,12,FALSE)*$R22),IF($AE22=\"Ins. Sqft\",(VLOOKUP($C22,MeasureQCData,12,FALSE)*$R22),IF($AE22=\"$\",(VLOOKUP($C22,MeasureQCData,12,FALSE)*$AF22),IF($AE22=\"N/A\",\"N/A\",0)))))))","v":{"$error":"#N/A"}},{"$f":"IF($AE22=\"Each\",(VLOOKUP($C22,MeasureQCData,13,FALSE)*$R22),IF($AE22=\"Unit\",(VLOOKUP($C22,MeasureQCData,13,FALSE)*$T22),IF($AE22=\"Sqft\",(VLOOKUP($C22,MeasureQCData,13,FALSE)*$U22),IF($AE22=\"MBH\",(VLOOKUP($C22,MeasureQCData,13,FALSE)*$R22),IF($AE22=\"Ins. Sqft\",(VLOOKUP($C22,MeasureQCData,13,FALSE)*$R22),IF($AE22=\"$\",(VLOOKUP($C22,MeasureQCData,13,FALSE)*$AF22),IF($AE22=\"N/A\",\"N/A\",0)))))))","v":{"$error":"#N/A"}},{"$error":"#N/A"},{"$error":"#N/A"},{"$f":"IF(C22=\"Other\",\"N\",VLOOKUP($C22,MeasureQCData,105,FALSE))","v":{"$error":"#N/A"}},{"$f":"IF(C22=\"Other\",\"N\",VLOOKUP($C22,MeasureQCData,107,FALSE))","v":{"$error":"#N/A"}},{"$f":"IF($AN22=\"Each\",(VLOOKUP($C22,MeasureQCData,106,FALSE)*$R22)/1000000,IF($AN22=\"Unit\",(VLOOKUP($C22,MeasureQCData,106,FALSE)*$T22)/1000000,IF($AN22=\"Sqft\",(VLOOKUP($C22,MeasureQCData,106,FALSE)*$U22)/1000000,IF($AN22=\"MBH\",(VLOOKUP($C22,MeasureQCData,106,FALSE)*$R22)/1000000,IF($AN22=\"Ins. Sqft\",(VLOOKUP($C22,MeasureQCData,106,FALSE)*$R22)/1000000,IF($AN22=\"Tons\",(VLOOKUP($C22,MeasureQCData,106,FALSE)*$R22)/1000000,IF($AN22=\"Total\",VLOOKUP($C22,MeasureQCData,106,FALSE)/1000000,\"N/A\")))))))","v":{"$error":"#N/A"}},{"$f":"IF(C22=\"Other\",\"N/A\",VLOOKUP($C22,MeasureQCData,16,FALSE))","v":{"$error":"#N/A"}},{"$f":"IF(W22=\"N\",\"N\",IF(E22<AC22,\"Y\",\"N\"))","v":{"$error":"#N/A"}},{"$f":"IF(W22=\"N\",\"N\",IF(OR(F22>AL22,H22>AP22),\"Y\",\"N\"))","v":{"$error":"#N/A"}},{"$error":"#N/A"},null,null,null,null,null,null,null,null,null,null,null,""]
[null,{"$f":"'Measure Descriptions'!B25","v":17},{"$f":"'Measure Summary'!E25","v":""},{"$f":"'Measure Summary'!C25","v":""},{"$f":"'Measure Summary'!F25","v":0},{"$f":"'Measure Summary'!G25+'Measure Summary'!H25+('Measure Summary'!J25+'Measure Summary'!I25)*Calcs!$B$88","v":0},{"$f":"IFERROR(('Measure Summary'!I25+'Measure Summary'!J25)*Calcs!$B$88*Calcs!$B$89+('Measure Summary'!G25+'Measure Summary'!H25)*IF('Measure Summary'!N25=\"Natural Gas\",Calcs!$B$90,IF('Measure Summary'!N25=\"Fuel Oil\",Calcs!$B$91,IF('Measure Summary'!N25=\"Steam\",Calcs!$B$92,IF('Measure Summary'!N25=\"Propane\",Calcs!$B$93,Calcs!$B$94)))),0)","v":0},{"$f":"IF('Utility Info'!$E$20>0,G23/'Utility Info'!$E$20,0)","v":0},"*\n*\n*\n*\n*\n*","",null,null,"","","","",null,{"$f":"'Measure Summary'!W25","v":0},{"$error":"#N/A"},0,0,0,{"$error":"#N/A"},{"$error":"#N/A"},{"$error":"#N/A"},{"$error":"#N/A"},{"$error":"#N/A"},{"$error":"#N/A"},{"$error":"#N/A"},{"$error":"#N/A"},{"$error":"#N/A"},"N/A",{"$error":"#N/A"},{"$error":"#N/A"},{"$error":"#N/A"},{"$error":"#N/A"},{"$error":"#N/A"},{"$error":"#N/A"},{"$error":"#N/A"},{"$error":"#N/A"},{"$error":"#N/A"},{"$error":"#N/A"},{"$error":"#N/A"},{"$error":"#N/A"},{"$error":"#N/A"},null,null,null,null,null,null,null,null,null,null,null,""]
[null,{"$f":"'Measure Descriptions'!B26","v":18},{"$f":"'Measure Summary'!E26","v":""},{"$f":"'Measure Summary'!C26","v":""},{"$f":"'Measure Summary'!F26","v":0},{"$f":"'Measure Summary'!G26+'Measure Summary'!H26+('Measure Summary'!J26+'Measure Summary'!I26)*Calcs!$B$88","v":0},{"$f":"IFERROR(('Measure Summary'!I26+'Measure Summary'!J26)*Calcs!$B$88*Calcs!$B$89+('Measure Summary'!G26+'Measure Summary'!H26)*IF('Measure Summary'!N26=\"Natural Gas\",Calcs!$B$90,IF('Measure Summary'!N26=\"Fuel Oil\",Calcs!$B$91,IF('Measure Summary'!N26=\"Steam\",Calcs!$B$92,IF('Measure Summary'!N26=\"Propane\",Calcs!$B$93,Calcs!$B$94)))),0)","v":0},{"$f":"IF('Utility Info'!$E$20>0,G24/'Utility Info'!$E$20,0)","v":0},"*\n*\n*\n*\n*\n*","",null,null,"","","","",null,{"$f":"'Measure Summary'!W26","v":0},{"$error":"#N/A"},0,0,0,{"$error":"#N/A"},{"$error":"#N/A"},{"$error":"#N/A"},{"$error":"#N/A"},{"$error":"#N/A"},{"$error":"#N/A"},{"$error":"#N/A"},{"$error":"#N/A"},{"$error":"#N/A"},"N/A",{"$error":"#N/A"},{"$error":"#N/A"},{"$error":"#N/A"},{"$error":"#N/A"},{"$error":"#N/A"},{"$error":"#N/A"},{"$error":"#N/A"},{"$error":"#N/A"},{"$error":"#N/A"},{"$error":"#N/A"},{"$error":"#N/A"},{"$error":"#N/A"},{"$error":"#N/A"},null,null,null,null,null,null,null,null,null,null,null,""]
[null,{"$f":"'Measure Descriptions'!B27","v":19},{"$f":"'Measure Summary'!E27","v":""},{"$f":"'Measure Summary'!C27","v":""},{"$f":"'Measure Summary'!F27","v":0},{"$f":"'Measure Summary'!G27+'Measure Summary'!H27+('Measure Summary'!J27+'Measure Summary'!I27)*Calcs!$B$88","v":0},{"$f":"IFERROR(('Measure Summary'!I27+'Measure Summary'!J27)*Calcs!$B$88*Calcs!$B$89+('Measure Summary'!G27+'Measure Summary'!H27)*IF('Measure Summary'!N27=\"Natural Gas\",Calcs!$B$90,IF('Measure Summary'!N27=\"Fuel Oil\",Calcs!$B$91,IF('Measure Summary'!N27=\"Steam\",Calcs!$B$92,IF('Measure Summary'!N27=\"Propane\",Calcs!$B$93,Calcs!$B$94)))),0)","v":0},{"$f":"IF('Utility Info'!$E$20>0,G25/'Utility Info'!$E$20,0)","v":0},"*\n*\n*\n*\n*\n*","",null,null,"","","","",null,{"$f":"'Measure Summary'!W27","v":0},{"$error":"#N/A"},0,0,0,{"$error":"#N/A"},{"$error":"#N/A"},{"$error":"#N/A"},{"$error":"#N/A"},{"$error":"#N/A"},{"$error":"#N/A"},{"$error":"#N/A"},{"$error":"#N/A"},{"$error":"#N/A"},"N/A",{"$error":"#N/A"},{"$error":"#N/A"},{"$error":"#N/A"},{"$error":"#N/A"},{"$error":"#N/A"},{"$error":"#N/A"},{"$error":"#N/A"},{"$error":"#N/A"},{"$error":"#N/A"},{"$error":"#N/A"},{"$error":"#N/A"},{"$error":"#N/A"},{"$error":"#N/A"},null,null,null,null,null,null,null,null,null,null,null,""]
[null,{"$f":"'Measure Descriptions'!B28","v":20},{"$f":"'Measure Summary'!E28","v":""},{"$f":"'Measure Summary'!C28","v":""},{"$f":"'Measure Summary'!F28","v":0},{"$f":"'Measure Summary'!G28+'Measure Summary'!H28+('Measure Summary'!J28+'Measure Summary'!I28)*Calcs!$B$88","v":0},{"$f":"IFERROR(('Measure Summary'!I28+'Measure Summary'!J28)*Calcs!$B$88*Calcs!$B$89+('Measure Summary'!G28+'Measure Summary'!H28)*IF('Measure Summary'!N28=\"Natural Gas\",Calcs!$B$90,IF('Measure Summary'!N28=\"Fuel Oil\",Calcs!$B$91,IF('Measure Summary'!N28=\"Steam\",Calcs!$B$92,IF('Measure Summary'!N28=\"Propane\",Calcs!$B$93,Calcs!$B$94)))),0)","v":0},{"$f":"IF('Utility Info'!$E$20>0,G26/'Utility Info'!$E$20,0)","v":0},"*\n*\n*\n*\n*\n*","",null,null,{"$f":"IF(ISERROR(AC26),\"\",AC26)","v":""},"",{"$f":"IF(ISERROR(AK26),\"\",AK26)","v":""},"",null,{"$f":"'Measure Summary'!W28","v":0},{"$error":"#N/A"},0,0,0,{"$error":"#N/A"},{"$error":"#N/A"},{"$error":"#N/A"},{"$error":"#N/A"},{"$error":"#N/A"},{"$error":"#N/A"},{"$f":"IF(Location=\"Upstate\",Y26,IF(Location=\"Downstate\",AA26,\"\"))","v":{"$error":"#N/A"}},{"$f":"IF(Location=\"Upstate\",Z26,IF(Location=\"Downstate\",AB26,\"\"))","v":{"$error":"#N/A"}},{"$error":"#N/A"},"N/A",{"$error":"#N/A"},{"$error":"#N/A"},{"$error":"#N/A"},{"$error":"#N/A"},{"$f":"IF(AE26=\"N/A\",\"N/A\",IF(Rise=\"Low\",AG26/1000000,IF(Rise=\"High\",AI26/1000000,\"\")))","v":{"$error":"#N/A"}},{"$f":"IF(AE26=\"N/A\",\"N/A\",IF(Rise=\"Low\",AH26/1000000,IF(Rise=\"High\",AJ26/1000000,\"\")))","v":{"$error":"#N/A"}},{"$error":"#N/A"},{"$error":"#N/A"},{"$error":"#N/A"},{"$error":"#N/A"},{"$error":"#N/A"},{"$error":"#N/A"},{"$error":"#N/A"},null,null,null,null,null,null,null,null,null,null,null,""]
[null,{"$f":"'Measure Descriptions'!B29","v":21},{"$f":"'Measure Summary'!E29","v":""},{"$f":"'Measure Summary'!C29","v":""},{"$f":"'Measure Summary'!F29","v":0},{"$f":"'Measure Summary'!G29+'Measure Summary'!H29+('Measure Summary'!J29+'Measure Summary'!I29)*Calcs!$B$88","v":0},{"$f":"IFERROR(('Measure Summary'!I29+'Measure Summary'!J29)*Calcs!$B$88*Calcs!$B$89+('Measure Summary'!G29+'Measure Summary'!H29)*IF('Measure Summary'!N29=\"Natural Gas\",Calcs!$B$90,IF('Measure Summary'!N29=\"Fuel Oil\",Calcs!$B$91,IF('Measure Summary'!N29=\"Steam\",Calcs!$B$92,IF('Measure Summary'!N29=\"Propane\",Calcs!$B$93,Calcs!$B$94)))),0)","v":0},{"$f":"IF('Utility Info'!$E$20>0,G27/'Utility Info'!$E$20,0)","v":0},"*\n*\n*\n*\n*\n*","",null,null,"","","","",null,{"$f":"'Measure Summary'!W29","v":0},{"$error":"#N/A"},0,0,0,{"$error":"#N/A"},{"$error":"#N/A"},{"$error":"#N/A"},{"$error":"#N/A"},{"$error":"#N/A"},{"$error":"#N/A"},{"$error":"#N/A"},{"$error":"#N/A"},{"$error":"#N/A"},"N/A",{"$error":"#N/A"},{"$error":"#N/A"},{"$error":"#N/A"},{"$error":"#N/A"},{"$error":"#N/A"},{"$error":"#N/A"},{"$error":"#N/A"},{"$error":"#N/A"},{"$error":"#N/A"},{"$error":"#N/A"},{"$error":"#N/A"},{"$error":"#N/A"},{"$error":"#N/A"},null,null,null,null,null,null,null,null,null,null,null,""]
[null,{"$f":"'Measure Descriptions'!B30","v":22},{"$f":"'Measure Summary'!E30","v":""},{"$f":"'Measure Summary'!C30","v":""},{"$f":"'Measure Summary'!F30","v":0},{"$f":"'Measure Summary'!G30+'Measure Summary'!H30+('Measure Summary'!J30+'Measure Summary'!I30)*Calcs!$B$88","v":0},{"$f":"IFERROR(('Measure Summary'!I30+'Measure Summary'!J30)*Calcs!$B$88*Calcs!$B$89+('Measure Summary'!G30+'Measure Summary'!H30)*IF('Measure Summary'!N30=\"Natural Gas\",Calcs!$B$90,IF('Measure Summary'!N30=\"Fuel Oil\",Calcs!$B$91,IF('Measure Summary'!N30=\"Steam\",Calcs!$B$92,IF('Measure Summary'!N30=\"Propane\",Calcs!$B$93,Calcs!$B$94)))),0)","v":0},{"$f":"IF('Utility Info'!$E$20>0,G28/'Utility Info'!$E$20,0)","v":0},"*\n*\n*\n*\n*\n*","",null,null,"","","","",null,{"$f":"'Measure Summary'!W30","v":0},{"$error":"#N/A"},0,0,0,{"$error":"#N/A"},{"$error":"#N/A"},{"$error":"#N/A"},{"$error":"#N/A"},{"$error":"#N/A"},{"$error":"#N/A"},{"$error":"#N/A"},{"$error":"#N/A"},{"$error":"#N/A"},"N/A",{"$error":"#N/A"},{"$error":"#N/A"},{"$error":"#N/A"},{"$error":"#N/A"},{"$error":"#N/A"},{"$error":"#N/A"},{"$error":"#N/A"},{"$error":"#N/A"},{"$error":"#N/A"},{"$error":"#N/A"},{"$error":"#N/A"},{"$error":"#N/A"},{"$error":"#N/A"},null,null,null,null,null,null,null,null,null,null,null,""]
[null,{"$f":"'Measure Descriptions'!B31","v":23},{"$f":"'Measure Summary'!E31","v":""},{"$f":"'Measure Summary'!C31","v":""},{"$f":"'Measure Summary'!F31","v":0},{"$f":"'Measure Summary'!G31+'Measure Summary'!H31+('Measure Summary'!J31+'Measure Summary'!I31)*Calcs!$B$88","v":0},{"$f":"IFERROR(('Measure Summary'!I31+'Measure Summary'!J31)*Calcs!$B$88*Calcs!$B$89+('Measure Summary'!G31+'Measure Summary'!H31)*IF('Measure Summary'!N31=\"Natural Gas\",Calcs!$B$90,IF('Measure Summary'!N31=\"Fuel Oil\",Calcs!$B$91,IF('Measure Summary'!N31=\"Steam\",Calcs!$B$92,IF('Measure Summary'!N31=\"Propane\",Calcs!$B$93,Calcs!$B$94)))),0)","v":0},{"$f":"IF('Utility Info'!$E$20>0,G29/'Utility Info'!$E$20,0)","v":0},"*\n*\n*\n*\n*\n*","",null,null,"","","","",null,{"$f":"'Measure Summary'!W31","v":0},{"$error":"#N/A"},0,0,0,{"$error":"#N/A"},{"$error":"#N/A"},{"$error":"#N/A"},{"$error":"#N/A"},{"$error":"#N/A"},{"$error":"#N/A"},{"$error":"#N/A"},{"$error":"#N/A"},{"$error":"#N/A"},"N/A",{"$error":"#N/A"},{"$error":"#N/A"},{"$error":"#N/A"},{"$error":"#N/A"},{"$error":"#N/A"},{"$error":"#N/A"},{"$error":"#N/A"},{"$error":"#N/A"},{"$error":"#N/A"},{"$error":"#N/A"},{"$error":"#N/A"},{"$error":"#N/A"},{"$error":"#N/A"},null,null,null,null,null,null,null,null,null,null,null,""]
[null,{"$f":"'Measure Descriptions'!B32","v":24},{"$f":"'Measure Summary'!E32","v":""},{"$f":"'Measure Summary'!C32","v":""},{"$f":"'Measure Summary'!F32","v":0},{"$f":"'Measure Summary'!G32+'Measure Summary'!H32+('Measure Summary'!J32+'Measure Summary'!I32)*Calcs!$B$88","v":0},{"$f":"IFERROR(('Measure Summary'!I32+'Measure Summary'!J32)*Calcs!$B$88*Calcs!$B$89+('Measure Summary'!G32+'Measure Summary'!H32)*IF('Measure Summary'!N32=\"Natural Gas\",Calcs!$B$90,IF('Measure Summary'!N32=\"Fuel Oil\",Calcs!$B$91,IF('Measure Summary'!N32=\"Steam\",Calcs!$B$92,IF('Measure Summary'!N32=\"Propane\",Calcs!$B$93,Calcs!$B$94)))),0)","v":0},{"$f":"IF('Utility Info'!$E$20>0,G30/'Utility Info'!$E$20,0)","v":0},"*\n*\n*\n*\n*\n*","",null,null,"","","","",null,{"$f":"'Measure Summary'!W32","v":0},{"$error":"#N/A"},0,0,0,{"$error":"#N/A"},{"$error":"#N/A"},{"$error":"#N/A"},{"$error":"#N/A"},{"$error":"#N/A"},{"$error":"#N/A"},{"$error":"#N/A"},{"$error":"#N/A"},{"$error":"#N/A"},"N/A",{"$error":"#N/A"},{"$error":"#N/A"},{"$error":"#N/A"},{"$error":"#N/A"},{"$error":"#N/A"},{"$error":"#N/A"},{"$error":"#N/A"},{"$error":"#N/A"},{"$error":"#N/A"},{"$error":"#N/A"},{"$error":"#N/A"},{"$error":"#N/A"},{"$error":"#N/A"},null,null,null,null,null,null,null,null,null,null,null,""]
[null,{"$f":"'Measure Descriptions'!B33","v":25},{"$f":"'Measure Summary'!E33","v":""},{"$f":"'Measure Summary'!C33","v":""},{"$f":"'Measure Summary'!F33","v":0},{"$f":"'Measure Summary'!G33+'Measure Summary'!H33+('Measure Summary'!J33+'Measure Summary'!I33)*Calcs!$B$88","v":0},{"$f":"IFERROR(('Measure Summary'!I33+'Measure Summary'!J33)*Calcs!$B$88*Calcs!$B$89+('Measure Summary'!G33+'Measure Summary'!H33)*IF('Measure Summary'!N33=\"Natural Gas\",Calcs!$B$90,IF('Measure Summary'!N33=\"Fuel Oil\",Calcs!$B$91,IF('Measure Summary'!N33=\"Steam\",Calcs!$B$92,IF('Measure Summary'!N33=\"Propane\",Calcs!$B$93,Calcs!$B$94)))),0)","v":0},{"$f":"IF('Utility Info'!$E$20>0,G31/'Utility Info'!$E$20,0)","v":0},"*\n*\n*\n*\n*\n*","",null,null,"","","","",null,{"$f":"'Measure Summary'!W33","v":0},{"$error":"#N/A"},0,0,0,{"$error":"#N/A"},{"$error":"#N/A"},{"$error":"#N/A"},{"$error":"#N/A"},{"$error":"#N/A"},{"$error":"#N/A"},{"$error":"#N/A"},{"$error":"#N/A"},{"$error":"#N/A"},"N/A",{"$error":"#N/A"},{"$error":"#N/A"},{"$error":"#N/A"},{"$error":"#N/A"},{"$error":"#N/A"},{"$error":"#N/A"},{"$error":"#N/A"},{"$error":"#N/A"},{"$error":"#N/A"},{"$error":"#N/A"},{"$error":"#N/A"},{"$error":"#N/A"},{"$error":"#N/A"},null,null,null,null,null,null,null,null,null,null,null,""]
[]
[null,"End Use Savings Check",null,null,null,null,null,null,null,"Comment","Response"]
[null,"End Use",null,"Pre-Construction Energy Consumption\n(MMBtu)","Projected  Site Savings\n(MMBtu)","Projected % Savings"]
[null,"Heating",null,{"$f":"'Utility Info'!B25+'Utility Info'!B30+'Utility Info'!B35+'Utility Info'!B40+'Utility Info'!B45","v":0},{"$f":"'Measure Summary'!G41+SUMIF('Measure Summary'!D8:D33,\"Heating/Cooling\",'Measure Summary'!J8:J33)*0.003412","v":0},{"$f":"E35/D35","v":{"$error":"#DIV/0!"}},null,null,"*\n*\n*\n*\n*\n*\n*\n*",{"$f":"IFERROR(IF(F35>0.75,\"Proposed measures reflect >75% heating savings.\"&\" Please review cells B22:F45 on the Utility Info tab to ensure baseline energy usage data was transferred correctly, review all inputs in this file specific to heating impact measures and revise as necessary.\"&\" If all information is considered accurate, please provide justification in the 'Response' column.\",IF(F35>0.5,\"Proposed measures reflect >50% heating savings.\"&\" Please review cells B22:F45 on the Utility Info tab to ensure baseline energy usage data was transferred correctly, review all inputs in this file specific to heating impact measures and revise as necessary.\"&\" If all information is considered accurate, please provide justification in the 'Response' column.\",IF(F35>0.25,\"Proposed measures reflect >25% heating savings.\"&\" Please review cells B22:F45 on the Utility Info tab to ensure baseline energy usage data was transferred correctly, review all inputs in this file specific to heating impact measures and revise as necessary.\"&\" If all information is considered accurate, please provide justification in the 'Response' column.\",\"OK\"))),\"Baseline energy usage or critical measure data missing. Please review cells B22:F45 on the Utility Info tab to ensure baseline energy usage data is transferred correctly and review the Measure Summary tab for any erroneous values.\")","v":"Baseline energy usage or critical measure data missing. Please review cells B22:F45 on the Utility Info tab to ensure baseline energy usage data is transferred correctly and review the Measure Summary tab for any erroneous values."}]
[null,"Cooling",null,{"$f":"'Utility Info'!C25+'Utility Info'!C30+'Utility Info'!C35+'Utility Info'!C40+'Utility Info'!C45","v":0},{"$f":"'Measure Summary'!I41*0.003412+SUMIF('Measure Summary'!D8:D33,\"Heating/Cooling\",'Measure Summary'!H8:H33)","v":0},{"$f":"E36/D36","v":{"$error":"#DIV/0!"}},null,null,"*\n*\n*\n*\n*\n*\n*\n*",{"$f":"IFERROR(IF(F36>0.75,\"Proposed measures reflect >75% cooling savings.\"&\" Please review cells B22:F45 on the Utility Info tab to ensure baseline energy usage data was transferred correctly, review all inputs in this file specific to cooling impact measures and revise as necessary.\"&\" If all information is considered accurate, please provide justification in the 'Response' column.\",IF(F36>0.5,\"Proposed measures reflect >50% cooling savings.\"&\" Please review cells B22:F45 on the Utility Info tab to ensure baseline energy usage data was transferred correctly, review all inputs in this file specific to cooling impact measures and revise as necessary.\"&\" If all information is considered accurate, please provide justification in the 'Response' column.\",IF(F36>0.25,\"Proposed measures reflect >25% cooling savings.\"&\" Please review cells B22:F45 on the Utility Info tab to ensure baseline energy usage data was transferred correctly, review all inputs in this file specific to cooling impact measures and revise as necessary.\"&\" If all information is considered accurate, please provide justification in the 'Response' column.\",\"OK\"))),\"Baseline energy usage or critical measure data missing. Please review cells B22:F45 on the Utility Info tab to ensure baseline energy usage data is transferred correctly and review the Measure Summary tab for any erroneous values.\")","v":"Baseline energy usage or critical measure data missing. Please review cells B22:F45 on the Utility Info tab to ensure baseline energy usage data is transferred correctly and review the Measure Summary tab for any erroneous values."}]
[null,"Baseload",null,{"$f":"'Utility Info'!D25+'Utility Info'!D30+'Utility Info'!D35+'Utility Info'!D40+'Utility Info'!D45","v":0},{"$f":"(SUM('Measure Summary'!G41:H41)+SUM('Measure Summary'!I41:J41)*0.003412)-SUM(E35:E36)","v":0},{"$error":"#DIV/0!"},null,null,"*\n*\n*\n*\n*\n*\n*\n*",{"$f":"IFERROR(IF(F37>0.75,\"Proposed measures reflect >75% baseload savings.\"&\" Please review cells B22:F45 on the Utility Info tab to ensure baseline energy usage data was transferred correctly, review all inputs in this file specific to baseload impact measures and revise as necessary.\"&\" If all information is considered accurate, please provide justification in the 'Response' column.\",IF(F37>0.5,\"Proposed measures reflect >50% baseload savings.\"&\" Please review cells B22:F45 on the Utility Info tab to ensure baseline energy usage data was transferred correctly, review all inputs in this file specific to baseload impact measures and revise as necessary.\"&\" If all information is considered accurate, please provide justification in the 'Response' column.\",IF(F37>0.25,\"Proposed measures reflect >25% baseload savings.\"&\" Please review cells B22:F45 on the Utility Info tab to ensure baseline energy usage data was transferred correctly, review all inputs in this file specific to baseload impact measures and revise as necessary.\"&\" If all information is considered accurate, please provide justification in the 'Response' column.\",\"OK\"))),\"Baseline energy usage or critical measure data missing. Please review cells B22:F45 on the Utility Info tab to ensure baseline energy usage data is transferred correctly and review the Measure Summary tab for any erroneous values.\")","v":"Baseline energy usage or critical measure data missing. Please review cells B22:F45 on the Utility Info tab to ensure baseline energy usage data is transferred correctly and review the Measure Summary tab for any erroneous values."}]

{"sheet":"QC Check","index":8,"n_rows":11,"n_cols":3,"rows_kept":11,"cut":false,"hidden":false,"merged":[[2,1,2,2]]}
[null,"Project Quality Control Check"]
[null,"Instructions"]
[null,"1) Once all project data has been entered, review the items below to ensure the project meets the specified criteria.\n2) Comments highlighted in green indicate that the project passes the corresponding check. Yellow highlighted comments require additional review. Red highlighted comments indicate that the project requires revision in order to meet minimum quality control standards.\n\n"]
[]
[null,"QC Check Type","Comment"]
["*\n*\n*","Measure Quantity Check",{"$f":"IF(COUNTBLANK('Measure Summary'!$C$8:$C$33)=26,\"\",IF(SUMPRODUCT(--('Measure Summary'!$C$8:$C$33<>\"\"),--('Measure Summary'!$W$8:$W$33=\"\"))>0,\"Error - All measures listed in the Measure Summary table must have associated quantities entered. Please review column W of the Measure Summary table and ensure quantities are entered for all measures.\",\"OK - All measure quantities entered.\"))","v":""}]
["*\n*\n*","Measure Unit Check",{"$f":"IF(COUNTBLANK('Measure Summary'!$C$8:$C$33)=26,\"\",IF(SUMPRODUCT(--('Measure Summary'!$C$8:$C$33<>\"\"),--('Measure Summary'!$X$8:$X$33=\"\"))>0,\"Error - All measures listed in the Measure Summary table must have associated units entered. Please review column X of the Measure Summary table and ensure units are entered for all measures.\",\"OK - All measure units entered.\"))","v":""}]
["*\n*\n*","Measure Lives Check",{"$f":"IF(COUNTBLANK('Measure Summary'!$C$8:$C$33)=26,\"\",IF(SUMPRODUCT(--('Measure Summary'!$C$8:$C$33<>\"\"),--('Measure Summary'!$AA$8:$AA$33=\"\"))>0,\"Error - All measures listed in the Measure Summary table must have an associated measure life. This is automatic for most measures, but must be manually entered for some measure categories. \"&\"Please review column AA of the Measure Summary table and ensure measure lives are entered for all measures.\",\"OK - All measure lives entered.\"))","v":""}]
["*\n*\n*\n*","Baseline Year of Manufacture Check",{"$f":"IF(COUNTBLANK('Measure Summary'!$C$8:$C$33)=26,\"\",IF(SUMPRODUCT(--('Measure Summary'!$C$8:$C$33<>\"\"),--('Measure Summary'!$AB$8:$AB$33<>\"Full\"),--('Measure Summary'!$AC$8:$AC$33=\"\"))>0,\"Error - All measures listed in the Measure Summary table must have associated baseline equipment year of manufacture for purposes of the TRC test calculation. \"&\"Please review column AC of the Measure Summary table and ensure baseline manufacture years are entered as required. Missing data is highlighted in orange.\",\"OK – Baseline years of manufacture entered as required.\"))","v":""}]
["*\n*\n*\n*\n*","Measure QC Check",{"$f":"IF(COUNTBLANK('Measure Summary'!$C$8:$C$33)=26,\"\",IF(COUNTIF('Measure QC'!$AS$6:$AS$31,\"Y\")>0,\"Error - One or more measures exceed the upper limit for site savings. Please review the Measure QC tab and reduce savings for any measure flagged for exceeding maximum allowable savings.\",IF(OR(COUNTIFS('Measure QC'!$AQ$6:$AQ$31,\"Y\",'Measure QC'!$K$6:$K$31,\"\")>0,COUNTIFS('Measure QC'!$AR$6:$AR$31,\"Y\",'Measure QC'!$K$6:$K$31,\"\")>0,COUNTIFS('Measure QC'!$F$35:$F$37,\">0.25\",'Measure QC'!$K$35:$K$37,\"\")>0)=TRUE,\"Caution - Please provide responses in all orange-shaded cells on the Measure QC tab.\",\"OK - Responses provided on Measure QC tab.\")))","v":""}]
["*\n*\n*","Critical Inputs Check",{"$f":"IF(OR(DT_GeneralProjectInfo_ProjectInfo_Name=\"\",DT_GeneralProjectInfo_ProjectInfo_City=\"\",DT_GeneralProjectInfo_ProjectInfo_Zip=\"\",'General Project Info'!C23=\"\",AND('General Project Info'!C24=\"\",NOT('General Project Info'!C40>50))=TRUE,DT_GeneralProjectInfo_BuildingInfo_NumStories1=\"\",DT_GeneralProjectInfo_BuildingInfo_YearBuilt1=\"\",DT_GeneralProjectInfo_BuildingInfo_Units_Studios1=\"\",DT_GeneralProjectInfo_BuildingInfo_Units_1Bed1=\"\",DT_GeneralProjectInfo_BuildingInfo_Units_2Bed1=\"\",DT_GeneralProjectInfo_BuildingInfo_Units_3Bed1=\"\",DT_GeneralProjectInfo_BuildingInfo_Units_4Bed1=\"\",DT_GeneralProjectInfo_BuildingInfo_Areas_Apartments1=\"\",DT_GeneralProjectInfo_BuildingInfo_Areas_CommonAreaResidential1=\"\",DT_GeneralProjectInfo_BuildingInfo_Areas_CommonAreaNonResidential1=\"\",DT_GeneralProjectInfo_BuildingInfo_Areas_Commercial1=\"\",DT_GeneralProjectInfo_BuildingInfo_Areas_CondGarage1=\"\",'Utility Info'!D20=0,SUM('Utility Info'!F14:F19)=0,COUNTIF('Measure Descriptions'!AA8:AA33,\"ERR\")>0,COUNTIF('Measure Summary'!CA8:CA33,\"ERR\")>0,COUNTIF('Measure QC'!BE6:BE31,\"ERR\")>0,'Measure Summary'!A3=FALSE)=TRUE,\"Error - One or more critical input fields have been left blank - please review the input tabs of this workbook and enter relevant data into all orange highlighted cells.\",\"OK - All critical inputs entered.\")","v":"Error - One or more critical input fields have been left blank - please review the input tabs of this workbook and enter relevant data into all orange highlighted cells."}]

{"sheet":"QC Feedback","index":9,"n_rows":65,"n_cols":4,"rows_kept":65,"cut":false,"hidden":false,"merged":[[63,2,64,2],[0,0,0,2],[1,0,1,2],[2,0,2,2],[57,0,57,2],[12,0,13,0],[20,0,21,0],[25,0,26,0],[29,0,30,0],[34,0,35,0],[39,0,40,0],[44,0,45,0],[49,0,50,0]]}
["NYSERDA's Multifamily Performance Program"]
["Comprehensive Option"]
["QC Review Feedback Form"]
[]
["Project Name",{"$f":"DT_GeneralProjectInfo_ProjectInfo_Name","v":0}]
["Provider",{"$f":"'General Project Info'!C8","v":0}]
["Provider's Auditor",{"$f":"'General Project Info'!D63","v":0}]
["NYSERDA Review By"]
["Reviewer's Phone"]
["Review Date & Revision #"]
["Draft SAV-IT Date & Revision #"]
[]
["General Comments"]
[null,"Reviewer Comments (Rev0)","Provider Comments (Rev0)","Reviewer Comments (Rev1)"]
["Has all required documentation been submitted?   SAV-IT; Provider Contract; DRAFs; Photos. "]
["Measure Description Tab: Do selected Measure Categories/Classifications correctly reflect the measures?"]
["Measure Summary Tab: Have any included water and O&M savings been justified appropriately?"]
["Have all orange “critical input” cells been completed? (General Project Info, Utility Info, and Measure Summary tabs)"]
["Review any warnings or errors on the QC Check tab. Are there any items that need further investigation?"]
[]
["Administrative/ Funding Comments"]
[null,"Reviewer Comments (Rev0)","Provider Comments (Rev0)","Reviewer Comments (Rev1)"]
["Measure Summary Tab: Are all Provider Fees  included?"]
["Meausure Summary Tab: Have all incentives provided by outside Programs (utility or NYSERDA) been inidicated?"]
[]
["Billing Analysis Comments"]
[null,"Reviewer Comments (Rev0)","Provider Comments (Rev0)","Reviewer Comments (Rev1)"]
["Does utility data match NYSERDA's Baselining Report?"]
[]
["Building Envelope Comments"]
[null,"Reviewer Comments (Rev0)","Provider Comments (Rev0)","Reviewer Comments (Rev1)"]
["Are exisitng conditions thoroughly described?"]
["Are proposed measure descriptions thoroughly described?"]
[]
["HVAC Comments"]
[null,"Reviewer Comments (Rev0)","Provider Comments (Rev0)","Reviewer Comments (Rev1)"]
["Are exisitng conditions thoroughly described?"]
["Are proposed measure descriptions thoroughly described?"]
[]
["DHW Comments"]
[null,"Reviewer Comments (Rev0)","Provider Comments (Rev0)","Reviewer Comments (Rev1)"]
["Are exisitng conditions thoroughly described?"]
["Are proposed measure descriptions thoroughly described?"]
[]
["Lighting Comments"]
[null,"Reviewer Comments (Rev0)","Provider Comments (Rev0)","Reviewer Comments (Rev1)"]
["Are exisitng conditions thoroughly described?"]
["Are proposed measure descriptions thoroughly described?"]
[]
["Appliance/Laundry Comments"]
[null,"Reviewer Comments (Rev0)","Provider Comments (Rev0)","Reviewer Comments (Rev1)"]
["Are exisitng conditions thoroughly described?"]
["Are proposed measure descriptions thoroughly described?"]
[]
[]
[]
[]
["FOR OFFICIAL USE ONLY: The technical reviewer for the Rev0 submittal must complete the table to calculate a score for the Rev0 submittal only.  Scores given should be a reflection of the QC Comments. "]
["Scoring Parameter","Score 0-2","Parameters"]
["Submittal Completeness",null,"0 - Missing major parts of project submittal. Review could not be completed.\n0.5 - Missing major parts of project submittal but review could be completed.\n1 - Some supporting documentation was missing.  Review could still be completed.\n1.5 – Very minor documents or parts of documents incomplete.\n2 - All documents were submitted and filled out completely."]
["Existing Conditions Description",null,"0 - Significant information about the Project's existing conditions was missing.\n0.5 – Moderate amount of the Project’s existing conditions were missing.\n1 - The Project's existing conditions were somewhat complete and accurate, but additional information was needed.\n1.5 – Minor parts of the Project's existing conditions were missing.\n2 - The ERP tool described the Project's existing conditions thoroughly and accurately."]
["Measure Descriptions",null,"0 - Significant information about the proposed measures was missing. \n0.5 – A large portion of the measure descriptions were missing or inaccurate.\n1 - The Project's measure descriptions were somewhat complete and accurate, but additional information was needed.  \n1.5 – Minor parts of the measure descriptions were missing or inaccurate.\n2 - The measure descriptions were thorough and accurate. The Measure Summary tab was filled out completely and accurately.  The SAV-IT formulas were not changed to manipulate results."]
["Program Comprehension",null,"0 - Showed a weak understanding of Program Rules and Requirements.   Did not follow file naming conventions, did not submit complete documentation and/or did not know or meet deadlines.\n0.5 - Showed a below average understanding of Program Rules and Requirements.\n1 - Showed an average understanding of Program Rules and Requirements.  \n1.5 - Showed an above average understanding of Program Rules and Requirements.\n2 - Showed a strong understanding of Program Rules and Requirements by adhering to them throughout submittals.  File naming conventions were followed, complete documentation was submitted."]
["Total Score",{"$f":"SUM(B60:B63)","v":0}]
["Score on 100 Pt Scale",{"$f":"(B64*100)/(4*2)","v":0}]

{"sheet":"Project Summary","index":10,"n_rows":56,"n_cols":19,"rows_kept":56,"cut":false,"hidden":false,"merged":[[1,1,2,15],[13,16,13,18],[14,2,14,5],[14,7,14,9],[14,12,14,14],[7,3,7,5],[8,3,8,5],[9,3,9,5],[10,3,10,5],[11,3,11,5],[31,1,31,15],[4,1,4,15],[39,16,39,18],[41,2,41,5],[41,7,41,9],[41,12,41,14]]}
[1,"Project Summary"]
[1,"This worksheet displays key information, metrics and graphics relevant to the site and project. Projected Percent Source Energy Savings, Projected Total Source EUI and Eligible NYSERDA Incentive are provided in cells D26, D28 and D30, respectively."]
[1]
[1]
[1,"PROJECT DETAILS"]
[1]
[1]
[1,null,"Project Name",{"$f":"IF('General Project Info'!C17=\"\",\"\",'General Project Info'!C17)","v":""}]
[1,null,"City",{"$f":"IF('General Project Info'!C19=\"\",\"\",'General Project Info'!C19)","v":""}]
[1,null,"Year Built",{"$f":"IF('General Project Info'!C30=\"\",\"\",'General Project Info'!C30)","v":""}]
[1,null,"Floor Area (sq. ft.)",{"$f":"IF('General Project Info'!C48=\"\",\"\",'General Project Info'!C48)","v":0}]
[1,null,"Residential Units (#)",{"$f":"IF('General Project Info'!C40=\"\",\"\",'General Project Info'!C40)","v":0}]
[1]
[1,null,null,null,null,null,null,null,null,null,null,null,null,null,null,null,"Chart Data"]
[1,null,"Projected Energy Savings",null,null,null,null,"Pre-Retrofit Energy Use",null,null,null,null,"Pre-Retrofit Energy Cost"]
[1]
[{"$f":"IF(AND(N(D17)=0,N(J17)=0)=TRUE,\"\",1)","v":""},null,"Electricity (kWh)",{"$f":"SUM('Measure Summary'!I41:J41)","v":0},{"$f":"IF(N(J17)=0,0,D17/J17)","v":0},null,null,null,"Electricity (kWh)",{"$f":"'Utility Info'!D14/Calcs!$B$88","v":0},null,null,"Electricity",{"$f":"J17*'Utility Info'!F14","v":0},null,null,{"$f":"IF(N(J17)=0,\"\",\"E\")","v":""},{"$f":"J17*3412/1000000","v":0},{"$f":"N17","v":0}]
[{"$f":"IF(AND(N(D18)=0,N(J18)=0)=TRUE,\"\",1)","v":""},null,"Natural Gas (MMBtu)",{"$f":"SUMIF('Measure Summary'!N8:N22,\"Natural Gas\",'Measure Summary'!G8:G22)+SUMIF('Measure Summary'!N8:N22,\"Natural Gas\",'Measure Summary'!H8:H22)+SUMIF('Measure Summary'!N24:N33,\"Natural Gas\",'Measure Summary'!G24:G33)+SUMIF('Measure Summary'!N24:N33,\"Natural Gas\",'Measure Summary'!H24:H33)","v":0},0,null,null,null,"Natural Gas (MMBtu)",{"$f":"'Utility Info'!D15","v":0},null,null,"Natural Gas",{"$f":"J18*'Utility Info'!F15","v":0},null,null,{"$f":"IF(N(J18)=0,\"\",\"NG\")","v":""},{"$f":"J18","v":0},0]
["",null,"Fuel Oil (MMBtu)",{"$f":"SUMIF('Measure Summary'!N8:N22,\"Fuel Oil\",'Measure Summary'!G8:G22)+SUMIF('Measure Summary'!N8:N22,\"Fuel Oil\",'Measure Summary'!H8:H22)+SUMIF('Measure Summary'!N24:N33,\"Fuel Oil\",'Measure Summary'!G24:G33)+SUMIF('Measure Summary'!N24:N33,\"Fuel Oil\",'Measure Summary'!H24:H33)","v":0},0,null,null,null,"Fuel Oil (MMBtu)",{"$f":"'Utility Info'!D16","v":0},null,null,"Fuel Oil",{"$f":"J19*'Utility Info'!F16","v":0},null,null,{"$f":"IF(N(J19)=0,\"\",\"Oil\")","v":""},0,0]
["",null,"Steam (MMBtu)",{"$f":"SUMIF('Measure Summary'!N8:N22,\"Steam\",'Measure Summary'!G8:G22)+SUMIF('Measure Summary'!N8:N22,\"Steam\",'Measure Summary'!H8:H22)+SUMIF('Measure Summary'!N24:N33,\"Steam\",'Measure Summary'!G24:G33)+SUMIF('Measure Summary'!N24:N33,\"Steam\",'Measure Summary'!H24:H33)","v":0},0,null,null,null,"Steam (MMBtu)",{"$f":"'Utility Info'!D17","v":0},null,null,"Steam",{"$f":"J20*'Utility Info'!F17","v":0},null,null,{"$f":"IF(N(J20)=0,\"\",\"S\")","v":""},0,0]
["",null,"Propane (MMBtu)",{"$f":"SUMIF('Measure Summary'!N8:N22,\"Propane\",'Measure Summary'!G8:G22)+SUMIF('Measure Summary'!N8:N22,\"Propane\",'Measure Summary'!H8:H22)+SUMIF('Measure Summary'!N24:N33,\"Propane\",'Measure Summary'!G24:G33)+SUMIF('Measure Summary'!N24:N33,\"Propane\",'Measure Summary'!H24:H33)","v":0},0,null,null,null,"Propane (MMBtu)",{"$f":"'Utility Info'!D18","v":0},null,null,"Propane",{"$f":"J21*'Utility Info'!F18","v":0},null,null,{"$f":"IF(N(J21)=0,\"\",\"P\")","v":""},0,0]
["",null,{"$f":"'Utility Info'!$B$19&\" (MMBtu)\"","v":"Select Other Fuel Type… (MMBtu)"},{"$f":"SUMIF('Measure Summary'!N8:N22,'Utility Info'!$B$19,'Measure Summary'!G8:G22)+SUMIF('Measure Summary'!N8:N22,'Utility Info'!$B$19,'Measure Summary'!H8:H22)+SUMIF('Measure Summary'!N24:N33,'Utility Info'!$B$19,'Measure Summary'!G24:G33)+SUMIF('Measure Summary'!N24:N33,'Utility Info'!$B$19,'Measure Summary'!H24:H33)","v":0},0,null,null,null,{"$f":"'Utility Info'!$B$19&\" (MMBtu)\"","v":"Select Other Fuel Type… (MMBtu)"},{"$f":"'Utility Info'!D19","v":0},null,null,{"$f":"'Utility Info'!$B$19","v":"Select Other Fuel Type…"},{"$f":"J22*'Utility Info'!F19","v":0},null,null,{"$f":"IF(N(J22)=0,\"\",\"Oth\")","v":""},0,0]
[1]
[1,null,"Total Site Savings (MMBtu)",{"$f":"D17*Calcs!$B$88+SUM(D18:D22)","v":0},{"$f":"IFERROR(D24/J24,\"\")","v":""},null,null,null,"Total Site Usage (MMBtu)",{"$f":"J17*Calcs!$B$88+SUM(J18:J22)","v":0},null,null,"Total Cost",{"$f":"SUM(N17:N22)","v":0}]
[1]
[1,null,"Total Source Savings (%)",{"$f":"'Measure Summary'!$U$41","v":0}]
[1]
[1,null,"Total Source EUI (kBtu/sqft)",{"$f":"IFERROR((('Utility Info'!$E$20*1000)-(SUM('Measure QC'!$G$6:$G$31)*1000))/'General Project Info'!$C$47,0)","v":0}]
[1]
[1,null,"NYSERDA Incentive",{"$f":"IF(N('Measure Summary'!$F$48)=0,0,'Measure Summary'!$F$48)","v":0}]
[1]
[1,"POST-CONSTRUCTION RESULTS"]
[1]
[1]
[1]
[1]
[1]
[1]
[1]
[1,null,null,null,null,null,null,null,null,null,null,null,null,null,null,null,"Chart Data"]
[1]
[1,null,"Actual Energy Savings",null,null,null,null,"Post-Retrofit Energy Use",null,null,null,null,"Post-Retrofit Energy Cost"]
[1]
[{"$f":"IF(AND(N(D44)=0,N(J44)=0)=TRUE,\"\",1)","v":""},null,"Electricity (kWh)",{"$f":"IF(J44=\"\",\"\",J17-J44)","v":0},{"$f":"IF(N(J44)=0,0,D44/J17)","v":0},null,null,null,"Electricity (kWh)",{"$f":"IF('Utility Info'!D49=\"\",IF(J17=\"\",\"\",0),'Utility Info'!D49/Calcs!$B$88)","v":0},null,null,"Electricity",{"$f":"IF(J44=\"\",\"\",J44*'Utility Info'!F49)","v":0},null,null,{"$f":"IF(J44=\"\",\"\",\"E\")","v":"E"},{"$f":"J44*3412/1000000","v":0},{"$f":"N44","v":0}]
[{"$f":"IF(AND(N(D45)=0,N(J45)=0)=TRUE,\"\",1)","v":""},null,"Natural Gas (MMBtu)",0,{"$f":"IF(N(J45)=0,0,D45/J18)","v":0},null,null,null,"Natural Gas (MMBtu)",{"$f":"IF('Utility Info'!D50=\"\",IF(J18=\"\",\"\",0),'Utility Info'!D50)","v":0},null,null,"Natural Gas",{"$f":"IF(J45=\"\",\"\",J45*'Utility Info'!F50)","v":0},null,null,{"$f":"IF(J45=\"\",\"\",\"NG\")","v":"NG"},{"$f":"J45","v":0},0]
["",null,"Fuel Oil (MMBtu)",0,0,null,null,null,"Fuel Oil (MMBtu)",{"$f":"IF('Utility Info'!D51=\"\",IF(J19=\"\",\"\",0),'Utility Info'!D51)","v":0},null,null,"Fuel Oil",{"$f":"IF(J46=\"\",\"\",J46*'Utility Info'!F51)","v":0},null,null,{"$f":"IF(J46=\"\",\"\",\"Oil\")","v":"Oil"},{"$f":"J46","v":0},0]
["",null,"Steam (MMBtu)",0,0,null,null,null,"Steam (MMBtu)",{"$f":"IF('Utility Info'!D52=\"\",IF(J20=\"\",\"\",0),'Utility Info'!D52)","v":0},null,null,"Steam",{"$f":"IF(J47=\"\",\"\",J47*'Utility Info'!F52)","v":0},null,null,{"$f":"IF(J47=\"\",\"\",\"S\")","v":"S"},{"$f":"J47","v":0},0]
["",null,"Propane (MMBtu)",0,0,null,null,null,"Propane (MMBtu)",{"$f":"IF('Utility Info'!D53=\"\",IF(J21=\"\",\"\",0),'Utility Info'!D53)","v":0},null,null,"Propane",{"$f":"IF(J48=\"\",\"\",J48*'Utility Info'!F53)","v":0},null,null,{"$f":"IF(J48=\"\",\"\",\"P\")","v":"P"},{"$f":"J48","v":0},0]
["",null,{"$f":"'Utility Info'!$B$19&\" (MMBtu)\"","v":"Select Other Fuel Type… (MMBtu)"},0,0,null,null,null,{"$f":"'Utility Info'!$B$19&\" (MMBtu)\"","v":"Select Other Fuel Type… (MMBtu)"},{"$f":"IF('Utility Info'!D54=\"\",IF(J22=\"\",\"\",0),'Utility Info'!D54)","v":0},null,null,{"$f":"'Utility Info'!$B$19","v":"Select Other Fuel Type…"},{"$f":"IF(J49=\"\",\"\",J49*'Utility Info'!F54)","v":0},null,null,{"$f":"IF(J49=\"\",\"\",\"Oth\")","v":"Oth"},{"$f":"J49","v":0},0]
[1]
[1,null,"Total Site Savings (MMBtu)",{"$f":"IFERROR(D44*Calcs!$B$88+SUM(D45:D49),\"\")","v":0},{"$f":"IFERROR(D51/J24,\"\")","v":""},null,null,null,"Total Site Usage (MMBtu)",{"$f":"IFERROR(J44*Calcs!$B$88+SUM(J45:J49),\"\")","v":0},null,null,"Total Cost",{"$f":"SUM(N44:N49)","v":0}]
[1]
[1,null,"Total Source Savings (%)",{"$f":"IFERROR(('Utility Info'!E20-'Utility Info'!E55)/'Utility Info'!E20,0)","v":0}]
[1]
[1,null,"Total Source EUI (kBtu/sqft)",{"$f":"IFERROR((('Utility Info'!$E$55*1000))/'General Project Info'!$C$47,0)","v":0}]
[1]

{"sheet":"External Calculations","index":11,"n_rows":0,"n_cols":0,"rows_kept":0,"cut":false,"hidden":false,"merged":[]}

{"sheet":"UDAT Support","index":12,"n_rows":42,"n_cols":14,"rows_kept":42,"cut":false,"hidden":true,"merged":[[0,0,0,11],[9,0,9,2],[20,0,20,2],[34,0,34,2],[30,0,30,1]]}
["Drop Down Lists",null,null,null,null,null,null,null,null,null,null,null,null,"Named Ranges"]
["GasUnits","OilUnits","SteamUnits","PropaneUnits","OtherFuels","OtherUnits","ElecUtil","GasUtil","MeterConf","UDAT_YesNo","UDAT_UnitTypes","MeterRead",null,"UDAT_UnitCount"]
["<Not Used>","<Not Used>","<Not Used>","<Not Used>","Select Other Fuel Type…","<Not Used>","<Select One>","<Select One>","Direct Metered","<Select>","Studio","Actual",null,{"$f":"'General Project Info'!C40","v":0}]
["Therms","#2 Oil gallons","Mlbs","Gallons","Wood","MMBtu","Central Hudson","Central Hudson","Submetered","Yes","1-Bedroom","Estimated"]
["MMBtu","#4 Oil gallons","MMBtu",null,"Biofuel",null,"Con Edison","Con Edison","Master Metered","No","2-Bedroom"]
[null,"#6 Oil gallons",null,null,"Other",null,"PSEG LI","KEDLI",null,null,"3-Bedroom"]
[null,null,null,null,null,null,"National Grid","KEDNY",null,null,"4+ Bedroom"]
[null,null,null,null,null,null,"NYSEG","National Fuel Gas"]
[null,null,null,null,null,null,"O&R","National Grid"]
["Oil Conversion",null,null,null,null,null,"RG&E","NYSEG"]
[null,"Type","Conversion",null,null,null,"Other","O&R"]
["Pre-Retrofit",null,{"$f":"VLOOKUP(B12,$A$16:$B$19,2,FALSE)","v":{"$error":"#N/A"}},null,null,null,null,"RG&E"]
["Post-Retrofit",null,{"$f":"VLOOKUP(B13,$A$16:$B$19,2,FALSE)","v":{"$error":"#N/A"}},null,null,null,null,"Other"]
[]
["Type","MMBtu/gallon"]
["#2 Oil gallons",0.1386]
["#4 Oil gallons",0.14499999999999999]
["#6 Oil gallons",0.14859]
["<Not Used>",0]
[]
["Steam Conversion"]
[null,"Type","Conversion"]
["Pre-retrofit",null,{"$f":"VLOOKUP(B23,$A$27:$B$29,2,FALSE)","v":{"$error":"#N/A"}}]
["Post-retrofit",null,{"$f":"VLOOKUP(B24,$A$27:$B$29,2,FALSE)","v":{"$error":"#N/A"}}]
[]
["Type","MMBtu/Unit"]
["Mlbs",1.194]
["MMBtu",1]
["<Not Used>",0]
[]
["Propane Conversion"]
["Type","MMBtu/gallon"]
["Propane",9.1600000000000001E-2]
[]
["Energy Unit Costs (for Detailed Measures)"]
["Type","Unit","$/Unit"]
[null,"kWh"]
[null,"MMBtu"]
[null,"MMBtu"]
[null,"MMBtu"]
[null,"MMBtu"]
[null,"MMBtu"]

{"sheet":"Calcs","index":13,"n_rows":99,"n_cols":107,"rows_kept":99,"cut":false,"hidden":true,"merged":[[3,21,3,24],[3,30,3,49],[3,52,3,71],[3,74,3,93]]}
["Measure Data for QC Calculations"]
["Column Count:",null,null,null,null,null,null,null,null,null,null,null,null,null,null,null,null,null,null,null,null,null,null,null,null,null,null,null,"Adjustments to TRC Test for early Replacement Measures",null,null,null,null,null,null,null,null,null,null,null,null,null,null,null,null,null,null,null,null,null,null,null,null,null,null,null,null,null,null,null,null,null,null,null,null,null,null,null,null,null,null,null,null,null,null,null,null,null,null,null,null,null,null,null,null,null,null,null,null,null,null,null,null,null,null,"TRC Test: Annual Average Electric LRAC Multiplier",null,null,null,"Savings Multiplier",null,null,null,null,"Upper Limit Savings Check"]
[1,2,3,4,5,6,7,8,9,10,11,12,13,14,15,16,17,18,19,20,21,22,23,24,25,26,27,28,29,30,31,32,33,34,35,36,37,38,39,40,41,42,43,44,45,46,47,48,49,50,51,52,53,54,55,56,57,58,59,60,61,62,63,64,65,66,67,68,69,70,71,72,73,74,75,76,77,78,79,80,81,82,83,84,85,86,87,88,89,90,91,92,93,94,95,96,97,98,99,100,101,102,103,104,105,106,107]
["Measure","CRIS Units","Measure Life","QC Check?","Measure Cost \nUpstate",null,"Measure Cost Downstate",null,"Cost","Measure Savings \nLowRise (BTU)",null,"Measure Savings \nHighRise (BTU)",null,"Savings","Source Energy Savings","Source Energy Savings",null,"Demand Savings\n(not used)",null,null,null,"Demand Savings Factors",null,null,null,null,"Full or Incremental Savings","Potential Special Circumstance?","Savings Median Ratio","Savings SC Ratio","Inflated Lifecycle Benefit Adjustment Factors\nRUL =",null,null,null,null,null,null,null,null,null,null,null,null,null,null,null,null,null,null,null,"Cost Median Ratio","Cost SC Ratio","Full Cost Adjustment Factors\nRUL =",null,null,null,null,null,null,null,null,null,null,null,null,null,null,null,null,null,null,null,"EUL Median Ratio","EUL SC (years)","Adjusted EUL",null,null,null,null,null,null,null,null,null,null,null,null,null,null,null,null,null,null,null,null,"Upstate","NYC","Lower Hudson",null,"Cooling","Non-Cooling","Heating","Non-Heating",null,"Upper Limit Check?","Upper Limit\n(Btu)","Upper Limit Units"]
[null,null,null,null,"Min","Max","Min","Max","Units","Min","Max","Min","Max","Units","Min","Max",null,"days/year","hours/day","Diversity factor",null,"Upstate (non-cooling)","Upstate (cooling)","Downstate (non-cooling)","Downstate (cooling)",null,null,null,null,null,1,2,3,4,5,6,7,8,9,10,11,12,13,14,15,16,17,18,19,20,null,null,1,2,3,4,5,6,7,8,9,10,11,12,13,14,15,16,17,18,19,20,null,null,1,2,3,4,5,6,7,8,9,10,11,12,13,14,15,16,17,18,19,20]
["Air Sealing","sqft",15,"y",0.03,0.65584508701881306,0.03,0.5,"Sqft",4000,25000,4000,25000,"$",0,0.05,null,62.5,8,0.84,null,0,1.8500000000000001E-3,0,1.1299999999999999E-3,null,"Full",null,null,null,null,null,null,null,null,null,null,null,null,null,null,null,null,null,null,null,null,null,null,null,null,null,null,null,null,null,null,null,null,null,null,null,null,null,null,null,null,null,null,null,null,null,null,null,null,null,null,null,null,null,null,null,null,null,null,null,null,null,null,null,null,null,null,null,null,1,1,1,null,0,1,0,1,null,"N"]
["Boiler, Replace (Central)","1000 Btu/hr",20,"y",45,80,30,70,"MBH",145000,400000,100000,250000,"MBH",0,0.12,null,0,0,0,null,0,1.8500000000000001E-3,0,1.1299999999999999E-3,null,"Inc","y",0.27,{"$f":"AI7","v":0.52733667679792895},0.35461016691099867,0.35461016691099867,0.41496172409901744,0.47249391479431918,0.52733667679792895,0.57932033746485767,0.62859394947142522,0.67529879497528067,0.67529879497528067,0.7195687907135323,0.76153087198201719,0.80130535659669488,0.83900628988074955,0.83900628988074955,0.87474177166658351,0.90861426625031227,0.94072089618749588,0.97115372077250406,0.97115372077250406,null,0.48,{"$f":"BE7","v":0.60213013600270626},0.50710900473933651,0.53280474382875487,0.55716089462441221,0.5802472934828552,0.60213013600270626,0.62287216682720969,0.64253285955185757,0.66116858725294558,0.67883278412601478,0.69557609869764425,0.71144653904989985,0.72648961047383864,0.74074844594676648,0.75426392980736157,0.76707481498328112,0.77921783410737544,0.79072780484111416,0.80163772970721725,0.81197889071774143,null,{"$f":"0.27*C7","v":5.4},{"$f":"CA7","v":8},5,5,6,7,8,9,10,11,11,12,13,14,15,15,16,17,18,19,19,null,null,1,0.9,1,null,0,1,0,1,null,"Y",17800,"Sqft"]
["Boiler, Replace (In-Unit)","1000 Btu/hr",25,"y",45,80,30,70,"MBH",145000,400000,100000,250000,"MBH",0,0.12,null,0,0,0,null,0,1.8500000000000001E-3,0,1.1299999999999999E-3,null,"Inc","n",0.15,null,0.19989127223431508,0.25935529139625846,0.31571929060189197,0.36945195988236157,0.42067446878931092,0.46950250455957077,0.51578500292000673,0.5596546696123631,0.60123729206957299,0.64065210008588558,0.6780121076842861,0.6780121076842861,0.7134244371614431,0.746990626239317,0.77880691920412637,0.8089645428674529,0.837549968140748,0.86464515797325536,0.89032780236425757,0.91467154112350124,0.16,null,0.20379146919431279,0.24529997080029642,0.28464452208558899,0.3219379356261507,0.35728714277360263,0.39079350025933879,0.42255308081453924,0.45265694863937367,0.48119142051125463,0.50823831328081004,0.5338751784652227,0.55817552461158559,0.58120902806785357,0.60304173276573803,0.62373623958837721,0.64335188586576031,0.66194491551256918,0.67956864029627395,0.69627359269789002,0.7121076708036872,{"$f":"0.15*C8","v":3.75},null,3,4,5,6,7.0000000000000009,8,9,10,11,12,13,13,14.000000000000002,15,16,17,18,19,20,21,null,1,0.9,1,null,0,1,0,1,null,"N"]
["Boiler/Burner Clean and Tune","each",1,"y",500,3250,400,3000,"Each",40000000,175000000,40000000,175000000,"Each",0,0,null,null,null,null,null,0,1.8500000000000001E-3,0,1.1299999999999999E-3,null,"Full",null,null,null,null,null,null,null,null,null,null,null,null,null,null,null,null,null,null,null,null,null,null,null,null,null,null,null,null,null,null,null,null,null,null,null,null,null,null,null,null,null,null,null,null,null,null,null,null,null,null,null,null,null,null,null,null,null,null,null,null,null,null,null,null,null,null,null,null,1,1,1,null,0,1,0,1,null,"N"]
["Burner, Replace","1000 Btu/hr",20,"y",3.25,8.25,3.25,8.25,"MBH",28000,100000,28000,100000,"MBH",0,0.02,null,null,null,null,null,0,1.8500000000000001E-3,0,1.1299999999999999E-3,null,"Full",null,null,null,null,null,null,null,null,null,null,null,null,null,null,null,null,null,null,null,null,null,null,null,null,null,null,null,null,null,null,null,null,null,null,null,null,null,null,null,null,null,null,null,null,null,null,null,null,null,null,null,null,null,null,null,null,null,null,null,null,null,null,null,null,null,null,null,null,1,1,1,null,0,1,0,1,null,"N"]
["Central AC/HP","each",15,"y",0,9999999,0,9999999,"Each",0,9999999999,0,9999999999,"Each",0,0.03,null,null,null,null,null,0,1.8500000000000001E-3,0,1.1299999999999999E-3,null,"Inc","y",{"$f":"VLOOKUP($H$82,$AA$95:$CP$99,AC80)","v":{"$error":"#N/A"}},{"$f":"AH11","v":{"$error":"#N/A"}},{"$f":"VLOOKUP($H$82,$AA$95:$CP$99,AE80)","v":{"$error":"#N/A"}},{"$f":"VLOOKUP($H$82,$AA$95:$CP$99,AF80)","v":{"$error":"#N/A"}},{"$error":"#N/A"},{"$error":"#N/A"},{"$error":"#N/A"},{"$error":"#N/A"},{"$error":"#N/A"},{"$error":"#N/A"},{"$error":"#N/A"},{"$error":"#N/A"},{"$error":"#N/A"},{"$error":"#N/A"},{"$error":"#N/A"},{"$error":"#N/A"},null,null,null,null,null,null,{"$f":"VLOOKUP($H$82,$AA$95:$CP$99,AY80)","v":{"$error":"#N/A"}},{"$f":"BD11","v":{"$error":"#N/A"}},{"$f":"VLOOKUP($H$82,$AA$95:$CP$99,BA80)","v":{"$error":"#N/A"}},{"$error":"#N/A"},{"$error":"#N/A"},{"$error":"#N/A"},{"$error":"#N/A"},{"$error":"#N/A"},{"$error":"#N/A"},{"$error":"#N/A"},{"$error":"#N/A"},{"$error":"#N/A"},{"$error":"#N/A"},{"$error":"#N/A"},{"$error":"#N/A"},{"$error":"#N/A"},null,null,null,null,null,null,{"$f":"VLOOKUP($H$82,$AA$95:$CP$99,BU80)*C11","v":{"$error":"#N/A"}},{"$f":"BZ11","v":{"$error":"#N/A"}},{"$f":"VLOOKUP($H$82,$AA$95:$CP$99,BW80)","v":{"$error":"#N/A"}},{"$error":"#N/A"},{"$error":"#N/A"},{"$error":"#N/A"},{"$error":"#N/A"},{"$error":"#N/A"},{"$error":"#N/A"},{"$error":"#N/A"},{"$error":"#N/A"},{"$error":"#N/A"},{"$error":"#N/A"},{"$error":"#N/A"},{"$error":"#N/A"},{"$error":"#N/A"},null,null,null,null,null,null,null,1,0.9,1,null,0,1,0,1,null,"N"]
["Chiller, Replace","tons",20,"y",800,2600,800,2600,"Tons",2000000,16000000,2000000,16000000,"Tons",0,0.08,null,62.5,8,0.9,null,0,1.8500000000000001E-3,0,1.1299999999999999E-3,null,"Inc","y",{"$f":"VLOOKUP($H$81,$AA$86:$CP$93,AC80)","v":{"$error":"#N/A"}},{"$f":"AI12","v":{"$error":"#N/A"}},{"$f":"VLOOKUP($H$81,$AA$86:$CP$93,AE80)","v":{"$error":"#N/A"}},{"$f":"VLOOKUP($H$81,$AA$86:$CP$93,AF80)","v":{"$error":"#N/A"}},{"$error":"#N/A"},{"$error":"#N/A"},{"$error":"#N/A"},{"$error":"#N/A"},{"$error":"#N/A"},{"$error":"#N/A"},{"$error":"#N/A"},{"$error":"#N/A"},{"$error":"#N/A"},{"$error":"#N/A"},{"$error":"#N/A"},{"$error":"#N/A"},{"$error":"#N/A"},{"$error":"#N/A"},{"$error":"#N/A"},{"$error":"#N/A"},{"$error":"#N/A"},null,{"$error":"#N/A"},{"$f":"BE12","v":{"$error":"#N/A"}},{"$error":"#N/A"},{"$error":"#N/A"},{"$error":"#N/A"},{"$error":"#N/A"},{"$error":"#N/A"},{"$error":"#N/A"},{"$error":"#N/A"},{"$error":"#N/A"},{"$error":"#N/A"},{"$error":"#N/A"},{"$error":"#N/A"},{"$error":"#N/A"},{"$error":"#N/A"},{"$error":"#N/A"},{"$error":"#N/A"},{"$error":"#N/A"},{"$error":"#N/A"},{"$error":"#N/A"},{"$error":"#N/A"},null,{"$f":"VLOOKUP($H$81,$AA$86:$CP$93,BU80)*C12","v":{"$error":"#N/A"}},{"$f":"CA12","v":{"$error":"#N/A"}},{"$f":"VLOOKUP($H$81,$AA$86:$CP$93,BW80)","v":{"$error":"#N/A"}},{"$error":"#N/A"},{"$error":"#N/A"},{"$error":"#N/A"},{"$error":"#N/A"},{"$error":"#N/A"},{"$error":"#N/A"},{"$error":"#N/A"},{"$error":"#N/A"},{"$error":"#N/A"},{"$error":"#N/A"},{"$error":"#N/A"},{"$error":"#N/A"},{"$error":"#N/A"},null,null,null,null,null,null,null,1,1,1,null,0,1,0,1,null,"Y",22000000,"Tons"]
["CHP","1000 Btu/hr",null,"n",null,null,null,null,null,null,null,null,null,null,null,null,null,null,null,null,null,null,null,null,null,null,"Full",null,null,null,null,null,null,null,null,null,null,null,null,null,null,null,null,null,null,null,null,null,null,null,null,null,null,null,null,null,null,null,null,null,null,null,null,null,null,null,null,null,null,null,null,null,null,null,null,null,null,null,null,null,null,null,null,null,null,null,null,null,null,null,null,null,null,null,null,null,null,null,null,null,null,null,null,null,"N"]
["Constant Air Regulators, Install","each",10,"y",0.25,0.5,0.06,0.1,"Sqft",1300,3500,1300,3500,"Sqft",0,3.5000000000000003E-2,null,365,24,1,null,0,1.8500000000000001E-3,0,1.1299999999999999E-3,null,"Full",null,null,null,null,null,null,null,null,null,null,null,null,null,null,null,null,null,null,null,null,null,null,null,null,null,null,null,null,null,null,null,null,null,null,null,null,null,null,null,null,null,null,null,null,null,null,null,null,null,null,null,null,null,null,null,null,null,null,null,null,null,null,null,null,null,null,null,null,1,1,1,null,0,1,0,1,null,"N"]
["Controls","each",10,"y",6,16,6,16,"Unit",115000,600000,100000,600000,"Unit",0,8.0000000000000002E-3,null,365,24,1,null,1.1400000000000001E-4,1.8500000000000001E-3,1.1400000000000001E-4,1.1299999999999999E-3,null,"Full",null,null,null,null,null,null,null,null,null,null,null,null,null,null,null,null,null,null,null,null,null,null,null,null,null,null,null,null,null,null,null,null,null,null,null,null,null,null,null,null,null,null,null,null,null,null,null,null,null,null,null,null,null,null,null,null,null,null,null,null,null,null,null,null,null,null,null,null,1,1,1,null,0,1,0,1,null,"N"]
["DHW Tank, Insulate","Ins. Sqft",11,"y",0.01,0.04,0.01,0.04,"Sqft",225,400,225,400,"Sqft",0,0,null,null,null,null,null,1.1400000000000001E-4,1.8500000000000001E-3,1.1400000000000001E-4,1.1299999999999999E-3,null,"Full",null,null,null,null,null,null,null,null,null,null,null,null,null,null,null,null,null,null,null,null,null,null,null,null,null,null,null,null,null,null,null,null,null,null,null,null,null,null,null,null,null,null,null,null,null,null,null,null,null,null,null,null,null,null,null,null,null,null,null,null,null,null,null,null,null,null,null,null,1,1,1,null,0,1,0,1,null,"N"]
["Dishwasher, Install Energy Star","each",11,"y",350,500,350,500,"Each",850000,2400000,625000,1800000,"Each",0,5.0000000000000001E-3,null,365,0.8,0.41,null,1.1400000000000001E-4,1.8500000000000001E-3,1.1400000000000001E-4,1.1299999999999999E-3,null,"Inc","n",0.33,null,0.43480725185903485,0.52843350907691833,0.52843350907691833,0.61739657199093978,0.70192869789474455,0.7822505761637365,0.7822505761637365,0.85857190441236586,0.93109193595505135,0.93109193595505135,null,null,null,null,null,null,null,null,null,null,0.06,null,0.10900473933649302,0.15545472922890313,0.19948315566720676,0.24121626129593055,0.28077370738950758,0.3182689169568792,0.35380939995912719,0.38749706157263242,0.41942849438164209,0.44969525533804933,null,null,null,null,null,null,null,null,null,null,{"$f":"0.33*C17","v":3.6300000000000003},null,4,5,5,6,7,8,8,9,10,10,null,null,null,null,null,null,null,null,null,null,null,1,1,1,null,0,1,0,1,null,"N"]
["Distribution System, Upgrade","each",null,"y",0.15,0.3,0.15,0.3,"Sqft",750,3750,750,3750,"Sqft",0,0.04,null,null,null,null,null,0,1.8500000000000001E-3,0,1.1299999999999999E-3,null,"Full",null,null,null,null,null,null,null,null,null,null,null,null,null,null,null,null,null,null,null,null,null,null,null,null,null,null,null,null,null,null,null,null,null,null,null,null,null,null,null,null,null,null,null,null,null,null,null,null,null,null,null,null,null,null,null,null,null,null,null,null,null,null,null,null,null,null,null,null,1,1,1,null,0,1,0,1,null,"N"]
["Duct Sealing","sqft",18,"y",0.3,1.1499999999999999,0.3,1.1499999999999999,"Ins. Sqft",4250,14000,4250,14000,"Ins. Sqft",0,0.03,null,0,0,0,null,0,1.8500000000000001E-3,0,1.1299999999999999E-3,null,"Full",null,null,null,null,null,null,null,null,null,null,null,null,null,null,null,null,null,null,null,null,null,null,null,null,null,null,null,null,null,null,null,null,null,null,null,null,null,null,null,null,null,null,null,null,null,null,null,null,null,null,null,null,null,null,null,null,null,null,null,null,null,null,null,null,null,null,null,null,1,1,1.1000000000000001,null,1,0,1,0,null,"N"]
["Economizer, Install","each",10,"y",0,9999999,0,9999999,"Each",0,9999999999,0,9999999999,"Each",0,0.02,null,0,0,0,null,0,1.8500000000000001E-3,0,1.1299999999999999E-3,null,"Full",null,null,null,null,null,null,null,null,null,null,null,null,null,null,null,null,null,null,null,null,null,null,null,null,null,null,null,null,null,null,null,null,null,null,null,null,null,null,null,null,null,null,null,null,null,null,null,null,null,null,null,null,null,null,null,null,null,null,null,null,null,null,null,null,null,null,null,null,1,0.9,1,null,1,0,1,0,null,"N"]
["Elevator Motors and Controls, Upgrade","each",20,"y",3500,50000,3500,50000,"Each",7500000,75000000,7500000,75000000,"Each",0,0.03,null,null,null,null,null,1.1400000000000001E-4,1.8500000000000001E-3,1.1400000000000001E-4,1.1299999999999999E-3,null,"Inc","y",0,0,0,0,0,0,0,0,0,0,0,0,0,0,0,0,0,0,0,0,0,0,0,0,0,0,0,0,0,0,0,0,0,0,0,0,0,0,0,0,0,0,0,0,null,null,null,null,null,null,null,null,null,null,null,null,null,null,null,null,null,null,null,null,null,null,null,1,1,1,null,0,1,1,0,null,"Y",102000000,"Each"]
["Energy Management System (EMS), Install","sqft",15,"y",0.1,0.45,0.12,0.45,"Sqft",15000,45000,15000,45000,"$",0,0.06,null,0,0,0,null,0,1.8500000000000001E-3,0,1.1299999999999999E-3,null,"Full",null,null,null,null,null,null,null,null,null,null,null,null,null,null,null,null,null,null,null,null,null,null,null,null,null,null,null,null,null,null,null,null,null,null,null,null,null,null,null,null,null,null,null,null,null,null,null,null,null,null,null,null,null,null,null,null,null,null,null,null,null,null,null,null,null,null,null,null,1,0.9,1,null,1,0,1,0,null,"Y",8300,"Sqft"]
["Exhaust Fan Demand Control","each",10,"y",1500,18000,1500,18000,"Each",25000000,900000000,25000000,900000000,"Each",0,0.04,null,null,null,null,null,1.1400000000000001E-4,1.8500000000000001E-3,1.1400000000000001E-4,1.1299999999999999E-3,null,"Full",null,null,null,null,null,null,null,null,null,null,null,null,null,null,null,null,null,null,null,null,null,null,null,null,null,null,null,null,null,null,null,null,null,null,null,null,null,null,null,null,null,null,null,null,null,null,null,null,null,null,null,null,null,null,null,null,null,null,null,null,null,null,null,null,null,null,null,null,1,1,1,null,1,0,1,0,null,"N"]
["Exhaust Fans, Replace","each",15,"y",500,1500,500,1500,"Each",500000,4000000,500000,4000000,"Each",0,8.9999999999999993E-3,null,365,24,0.78,null,1.1400000000000001E-4,1.8500000000000001E-3,1.1400000000000001E-4,1.1299999999999999E-3,null,"Inc","y",0,0,0,0,0,0,0,0,0,0,0,0,0,0,0,0,0,0,0,0,0,0,0,0,0,0,0,0,0,0,0,0,0,0,0,0,0,0,0,0,0,0,0,0,null,null,null,null,null,null,null,null,null,null,null,null,null,null,null,null,null,null,null,null,null,null,null,1,1,1,null,1,0,1,0,null,"N"]
["Exterior Doors, Replace","each",20,"y",350,1250,500,1500,"Each",500000,4000000,500000,4000000,"Each",0,0.02,null,62.5,8,0.84,null,0,1.8500000000000001E-3,0,1.1299999999999999E-3,null,"Inc","y",0.63,{"$f":"AI25","v":0.76153087198201719},0.67529879497528067,0.67529879497528067,0.7195687907135323,0.7195687907135323,0.76153087198201719,0.80130535659669488,0.80130535659669488,0.83900628988074955,0.83900628988074955,0.87474177166658351,0.87474177166658351,0.90861426625031227,0.90861426625031227,0.94072089618749588,0.94072089618749588,0.94072089618749588,0.97115372077250406,0.97115372077250406,1,null,0.1,{"$f":"BE25","v":0.31137908154314553},0.14691943127962082,0.19139282585746042,0.23354770223455956,0.27350493102801854,0.31137908154314553,0.34727875027786304,0.38130687230129201,0.41356101639932885,0.44413366483348704,0.47311247851515359,0.50058054835559584,0.52661663351241306,0.55129538721555749,0.57468757082043354,0.59686025670183263,0.61787702057045757,0.6377981237634669,0.65668068603172203,0.67457884931916778,null,{"$f":"0.63*C25","v":12.6},{"$f":"CA25","v":13},11,11,12,12,13,14,14,15,15,16,16,17,17,18,18,18,19,19,20,null,null,1,1,1,null,0,1,0,1,null,"N"]
["Exterior Lighting, Upgrade","each",20,"y",15,110,25,225,"Each",200000,1750000,200000,1750000,"Each",0,1.2999999999999999E-2,null,0,0,0,null,0,1.8500000000000001E-3,0,1.1299999999999999E-3,null,"Full",null,null,null,null,null,null,null,null,null,null,null,null,null,null,null,null,null,null,null,null,null,null,null,null,null,null,null,null,null,null,null,null,null,null,null,null,null,null,null,null,null,null,null,null,null,null,null,null,null,null,null,null,null,null,null,null,null,null,null,null,null,null,null,null,null,null,null,null,1,1,1,null,1,0,1,0,null,"Y",2300000,"Each"]
["Fan/Air Handlers, Upgrade","each",15,"y",500,4000,500,4000,"Each",7500000,40000000,7500000,40000000,"Each",0,0.04,null,null,null,null,null,1.1400000000000001E-4,1.8500000000000001E-3,1.1400000000000001E-4,1.1299999999999999E-3,null,"Inc","y",0,0,0,0,0,0,0,0,0,0,0,0,0,0,0,0,0,0,0,0,0,0,0,0,0,0,0,0,0,0,0,0,0,0,0,0,0,0,0,0,0,0,0,0,null,null,null,null,null,null,null,null,null,null,null,null,null,null,null,null,null,null,null,null,null,null,null,1,1,1,null,0,1,1,0,null,"N"]
["Furnace, Replace","1000 Btu/hr",20,"y",45,80,33,70,"MBH",145000,400000,145000,250000,"MBH",0,0.12,null,0,0,0,null,0,1.8500000000000001E-3,0,1.1299999999999999E-3,null,"Inc","y",{"$f":"VLOOKUP($H$80,$AA$81:$CP$84,AC80)","v":{"$error":"#N/A"}},{"$f":"AI28","v":{"$error":"#N/A"}},{"$f":"VLOOKUP($H$80,$AA$81:$CP$84,AE80)","v":{"$error":"#N/A"}},{"$f":"VLOOKUP($H$80,$AA$81:$CP$84,AF80)","v":{"$error":"#N/A"}},{"$error":"#N/A"},{"$error":"#N/A"},{"$error":"#N/A"},{"$error":"#N/A"},{"$error":"#N/A"},{"$error":"#N/A"},{"$error":"#N/A"},{"$error":"#N/A"},{"$error":"#N/A"},{"$error":"#N/A"},{"$error":"#N/A"},{"$error":"#N/A"},{"$error":"#N/A"},{"$error":"#N/A"},{"$error":"#N/A"},{"$error":"#N/A"},{"$error":"#N/A"},null,{"$error":"#N/A"},{"$f":"BE28","v":{"$error":"#N/A"}},{"$error":"#N/A"},{"$error":"#N/A"},{"$error":"#N/A"},{"$error":"#N/A"},{"$error":"#N/A"},{"$error":"#N/A"},{"$error":"#N/A"},{"$error":"#N/A"},{"$error":"#N/A"},{"$error":"#N/A"},{"$error":"#N/A"},{"$error":"#N/A"},{"$error":"#N/A"},{"$error":"#N/A"},{"$error":"#N/A"},{"$error":"#N/A"},{"$error":"#N/A"},{"$error":"#N/A"},{"$error":"#N/A"},null,{"$f":"VLOOKUP($H$80,$AA$81:$CP$84,BU80)*C28","v":{"$error":"#N/A"}},{"$f":"CA28","v":{"$error":"#N/A"}},{"$error":"#N/A"},{"$error":"#N/A"},{"$error":"#N/A"},{"$error":"#N/A"},{"$error":"#N/A"},{"$error":"#N/A"},{"$error":"#N/A"},{"$error":"#N/A"},{"$error":"#N/A"},{"$error":"#N/A"},{"$error":"#N/A"},{"$error":"#N/A"},{"$error":"#N/A"},{"$error":"#N/A"},{"$error":"#N/A"},{"$error":"#N/A"},{"$error":"#N/A"},{"$error":"#N/A"},{"$error":"#N/A"},null,null,1,0.9,1,null,1,0,1,0,null,"N"]
["Gas-fired Dryers, Replace Electric","each",14,"y",700,1800,1000,1800,"Each",-8000000,2500000,-7500000,2500000,"Each",0,1.4999999999999999E-2,null,null,null,null,null,1.1400000000000001E-4,1.8500000000000001E-3,1.1400000000000001E-4,1.1299999999999999E-3,null,"Full",null,null,null,null,null,null,null,null,null,null,null,null,null,null,null,null,null,null,null,null,null,null,null,null,null,null,null,null,null,null,null,null,null,null,null,null,null,null,null,null,null,null,null,null,null,null,null,null,null,null,null,null,null,null,null,null,null,null,null,null,null,null,null,null,null,null,null,null,1,1,1,null,1,0,1,0,null,"N"]
["Geothermal Heat Pump","1000 Btu/hr",null,"n",null,null,null,null,null,null,null,null,null,null,null,null,null,null,null,null,null,null,null,null,null,null,"Full",null,null,null,null,null,null,null,null,null,null,null,null,null,null,null,null,null,null,null,null,null,null,null,null,null,null,null,null,null,null,null,null,null,null,null,null,null,null,null,null,null,null,null,null,null,null,null,null,null,null,null,null,null,null,null,null,null,null,null,null,null,null,null,null,null,null,null,null,null,null,null,null,null,null,null,null,null,"N"]
["Heat/Energy Recovery","1000 Btu/hr",15,"y",0,9999999,0,9999999,"MBH",0,9999999999,0,9999999999,"MBH",0,0.04,null,0,0,0,null,0,1.8500000000000001E-3,0,1.1299999999999999E-3,null,"Full",null,null,null,null,null,null,null,null,null,null,null,null,null,null,null,null,null,null,null,null,null,null,null,null,null,null,null,null,null,null,null,null,null,null,null,null,null,null,null,null,null,null,null,null,null,null,null,null,null,null,null,null,null,null,null,null,null,null,null,null,null,null,null,null,null,null,null,null,1,0.9,1,null,0,1,1,0,null,"N"]
["High Efficiency Fluorescent, Apt, Install","each",8,"y",5,35,10,100,"Each",30000,120000,30000,140000,"Each",0,3.5000000000000003E-2,null,365,3,0.10299999999999999,null,2.1000000000000001E-4,1.8500000000000001E-3,2.1000000000000001E-4,1.1299999999999999E-3,null,"Full",null,null,null,null,null,null,null,null,null,null,null,null,null,null,null,null,null,null,null,null,null,null,null,null,null,null,null,null,null,null,null,null,null,null,null,null,null,null,null,null,null,null,null,null,null,null,null,null,null,null,null,null,null,null,null,null,null,null,null,null,null,null,null,null,null,null,null,null,1,1,1,null,0,1,1,0,null,"Y",300000,"Unit"]
["High Efficiency Fluorescent, CA, Install","each",15,"y",20,160,60,240,"Each",55000,300000,100000,450000,"Each",0,3.5000000000000003E-2,null,365,24,0.9,null,1.1400000000000001E-4,1.8500000000000001E-3,1.1400000000000001E-4,1.1299999999999999E-3,null,"Full",null,null,null,null,null,null,null,null,null,null,null,null,null,null,null,null,null,null,null,null,null,null,null,null,null,null,null,null,null,null,null,null,null,null,null,null,null,null,null,null,null,null,null,null,null,null,null,null,null,null,null,null,null,null,null,null,null,null,null,null,null,null,null,null,null,null,null,null,1,1,1,null,0,1,1,0,null,"Y",918000,"Each"]
["Insulation, Above Grade Walls","Ins. sqft",30,"y",1.5,3.5,1.5,3.5,"Ins. Sqft",5000,22500,5000,22500,"Ins. Sqft",0,0.05,null,62.5,8,0.84,null,0,1.8500000000000001E-3,0,1.1299999999999999E-3,null,"Full",null,null,null,null,null,null,null,null,null,null,null,null,null,null,null,null,null,null,null,null,null,null,null,null,null,null,null,null,null,null,null,null,null,null,null,null,null,null,null,null,null,null,null,null,null,null,null,null,null,null,null,null,null,null,null,null,null,null,null,null,null,null,null,null,null,null,null,null,1,1,1,null,0,1,1,0,null,"Y",27500,"Ins. Sqft"]
["Insulation, Below Grade Walls","Ins. sqft",30,"y",1.5,3.5,1.5,3.5,"Ins. Sqft",5000,22500,5000,22500,"Ins. Sqft",0,0.02,null,62.5,8,0.84,null,0,1.8500000000000001E-3,0,1.1299999999999999E-3,null,"Full",null,null,null,null,null,null,null,null,null,null,null,null,null,null,null,null,null,null,null,null,null,null,null,null,null,null,null,null,null,null,null,null,null,null,null,null,null,null,null,null,null,null,null,null,null,null,null,null,null,null,null,null,null,null,null,null,null,null,null,null,null,null,null,null,null,null,null,null,1,1,1,null,1,0,1,0,null,"N"]
["Insulation, Other Shell","Ins. sqft",30,"y",1,4.5,1.5,4.5,"Ins. Sqft",6000,55000,4500,50000,"Ins. Sqft",0,0.03,null,null,null,null,null,0,1.8500000000000001E-3,0,1.1299999999999999E-3,null,"Full",null,null,null,null,null,null,null,null,null,null,null,null,null,null,null,null,null,null,null,null,null,null,null,null,null,null,null,null,null,null,null,null,null,null,null,null,null,null,null,null,null,null,null,null,null,null,null,null,null,null,null,null,null,null,null,null,null,null,null,null,null,null,null,null,null,null,null,null,1,1,1,null,1,0,0,1,null,"N"]
["Insulation, Roof Deck or Attic","Ins. Sqft",30,"y",1,3,2,4,"Ins. Sqft",3200,17500,7500,20000,"Ins. Sqft",0,0.05,null,62.5,8,0.84,null,0,1.8500000000000001E-3,0,1.1299999999999999E-3,null,"Full",null,null,null,null,null,null,null,null,null,null,null,null,null,null,null,null,null,null,null,null,null,null,null,null,null,null,null,null,null,null,null,null,null,null,null,null,null,null,null,null,null,null,null,null,null,null,null,null,null,null,null,null,null,null,null,null,null,null,null,null,null,null,null,null,null,null,null,null,1,1,1,null,1,0,1,0,null,"Y",40000,"Ins. Sqft"]
["Insulation, Slab","Ins. sqft",30,"y",0,9999999,0,9999999,"Ins. Sqft",0,9999999999,0,9999999999,"Ins. Sqft",0,0.03,null,null,null,null,null,0,1.8500000000000001E-3,0,1.1299999999999999E-3,null,"Full",null,null,null,null,null,null,null,null,null,null,null,null,null,null,null,null,null,null,null,null,null,null,null,null,null,null,null,null,null,null,null,null,null,null,null,null,null,null,null,null,null,null,null,null,null,null,null,null,null,null,null,null,null,null,null,null,null,null,null,null,null,null,null,null,null,null,null,null,1,1,1,null,1,0,1,0,null,"N"]
["LED Exit Signs","each",15,"y",50,160,50,180,"Each",100000,1000000,100000,1000000,"Each",0,1.4999999999999999E-2,null,null,null,null,null,1.1400000000000001E-4,1.8500000000000001E-3,1.1400000000000001E-4,1.1299999999999999E-3,null,"Full",null,null,null,null,null,null,null,null,null,null,null,null,null,null,null,null,null,null,null,null,null,null,null,null,null,null,null,null,null,null,null,null,null,null,null,null,null,null,null,null,null,null,null,null,null,null,null,null,null,null,null,null,null,null,null,null,null,null,null,null,null,null,null,null,null,null,null,null,1,1,1,null,1,0,1,0,null,"Y",1140000,"Each"]
["LED Fixtures & Screw-Ins","each",15,"y",25,225,20,300,"Each",67250,1600000,67250,1600000,"Each",0,3.5000000000000003E-2,null,null,null,null,null,1.1400000000000001E-4,1.8500000000000001E-3,1.1400000000000001E-4,1.1299999999999999E-3,null,"Full",null,null,null,null,null,null,null,null,null,null,null,null,null,null,null,null,null,null,null,null,null,null,null,null,null,null,null,null,null,null,null,null,null,null,null,null,null,null,null,null,null,null,null,null,null,null,null,null,null,null,null,null,null,null,null,null,null,null,null,null,null,null,null,null,null,null,null,null,1,1,1,null,1,0,1,0,null,"Y",1600000,"Each"]
["Low-flow Devices","each",10,"y",10,45,15,100,"Unit",500000,3000000,500000,4000000,"Unit",0,0.03,null,365,24,0.98,null,1.1400000000000001E-4,1.8500000000000001E-3,1.1400000000000001E-4,1.1299999999999999E-3,null,"Full",null,null,null,null,null,null,null,null,null,null,null,null,null,null,null,null,null,null,null,null,null,null,null,null,null,null,null,null,null,null,null,null,null,null,null,null,null,null,null,null,null,null,null,null,null,null,null,null,null,null,null,null,null,null,null,null,null,null,null,null,null,null,null,null,null,null,null,null,1,1,1,null,1,0,1,0,null,"Y",2400000,"Each"]
["Motors, Install NEMA Premium Efficiency","each",15,"y",525,4000,500,4000,"Each",2000000,11000000,2000000,11000000,"Each",0,8.9999999999999993E-3,null,365,24,0.78,null,1.1400000000000001E-4,1.8500000000000001E-3,1.1400000000000001E-4,1.1299999999999999E-3,null,"Inc","y",0,0,0,0,0,0,0,0,0,0,0,0,0,0,0,0,0,0,0,0,0,0,0,0,0,0,0,0,0,0,0,0,0,0,0,0,0,0,0,0,0,0,0,0,null,null,null,null,null,null,null,null,null,null,null,null,null,null,null,null,null,null,null,null,null,null,null,1,1,1,null,0,1,1,0,null,"Y",23000000,"Each"]
["Other",null,null,"y",0,9999999,0,9999999,"Each",0,9999999999,0,9999999999,"Each",0,0.03,null,null,null,null,null,1.1400000000000001E-4,1.8500000000000001E-3,1.1400000000000001E-4,1.1299999999999999E-3,null,"Full",null,null,null,null,null,null,null,null,null,null,null,null,null,null,null,null,null,null,null,null,null,null,null,null,null,null,null,null,null,null,null,null,null,null,null,null,null,null,null,null,null,null,null,null,null,null,null,null,null,null,null,null,null,null,null,null,null,null,null,null,null,null,null,null,null,null,null,null,1,1,1,null,0,1,1,0,null,"N"]
["Other Appliances, Install Energy Star","each",null,"y",200,2500,200,2500,"Each",1500000,5500000,1500000,5500000,"Each",0,0.02,null,null,null,null,null,1.1400000000000001E-4,1.8500000000000001E-3,1.1400000000000001E-4,1.1299999999999999E-3,null,"Full",null,null,null,null,null,null,null,null,null,null,null,null,null,null,null,null,null,null,null,null,null,null,null,null,null,null,null,null,null,null,null,null,null,null,null,null,null,null,null,null,null,null,null,null,null,null,null,null,null,null,null,null,null,null,null,null,null,null,null,null,null,null,null,null,null,null,null,null,1,1,1,null,1,0,1,0,null,"N"]
["Other Cooling Measure",null,null,"y",0,9999999,0,9999999,"Each",0,9999999999,0,9999999999,"Each",0,0.02,null,null,null,null,null,0,1.8500000000000001E-3,0,1.1299999999999999E-3,null,"Full",null,null,null,null,null,null,null,null,null,null,null,null,null,null,null,null,null,null,null,null,null,null,null,null,null,null,null,null,null,null,null,null,null,null,null,null,null,null,null,null,null,null,null,null,null,null,null,null,null,null,null,null,null,null,null,null,null,null,null,null,null,null,null,null,null,null,null,null,1,1,1,null,1,0,1,0,null,"N"]
["Other DHW Measure",null,null,"y",0,9999999,0,9999999,"Each",0,9999999999,0,9999999999,"Each",0,0.02,null,null,null,null,null,1.1400000000000001E-4,1.8500000000000001E-3,1.1400000000000001E-4,1.1299999999999999E-3,null,"Full",null,null,null,null,null,null,null,null,null,null,null,null,null,null,null,null,null,null,null,null,null,null,null,null,null,null,null,null,null,null,null,null,null,null,null,null,null,null,null,null,null,null,null,null,null,null,null,null,null,null,null,null,null,null,null,null,null,null,null,null,null,null,null,null,null,null,null,null,1,1,1,null,0,1,1,0,null,"N"]
["Other Heating Measure",null,null,"y",0,9999999,0,9999999,"Each",0,9999999999,0,9999999999,"Each",0,0.02,null,null,null,null,null,0,1.8500000000000001E-3,0,1.1299999999999999E-3,null,"Full",null,null,null,null,null,null,null,null,null,null,null,null,null,null,null,null,null,null,null,null,null,null,null,null,null,null,null,null,null,null,null,null,null,null,null,null,null,null,null,null,null,null,null,null,null,null,null,null,null,null,null,null,null,null,null,null,null,null,null,null,null,null,null,null,null,null,null,null,1,1,1,null,0,1,1,0,null,"N"]
["Other Lighting Measure","each",null,"y",0,9999999,0,9999999,"Each",0,9999999999,0,9999999999,"Each",0,0.02,null,null,null,null,null,1.1400000000000001E-4,1.8500000000000001E-3,1.1400000000000001E-4,1.1299999999999999E-3,null,"Full",null,null,null,null,null,null,null,null,null,null,null,null,null,null,null,null,null,null,null,null,null,null,null,null,null,null,null,null,null,null,null,null,null,null,null,null,null,null,null,null,null,null,null,null,null,null,null,null,null,null,null,null,null,null,null,null,null,null,null,null,null,null,null,null,null,null,null,null,1,1,1,null,1,0,1,0,null,"N"]
["Other Motor Measure","each",15,"y",525,4000,500,4000,"Each",2000000,11000000,2000000,11000000,"Each",0,8.9999999999999993E-3,null,365,24,0.78,null,1.1400000000000001E-4,1.8500000000000001E-3,1.1400000000000001E-4,1.1299999999999999E-3,null,"Inc","y",0,0,0,0,0,0,0,0,0,0,0,0,0,0,0,0,0,0,0,0,0,0,0,0,0,0,0,0,0,0,0,0,0,0,0,0,0,0,0,0,0,0,0,0,null,null,null,null,null,null,null,null,null,null,null,null,null,null,null,null,null,null,null,null,null,null,null,1,1,1,null,1,0,1,0,null,"N"]
["Other Ventilation Measure",null,null,"y",0,9999999,0,9999999,"Each",0,9999999999,0,9999999999,"Each",0,0.03,null,null,null,null,null,1.1400000000000001E-4,1.8500000000000001E-3,1.1400000000000001E-4,1.1299999999999999E-3,null,"Full",null,null,null,null,null,null,null,null,null,null,null,null,null,null,null,null,null,null,null,null,null,null,null,null,null,null,null,null,null,null,null,null,null,null,null,null,null,null,null,null,null,null,null,null,null,null,null,null,null,null,null,null,null,null,null,null,null,null,null,null,null,null,null,null,null,null,null,null,1,1,1,null,1,0,1,0,null,"N"]
["Outdoor Reset Control, Install","each",15,"y",1200,8500,1200,8500,"Each",13000000,250000000,13000000,250000000,"Each",0,0.03,null,null,null,null,null,0,1.8500000000000001E-3,0,1.1299999999999999E-3,null,"Full",null,null,null,null,null,null,null,null,null,null,null,null,null,null,null,null,null,null,null,null,null,null,null,null,null,null,null,null,null,null,null,null,null,null,null,null,null,null,null,null,null,null,null,null,null,null,null,null,null,null,null,null,null,null,null,null,null,null,null,null,null,null,null,null,null,null,null,null,1,1,1,null,1,0,0,1,null,"N"]
["Photovoltaic System",null,null,"n",null,null,null,null,null,null,null,null,null,null,null,null,null,null,null,null,null,null,null,null,null,null,"Full",null,null,null,null,null,null,null,null,null,null,null,null,null,null,null,null,null,null,null,null,null,null,null,null,null,null,null,null,null,null,null,null,null,null,null,null,null,null,null,null,null,null,null,null,null,null,null,null,null,null,null,null,null,null,null,null,null,null,null,null,null,null,null,null,null,null,null,null,null,null,null,null,null,null,null,null,null,"N"]
["Piping, DHW, Insulate","Ins. Sqft",11,"y",1.33,8,2,10,"Ins. Sqft",7500,35000,7500,45000,"$",0,1.4999999999999999E-2,null,365,24,0.98,null,1.1400000000000001E-4,1.8500000000000001E-3,1.1400000000000001E-4,1.1299999999999999E-3,null,"Full",null,null,null,null,null,null,null,null,null,null,null,null,null,null,null,null,null,null,null,null,null,null,null,null,null,null,null,null,null,null,null,null,null,null,null,null,null,null,null,null,null,null,null,null,null,null,null,null,null,null,null,null,null,null,null,null,null,null,null,null,null,null,null,null,null,null,null,null,1,1,1,null,1,0,0,1,null,"Y",3300,"Sqft"]
["Piping, Heating, Insulate","Ins. Sqft",11,"y",2.6,8,2.75,10,"Ins. Sqft",10000,35000,8500,45000,"$",0,1.4999999999999999E-2,null,365,24,0.98,null,1.1400000000000001E-4,1.8500000000000001E-3,1.1400000000000001E-4,1.1299999999999999E-3,null,"Full",null,null,null,null,null,null,null,null,null,null,null,null,null,null,null,null,null,null,null,null,null,null,null,null,null,null,null,null,null,null,null,null,null,null,null,null,null,null,null,null,null,null,null,null,null,null,null,null,null,null,null,null,null,null,null,null,null,null,null,null,null,null,null,null,null,null,null,null,1,1,1,null,0,1,1,0,null,"Y",1700000,"Ins. Sqft"]
["Programmable Thermostats, Common Area","each",11,"y",50,325,50,325,"Each",875000,5000000,900000,5000000,"Each",0,1.4999999999999999E-2,null,0,0,0,null,0,1.8500000000000001E-3,0,1.1299999999999999E-3,null,"Full",null,null,null,null,null,null,null,null,null,null,null,null,null,null,null,null,null,null,null,null,null,null,null,null,null,null,null,null,null,null,null,null,null,null,null,null,null,null,null,null,null,null,null,null,null,null,null,null,null,null,null,null,null,null,null,null,null,null,null,null,null,null,null,null,null,null,null,null,1,0.9,1,null,0,1,1,0,null,"Y",3900000,"Unit"]
["Pumps, Upgrade","each",15,"y",500,4000,500,4000,"Each",2000000,11000000,1500000,11000000,"Each",0,8.9999999999999993E-3,null,365,24,0.78,null,1.1400000000000001E-4,1.8500000000000001E-3,1.1400000000000001E-4,1.1299999999999999E-3,null,"Inc","y",0,0,0,0,0,0,0,0,0,0,0,0,0,0,0,0,0,0,0,0,0,0,0,0,0,0,0,0,0,0,0,0,0,0,0,0,0,0,0,0,0,0,0,0,null,null,null,null,null,null,null,null,null,null,null,null,null,null,null,null,null,null,null,null,null,null,null,1,1,1,null,0,1,1,0,null,"Y",36000000,"Each"]
["Refrigerators, install Energy Star","each",17,"y",400,750,400,750,"Each",341200,1194200,341200,1194200,"Each",0,0.04,null,365,24,0.86299999999999999,null,1.1400000000000001E-4,1.8500000000000001E-3,1.1400000000000001E-4,1.1299999999999999E-3,null,"Inc","n",0.11,null,0.17133905636692398,0.24932238283465552,0.32296496856531393,0.39250842969660382,0.45858817582470179,0.5213767224015019,0.58103799249150057,0.63772774472836724,0.69159397995650529,0.74277732761922666,0.79141141290229378,0.79141141290229378,0.83762320559133174,0.88153335155388268,0.92315434298758037,0.96260551970198549,null,null,null,null,0.12,null,0.16587677725118488,0.20936187417173913,0.25057997551823608,0.2896492658940627,0.32668176861996456,0.36178366693835495,0.39505560847237442,0.42659299381267712,0.45648625005940957,0.48482109010370578,0.51167875839213806,0.53713626387880398,0.5612666008329894,0.58413895813553496,0.60581891766401419,0.62636864233555856,null,null,null,null,{"$f":"0.11*C57","v":1.87},null,2,3,4,5,6,7.0000000000000009,8,9,10,10.999999999999998,12,12,13,14.000000000000002,15,16,null,null,null,null,null,1,1,1,null,0,1,1,0,null,"Y",{"$f":"650*3413","v":2218450},"Each"]
["Replace DHW Heater (Central)","1000 Btu/hr",15,"y",0.3,0.75,0.3,0.75,"Sqft",1500,5500,1500,7000,"Sqft",0,0.04,null,365,24,0.98,null,1.1400000000000001E-4,1.8500000000000001E-3,1.1400000000000001E-4,1.1299999999999999E-3,null,"Inc","y",0.21,{"$f":"AH58","v":0.49430204324750487},0.34701576701144321,0.34701576701144321,0.42239940787638042,0.49430204324750487,0.56288174250685241,0.62828955460999381,0.62828955460999381,0.69028748077410884,0.74905328756473932,0.80475547409614245,0.85755375516856258,0.90759951921824988,0.90759951921824988,0.95503626239330885,null,null,null,null,null,null,0.22,{"$f":"BD58","v":0.37037094022428285},0.26066350710900477,0.29920711574313241,0.33574134193661831,0.37037094022428285,0.4031952040040595,0.43430825024081465,0.46379928932778647,0.49175288087941837,0.51824917618902211,0.54336414804646638,0.56716980857484967,0.58973441571075802,0.61112266892014977,0.6313958947110424,null,null,null,null,null,null,{"$f":"0.21*C58","v":3.15},{"$f":"BZ58","v":6},4,4,5.0000000000000009,6,6.9999999999999991,8,8,9,10.000000000000002,11,12,13,13,13.999999999999998,null,null,null,null,null,null,null,1,1,1,null,0,1,0,1,null,"Y",12000000,"Unit"]
["Replace DHW Heater (In-Unit)","1000 Btu/hr",11,"y",0.3,0.75,0.3,0.75,"Sqft",1500,5500,1500,7000,"Sqft",0,0.04,null,365,24,0.98,null,1.1400000000000001E-4,1.8500000000000001E-3,1.1400000000000001E-4,1.1299999999999999E-3,null,"Inc","n",0.21,null,0.33209997878971165,0.43066542504053229,0.43066542504053229,0.52409238831145244,0.61336323460968278,0.69865738561109447,0.78014685109008031,0.85738805059622791,0.85738805059622791,0.93060245771105976,null,null,null,null,null,null,null,null,null,null,0.22,null,0.26066350710900477,0.29920711574313241,0.33574134193661831,0.37037094022428285,0.4031952040040595,0.43430825024081465,0.46379928932778647,0.49175288087941837,0.51824917618902211,0.54336414804646638,null,null,null,null,null,null,null,null,null,null,{"$f":"0.21*C59","v":2.31},null,3,4,4,5,6,7,8,9,9,10,null,null,null,null,null,null,null,null,null,null,null,1,1,1,null,0,1,1,0,null,"N"]
["Replace DHW Indirect-fired Heater","1000 Btu/hr",15,"y",0.3,0.65,0.3,0.65,"Sqft",3000,5500,3000,7000,"Sqft",0,0.04,null,365,24,0.98,null,1.1400000000000001E-4,1.8500000000000001E-3,1.1400000000000001E-4,1.1299999999999999E-3,null,"Inc","y",0.34,{"$f":"AH60","v":0.56288174250685241},0.42239940787638042,0.49430204324750487,0.49430204324750487,0.56288174250685241,0.62828955460999381,0.69028748077410884,0.69028748077410884,0.74905328756473932,0.80475547409614245,0.85755375516856258,0.85755375516856258,0.90759951921824988,0.95503626239330885,0.95503626239330885,null,null,null,null,null,null,0.93,{"$f":"BD60","v":0.94349482796884598},0.93364928909952616,0.93710833090002477,0.94038704350713243,0.94349482796884598,0.94644059523113355,0.94923279168827823,0.95187942340121168,0.95438807905328116,0.95676595170927126,0.95901985944006751,0.96115626487210193,0.96318129371763217,0.96510075233898784,0.96692014439714491,null,null,null,null,null,null,{"$f":"0.34*C60","v":5.1000000000000005},{"$f":"BZ60","v":6.9999999999999991},5.0000000000000009,6,6,6.9999999999999991,8,9,9,10.000000000000002,11,12,12,13,13.999999999999998,13.999999999999998,null,null,null,null,null,null,null,1,1,1,null,0,1,1,0,null,"N"]
["Smoke-Driven Louver, Install","each",15,"y",1500,5000,1500,5000,"Each",6000000,80000000,6000000,80000000,"Each",0,1.4999999999999999E-2,null,null,null,null,null,0,1.8500000000000001E-3,0,1.1299999999999999E-3,null,"Full",null,null,null,null,null,null,null,null,null,null,null,null,null,null,null,null,null,null,null,null,null,null,null,null,null,null,null,null,null,null,null,null,null,null,null,null,null,null,null,null,null,null,null,null,null,null,null,null,null,null,null,null,null,null,null,null,null,null,null,null,null,null,null,null,null,null,null,null,1,1,1,null,0,1,1,0,null,"N"]
["Solar Hot Water",null,null,"n",null,null,null,null,null,null,null,null,null,null,null,null,null,null,null,null,null,null,null,null,null,null,"Full",null,null,null,null,null,null,null,null,null,null,null,null,null,null,null,null,null,null,null,null,null,null,null,null,null,null,null,null,null,null,null,null,null,null,null,null,null,null,null,null,null,null,null,null,null,null,null,null,null,null,null,null,null,null,null,null,null,null,null,null,null,null,null,null,null,null,null,null,null,null,null,null,null,null,null,null,null,"N"]
["Split System AC/HP","each",15,"y",0,9999999,0,9999999,"Each",0,9999999999,0,9999999999,"Each",0,0.03,null,null,null,null,null,0,1.8500000000000001E-3,0,1.1299999999999999E-3,null,"Inc","y",{"$f":"VLOOKUP($H$82,$AA$95:$CP$99,AC80)","v":{"$error":"#N/A"}},{"$f":"AH63","v":{"$error":"#N/A"}},{"$f":"VLOOKUP($H$82,$AA$95:$CP$99,AE80)","v":{"$error":"#N/A"}},{"$f":"VLOOKUP($H$82,$AA$95:$CP$99,AF80)","v":{"$error":"#N/A"}},{"$error":"#N/A"},{"$error":"#N/A"},{"$error":"#N/A"},{"$error":"#N/A"},{"$error":"#N/A"},{"$error":"#N/A"},{"$error":"#N/A"},{"$error":"#N/A"},{"$error":"#N/A"},{"$error":"#N/A"},{"$error":"#N/A"},{"$error":"#N/A"},null,null,null,null,null,null,{"$f":"VLOOKUP($H$82,$AA$95:$CP$99,AY80)","v":{"$error":"#N/A"}},{"$f":"BD63","v":{"$error":"#N/A"}},{"$error":"#N/A"},{"$error":"#N/A"},{"$error":"#N/A"},{"$error":"#N/A"},{"$error":"#N/A"},{"$error":"#N/A"},{"$error":"#N/A"},{"$error":"#N/A"},{"$error":"#N/A"},{"$error":"#N/A"},{"$error":"#N/A"},{"$error":"#N/A"},{"$error":"#N/A"},{"$error":"#N/A"},null,null,null,null,null,null,{"$f":"VLOOKUP($H$82,$AA$95:$CP$99,BU80)*C63","v":{"$error":"#N/A"}},{"$f":"BZ63","v":{"$error":"#N/A"}},{"$f":"VLOOKUP($H$82,$AA$95:$CP$99,BW80)","v":{"$error":"#N/A"}},{"$error":"#N/A"},{"$error":"#N/A"},{"$error":"#N/A"},{"$error":"#N/A"},{"$error":"#N/A"},{"$error":"#N/A"},{"$error":"#N/A"},{"$error":"#N/A"},{"$error":"#N/A"},{"$error":"#N/A"},{"$error":"#N/A"},{"$error":"#N/A"},{"$error":"#N/A"}," "," ",null,null,null,null,null,1,0.9,1,null,0,1,0,1,null,"N"]
["Steam Traps, Replace","each",5,"y",75,150,75,150,"Each",1750000,5750000,1750000,5750000,"Each",0,3.5000000000000003E-2,null,null,null,null,null,0,1.8500000000000001E-3,0,1.1299999999999999E-3,null,"Full",null,null,null,null,null,null,null,null,null,null,null,null,null,null,null,null,null,null,null,null,null,null,null,null,null,null,null,null,null,null,null,null,null,null,null,null,null,null,null,null,null,null,null,null,null,null,null,null,null,null,null,null,null,null,null,null,null,null,null,null,null,null,null,null,null,null,null,null,1,1,1,null,0,1,0,1,null,"N"]
["Submetering","each",null,"y",375,650,375,650,"Each",1000000,4000000,1000000,4000000,"Each",0,0.09,null,null,null,null,null,null,null,null,null,null,"Full",null,null,null,null,null,null,null,null,null,null,null,null,null,null,null,null,null,null,null,null,null,null,null,null,null,null,null,null,null,null,null,null,null,null,null,null,null,null,null,null,null,null,null,null,null,null,null,null,null,null,null,null,null,null,null,null,null,null,null,null,null,null,null,null,null,null,null,null,null,null,null,null,null,null,null,null,null,"Y",{"$f":"'Utility Info'!D14*1000000*16%","v":0},"Total"]
["Thermostatic Radiator Valves, install","each",12,"y",200,625,200,750,"Unit",2000000,6000000,3000000,9000000,"Unit",0,0.05,null,0,0,0,null,0,1.8500000000000001E-3,0,1.1299999999999999E-3,null,"Full",null,null,null,null,null,null,null,null,null,null,null,null,null,null,null,null,null,null,null,null,null,null,null,null,null,null,null,null,null,null,null,null,null,null,null,null,null,null,null,null,null,null,null,null,null,null,null,null,null,null,null,null,null,null,null,null,null,null,null,null,null,null,null,null,null,null,null,null,1,0.9,1,null,0,1,0,1,null,"Y",8000000,"Unit"]
["Timers/Sensors, Install","each",8,"y",50,160,60,240,"Each",180000,300000,180000,450000,"Each",0,3.5000000000000003E-2,null,0,0,0,null,0,1.8500000000000001E-3,0,1.1299999999999999E-3,null,"Full",null,null,null,null,null,null,null,null,null,null,null,null,null,null,null,null,null,null,null,null,null,null,null,null,null,null,null,null,null,null,null,null,null,null,null,null,null,null,null,null,null,null,null,null,null,null,null,null,null,null,null,null,null,null,null,null,null,null,null,null,null,null,null,null,null,null,null,null,1,1,1,null,0,1,0,1,null,"Y",1200000,"Each"]
["Var. Speed Drive","each",15,"y",575,20000,725,20000,"Each",2500000,40000000,2500000,40000000,"Each",0,0.03,null,365,24,0.78,null,1.1400000000000001E-4,1.8500000000000001E-3,1.1400000000000001E-4,1.1299999999999999E-3,null,"Full",null,null,null,null,null,null,null,null,null,null,null,null,null,null,null,null,null,null,null,null,null,null,null,null,null,null,null,null,null,null,null,null,null,null,null,null,null,null,null,null,null,null,null,null,null," "," "," "," "," "," "," "," "," "," "," "," "," "," "," "," "," "," ",null,null,null,null,null,1,1,1,null,0,1,0,1,null,"N"]
["Ventilation Central Controls","each",10,"y",0.25,0.5,0.02,0.1,"Sqft",500,3500,500,3500,"Sqft",0,3.5000000000000003E-2,null,null,null,null,null,0,1.8500000000000001E-3,0,1.1299999999999999E-3,null,"Full",null,null,null,null,null,null,null,null,null,null,null,null,null,null,null,null,null,null,null,null,null,null,null,null,null,null,null,null,null,null,null,null,null,null,null,null,null,null,null,null,null,null,null,null,null," "," "," "," "," "," "," "," "," "," "," "," "," "," "," "," "," "," ",null,null,null,null,null,1,1,1.1000000000000001,null,0,1,0,1,null,"N"]
["Vertical Shafts, Seal","each",15,"y",2300,5000,2300,5000,"Each",38000000,75000000,38000000,75000000,"Each",0,0.02,null,null,null,null,null,0,1.8500000000000001E-3,0,1.1299999999999999E-3,null,"Full",null,null,null,null,null,null,null,null,null,null,null,null,null,null,null,null,null,null,null,null,null,null,null,null,null,null,null,null,null,null,null,null,null,null,null,null,null,null,null,null,null,null,null,null,null,null,null,null,null,null,null,null,null,null,null,null,null,null,null,null,null,null,null,null,null,null,null,null,1,1,1,null,0,1,0,1,null,"N"]
["Washing Machines, Install Energy Star","each",14,"y",750,1750,1000,1875,"Each",2225000,5000000,7000000,12500000,"Each",0,8.0000000000000002E-3,null,365,1.1000000000000001,0.52300000000000002,null,1.1400000000000001E-4,1.8500000000000001E-3,1.1400000000000001E-4,1.1299999999999999E-3,null,"Inc","n",0.39,null,0.44525647158411813,0.52021647849890917,0.59144299133148948,0.59144299133148948,0.65912196228004571,0.72343008191833225,0.72343008191833225,0.78453524048458234,0.8425969661952436,0.8425969661952436,0.89776684172784782,0.95018889996033573,0.95018889996033573,null,null,null,null,null,null,null,0.24,null,0.27962085308056872,0.31717616405741111,0.35277361522029482,0.38651527509032679,0.41849789108087843,0.44881316690130657,0.47754802549886877,0.50478485829276665,0.53060176141494475,0.55507275963501856,0.57826801861139199,0.60025404607714883,0.6210938825375818,null,null,null,null,null,null,null,{"$f":"0.39*C71","v":5.46},null,5,6,7,7,8.0000000000000018,9,9,10,11,11,12,13,13,null,null,null,null,null,null,null,null,1,1,1,null,0,1,0,1,null,"Y",1200000,"Unit"]
["Water Source AC/HP","1000 Btu/hr",15,"y",0,9999999,0,9999999,"Each",0,9999999999,0,9999999999,"Each",0,0.08,null,null,null,null,null,0,1.8500000000000001E-3,0,1.1299999999999999E-3,null,"Inc","y",{"$f":"VLOOKUP($H$82,$AA$95:$CP$99,AC80)","v":{"$error":"#N/A"}},{"$f":"AH72","v":{"$error":"#N/A"}},{"$f":"VLOOKUP($H$82,$AA$95:$CP$99,AE80)","v":{"$error":"#N/A"}},{"$f":"VLOOKUP($H$82,$AA$95:$CP$99,AF80)","v":{"$error":"#N/A"}},{"$error":"#N/A"},{"$error":"#N/A"},{"$error":"#N/A"},{"$error":"#N/A"},{"$error":"#N/A"},{"$error":"#N/A"},{"$error":"#N/A"},{"$error":"#N/A"},{"$error":"#N/A"},{"$error":"#N/A"},{"$error":"#N/A"},{"$error":"#N/A"},null,null,null,null,null,null,{"$f":"VLOOKUP($H$82,$AA$95:$CP$99,AY80)","v":{"$error":"#N/A"}},{"$f":"BD72","v":{"$error":"#N/A"}},{"$error":"#N/A"},{"$error":"#N/A"},{"$error":"#N/A"},{"$error":"#N/A"},{"$error":"#N/A"},{"$error":"#N/A"},{"$error":"#N/A"},{"$error":"#N/A"},{"$error":"#N/A"},{"$error":"#N/A"},{"$error":"#N/A"},{"$error":"#N/A"},{"$error":"#N/A"},{"$error":"#N/A"},null,null,null,null,null,null,{"$f":"VLOOKUP($H$82,$AA$95:$CP$99,BU80)*C72","v":{"$error":"#N/A"}},{"$f":"BZ72","v":{"$error":"#N/A"}},{"$f":"VLOOKUP($H$82,$AA$95:$CP$99,BW80)","v":{"$error":"#N/A"}},{"$error":"#N/A"},{"$error":"#N/A"},{"$error":"#N/A"},{"$error":"#N/A"},{"$error":"#N/A"},{"$error":"#N/A"},{"$error":"#N/A"},{"$error":"#N/A"},{"$error":"#N/A"},{"$error":"#N/A"},{"$error":"#N/A"},{"$error":"#N/A"},{"$error":"#N/A"},null,null,null,null,null,null,null,1,0.9,1,null,0,1,0,1,null,"N"]
["Wind Turbine",null,null,"n",null,null,null,null,null,null,null,null,null,null,null,null,null,null,null,null,null,null,null,null,null,null,"Full",null,null,null,null,null,null,null,null,null,null,null,null,null,null,null,null,null,null,null,null,null,null,null,null,null,null,null,null,null,null,null,null,null,null,null,null,null,null,null,null,null,null,null,null,null,null,null,null,null,null,null,null,null,null,null,null,null,null,null,null,null,null,null,null,null,null,null,null,null,null,null,null,null,null,null,null,null,"N"]
["Window Air Conditioners, Install","each",10,"y",250,600,250,500,"Each",250000,750000,250000,750000,"Each",0,1.4999999999999999E-2,null,62.5,8,0.84,null,0,1.8500000000000001E-3,0,1.1299999999999999E-3,null,"Inc","n",0.25,null,0.36050398074652928,0.46698637918396196,0.56754170954653027,0.56754170954653027,0.66308873286251369,0.75387689527646196,0.84014321889852539,0.84014321889852539,0.92211292060187444,null,null,null,null,null,null,null,null,null,null,null,0.23,null,0.27014218009478674,0.30819163990027176,0.34425747857845668,0.37844310765730482,0.41084654754246908,0.44156070857106056,0.47067365741332767,0.49826886958609251,0.52442546880198337,null,null,null,null,null,null,null,null,null,null,null,{"$f":"0.25*C74","v":2.5},null,3,4,5,5,6,7,8,8,9,null,null,null,null,null,null,null,null,null,null,null,null,1,1,1,null,0,1,1,0,null,"N"]
["Windows, Replace","each",20,"y",300,500,400,650,"Each",400000,1500000,400000,2000000,"Each",0,7.0000000000000007E-2,null,62.5,8,0.84,null,0,1.8500000000000001E-3,0,1.1299999999999999E-3,null,"Inc","y",0.63,{"$f":"AI75","v":0.76153087198201719},0.67529879497528067,0.67529879497528067,0.7195687907135323,0.7195687907135323,0.76153087198201719,0.80130535659669488,0.80130535659669488,0.83900628988074955,0.83900628988074955,0.87474177166658351,0.87474177166658351,0.90861426625031227,0.90861426625031227,0.94072089618749588,0.94072089618749588,0.94072089618749588,0.97115372077250406,0.97115372077250406,1,null,0.1,{"$f":"BE75","v":0.31137908154314553},0.14691943127962082,0.19139282585746042,0.23354770223455956,0.27350493102801854,0.31137908154314553,0.34727875027786304,0.38130687230129201,0.41356101639932885,0.44413366483348704,0.47311247851515359,0.50058054835559584,0.52661663351241306,0.55129538721555749,0.57468757082043354,0.59686025670183263,0.61787702057045757,0.6377981237634669,0.65668068603172203,0.67457884931916778,null,{"$f":"0.63*C75","v":12.6},{"$f":"CA75","v":13},11,11,12,12,13,14,14,15,15,16,16,17,17,18,18,18,19,19,20,null,null,1,1,1,null,0,1,0,1,null,"Y",2500000,"Each"]
["Windows, Weatherstrip or Airseal","sqft",15,"y",0.04,0.32,0.04,0.32,"Sqft",4000,15000,4500,15000,"$",0,0.03,null,62.5,8,0.84,null,0,1.8500000000000001E-3,0,1.1299999999999999E-3,null,"Full",null,null,null,null,null,null,null,null,null,null,null,null,null,null,null,null,null,null,null,null,null,null,null,null,null,null,null,null,null,null,null,null,null,null,null,null,null,null,null,null,null,null,null,null,null,null,null,null,null,null,null,null,null,null,null,null,null,null,null,null,null,null,null,null,null,null,null,null,1,1,1,null,0,1,0,1,null,"N"]
[]
[]
["Project Information for Calculations:",null,null,null,null,"Special Measures for TRC Test:",null,null,null,null,null,null,null,null,null,null,null,null,null,null,null,null,null,null,null,null,"Appendix M Data for Measures with Multiple Efficiency/Type Options"]
["Location",{"$f":"IF(UpDown=\"U\",\"Upstate\",\"Downstate\")","v":{"$error":"#N/A"}},null,null,null,{"$f":"'Measure Summary'!W38","v":"Gas Furnace AFUE"},null,{"$f":"'Measure Summary'!Y38","v":0},null,null,null,null,null,null,null,null,null,null,null,null,null,null,null,null,null,null,"Gas Furnace",null,3,4,5,6,7,8,9,10,11,12,13,14,15,16,17,18,19,20,21,22,23,24,25,26,27,28,29,30,31,32,33,34,35,36,37,38,39,40,41,42,43,44,45,46,47,26,48,49,50,51,52,53,54,55,56,57,58,59,60,61,62,63,64,65,66]
["Number of floors",{"$f":"DT_GeneralProjectInfo_BuildingInfo_NumStories1","v":0},null,null,null,{"$f":"'Measure Summary'!W39","v":"Chiller Type/Capacity"},null,{"$f":"'Measure Summary'!Y39","v":0},null,null,null,null,null,null,null,null,null,null,null,null,null,null,null,null,null,null,"90 AFUE",null,0.44,null,0.47249391479431918,0.52733667679792895,0.57932033746485767,0.62859394947142522,0.62859394947142522,0.67529879497528067,0.7195687907135323,0.7195687907135323,0.76153087198201719,0.80130535659669488,0.80130535659669488,0.83900628988074955,0.87474177166658351,0.87474177166658351,0.90861426625031227,0.94072089618749588,0.94072089618749588,0.97115372077250406,0.97115372077250406,null,0.28000000000000003,null,0.31753554502369674,0.35311426068596841,0.38683816178764774,0.4188039448224149,0.44910326523451649,0.47782300022229052,0.5050454978410337,0.53084881311946308,0.55530693186678959,0.57848998281212283,0.60046443868447663,0.62129330680993045,0.64103630977244586,0.65975005665634678,0.67748820536146614,0.69430161645636601,0.71023849901077352,0.72534454882537769,0.73966307945533427,null,0.44,null,7,8,9,10,10,11,12,12,13,14,14,15,16,16,17,18,18,19,19]
["Low/High rise",{"$f":"IF(Floors=0,0,IF(Floors<=3,\"low\",\"high\"))","v":0},null,null,null,{"$f":"'Measure Summary'!W40","v":"Central AC/HP SEER"},null,{"$f":"'Measure Summary'!Y40","v":0},null,null,null,null,null,null,null,null,null,null,null,null,null,null,null,null,null,null,"92 AFUE",null,0.48,null,0.52733667679792895,0.57932033746485767,0.57932033746485767,0.62859394947142522,0.67529879497528067,0.67529879497528067,0.7195687907135323,0.76153087198201719,0.76153087198201719,0.80130535659669488,0.83900628988074955,0.83900628988074955,0.87474177166658351,0.90861426625031227,0.90861426625031227,0.94072089618749588,0.94072089618749588,0.97115372077250406,0.97115372077250406,null,0.31,null,0.34597156398104278,0.38006783315738635,0.4123865717131624,0.44302044712148103,0.47205729584974487,0.49958037521302834,0.5256686020976572,0.55039677923948549,0.57383580970567349,0.59605290019495105,0.61711175373929017,0.63707275235951677,0.65599313019859407,0.67392713762899903,0.69092619680473844,0.70703904910401749,0.72231189488532466,0.73678852595765365,0.75051045114469539,null,0.48,null,8,9,9,10,11,11,12,13,13,14,15,15,16,17,17,18,18,19,19]
["Total sqft",{"$f":"'General Project Info'!C48","v":0},null,null,null,null,null,null,null,null,null,null,null,null,null,null,null,null,null,null,null,null,null,null,null,null,"94 AFUE",null,0.51,null,0.52733667679792895,0.57932033746485767,0.62859394947142522,0.67529879497528067,0.67529879497528067,0.7195687907135323,0.76153087198201719,0.76153087198201719,0.80130535659669488,0.80130535659669488,0.83900628988074955,0.87474177166658351,0.87474177166658351,0.90861426625031227,0.90861426625031227,0.94072089618749588,0.94072089618749588,0.97115372077250406,1,null,0.34,null,0.37440758293838872,0.4070214056288044,0.43793498163867717,0.46723694942054705,0.49501132646497348,0.52133775020376627,0.54629170635428093,0.5699447453595079,0.59236468754455729,0.61361581757777928,0.6337590687941036,0.65285219790910287,0.67094995062474216,0.68810421860165127,0.70436418824801073,0.71977648175166886,0.7343852907598758,0.7482325030899295,0.76135782283405651,null,0.51,null,8,9,10,11,11,12,13,13,14,14,15,16,16,17,17,18,18,19,20]
["Number of Units",{"$f":"'General Project Info'!C40","v":0},null,null,null,null,null,null,null,null,null,null,null,null,null,null,null,null,null,null,null,null,null,null,null,null,"96 AFUE",null,0.54,null,0.57932033746485767,0.62859394947142522,0.62859394947142522,0.67529879497528067,0.7195687907135323,0.7195687907135323,0.76153087198201719,0.80130535659669488,0.80130535659669488,0.83900628988074955,0.83900628988074955,0.87474177166658351,0.87474177166658351,0.90861426625031227,0.94072089618749588,0.94072089618749588,0.97115372077250406,0.97115372077250406,1,null,0.36,null,0.39336492890995256,0.42499045394308288,0.45496725492235357,0.483381284286591,0.5103140135417924,0.53584266686425819,0.56004044252536311,0.58297672277285617,0.60471727277047971,0.62532442916633135,0.64485727883064592,0.66337182827549368,0.68092116424217419,0.6975556059167527,0.71332284921019218,0.72826810351676974,0.74243422134290982,0.75586182117811351,0.76858940396029718,null,0.54,null,9,10,10,11,12,12,13,14,14,15,15,16,16,17,18,18,19,19,20]
[null,null,null,null,null,null,null,null,null,null,null,null,null,null,null,null,null,null,null,null,null,null,null,null,null,null,"Chillers"]
[null,null,null,null,null,null,null,null,null,null,null,null,null,null,null,null,null,null,null,null,null,null,null,null,null,null,"Air Cooled, Reciprocal/Screw",null,0.5,null,0.52779037404875973,0.57928495086555032,0.62821476407406152,0.62821476407406152,0.67470755552155126,0.71888470468352239,0.71888470468352239,0.76086154555106311,0.80074766773514627,0.80074766773514627,0.83855441862053337,0.87439020145028379,0.87439020145028379,0.90835776811355451,0.90835776811355451,0.9405545137659439,0.9405545137659439,0.9710727560904836,1,null,0.18,null,0.22274881516587663,0.26326901911457501,0.30167679536926539,0.33808227049219464,0.37258982985042144,0.40529841691983071,0.43630181698562154,0.46568892605272183,0.49354400573717716,0.51994692486936211,0.54497338850176502,0.5686951549779764,0.5911802416852856,0.61249312008083945,0.63269490055055866,0.6518435076308613,0.66999384609560309,0.68719795838445785,0.70350517382413069,null,0.5,null,8,9,10,10,11,12,12,13,14,14,15,16,16,17,17,18,18,19,20]
["Unit Conversions:",null,null,null,null,null,null,null,null,null,null,null,null,null,null,null,null,null,null,null,null,null,null,null,null,null,"Water Cooled Centrifugal, <150 ton",null,0.57999999999999996,null,0.62821476407406152,0.62821476407406152,0.67470755552155126,0.71888470468352239,0.71888470468352239,0.76086154555106311,0.76086154555106311,0.80074766773514627,0.83855441862053337,0.83855441862053337,0.87439020145028379,0.87439020145028379,0.90835776811355451,0.90835776811355451,0.9405545137659439,0.9405545137659439,0.9710727560904836,0.9710727560904836,1,null,0.21,null,0.25118483412322268,0.29022259158599295,0.32722520529478016,0.36229877279126077,0.39554386046564993,0.42705579191056864,0.45692492124224515,0.48523689217274424,0.51207288357606084,0.53750984225219034,0.56162070355657856,0.5844746005275625,0.6061370621114337,0.62667020105349169,0.64613289199383095,0.66458094027851278,0.68206724197015423,0.69864193551673381,0.71435254551349181,null,0.57999999999999996,null,10,10,11,12,12,13,13,14,15,15,16,16,17,17,18,18,19,19,20]
["Electricity",{"$f":"3412/1000000","v":3.4120000000000001E-3},"MMBtu/kWh",null,null,null,null,null,null,null,null,null,null,null,null,null,null,null,null,null,null,null,null,null,null,null,"Water Cooled Centrifugal, >300 ton",null,0.31,null,0.35653808116496305,0.41656213187539243,0.47359659590698855,0.52779037404875973,0.57928495086555032,0.57928495086555032,0.62821476407406152,0.67470755552155126,0.71888470468352239,0.76086154555106311,0.76086154555106311,0.80074766773514627,0.83855441862053337,0.87439020145028379,0.87439020145028379,0.90835776811355451,0.9405545137659439,0.9710727560904836,0.9710727560904836,null,0.33,null,0.36492890995260663,0.39803688147166505,0.42941884499683891,0.45916478198752497,0.48735998292656391,0.51408529187352037,0.53941733826873972,0.56342875665283376,0.58618839493159602,0.60776151178350324,0.62820996377583249,0.64759238272590758,0.66596434381602609,0.68337852494410056,0.69988485776691989,0.71553067086911848,0.73036082546835868,0.74441784404583755,0.75774203227093606,null,0.31,null,5,6,7,8,9,9,10,11,12,13,13,14,15,16,16,17,18,19,19]
["Electricity site to source",2.5499999999999998,null,null,null,null,null,null,null,null,null,null,null,null,null,null,null,null,null,null,null,null,null,null,null,null,"Water Cooled Centrifugal, 150-300 ton",null,0.38,null,0.41656213187539243,0.47359659590698855,0.52779037404875973,0.57928495086555032,0.57928495086555032,0.62821476407406152,0.67470755552155126,0.71888470468352239,0.71888470468352239,0.76086154555106311,0.80074766773514627,0.83855441862053337,0.83855441862053337,0.87439020145028379,0.90835776811355451,0.90835776811355451,0.9405545137659439,0.9710727560904836,0.9710727560904836,null,0.24,null,0.27962085308056872,0.31717616405741111,0.35277361522029482,0.38651527509032679,0.41849789108087843,0.44881316690130657,0.47754802549886877,0.50478485829276665,0.53060176141494475,0.55507275963501856,0.57826801861139199,0.60025404607714883,0.6210938825375818,0.64084728202614394,0.65957088343710324,0.67731837292616415,0.69414063784470525,0.71008591264900978,0.72519991720285293,null,0.38,null,6,7,8,9,9,10,11,12,12,13,14,15,15,16,17,17,18,19,19]
["Gas site to source",1.05,null,null,null,null,null,null,null,null,null,null,null,null,null,null,null,null,null,null,null,null,null,null,null,null,"Water Cooled Recriprocal",null,0.15,null,0.22647392321244089,0.29336773802485289,0.35653808116496305,0.41656213187539243,0.47359659590698855,0.52779037404875973,0.52779037404875973,0.57928495086555032,0.62821476407406152,0.67470755552155126,0.71888470468352239,0.76086154555106311,0.80074766773514627,0.83855441862053337,0.87439020145028379,0.90835776811355451,0.90835776811355451,0.9405545137659439,0.9710727560904836,null,0.03,null,8.0568720379146974E-2,0.12850115675748519,0.1739347457416921,0.21699975899686452,0.25781967677427919,0.29651154196614127,0.33318629570250358,0.36794909545261001,0.4008996165427583,0.4321323379552211,0.46173681322769777,0.48979792723004523,0.51639613955454522,0.54160771521757844,0.56550494333419743,0.58815634439260422,0.60962686672284772,0.62997807272307838,0.64926831537732532,null,0.15,null,3,4,5,6,7,8,8,9,10,11,12,13,14,15,16,17,17,18,19]
["Oil site to source",1.01,null,null,null,null,null,null,null,null,null,null,null,null,null,null,null,null,null,null,null,null,null,null,null,null,"Water Cooled Screw, <150 ton",null,0.37,null,0.41656213187539243,0.47359659590698855,0.52779037404875973,0.57928495086555032,0.57928495086555032,0.62821476407406152,0.67470755552155126,0.71888470468352239,0.71888470468352239,0.76086154555106311,0.80074766773514627,0.83855441862053337,0.83855441862053337,0.87439020145028379,0.90835776811355451,0.90835776811355451,0.9405545137659439,0.9710727560904836,0.9710727560904836,null,0.16,null,0.20379146919431279,0.24529997080029642,0.28464452208558899,0.3219379356261507,0.35728714277360263,0.39079350025933879,0.42255308081453924,0.45265694863937367,0.48119142051125463,0.50823831328081004,0.5338751784652227,0.55817552461158559,0.58120902806785357,0.60304173276573803,0.62373623958837721,0.64335188586576031,0.66194491551256918,0.67956864029627395,0.69627359269789002,null,0.37,null,6,7,8,9,9,10,11,12,12,13,14,15,15,16,17,17,18,19,19]
["Steam site to source",1.45,null,null,null,null,null,null,null,null,null,null,null,null,null,null,null,null,null,null,null,null,null,null,null,null,"Water Cooled Screw, >300 ton",null,0.69,null,0.71888470468352239,0.71888470468352239,0.76086154555106311,0.76086154555106311,0.80074766773514627,0.80074766773514627,0.83855441862053337,0.83855441862053337,0.87439020145028379,0.87439020145028379,0.90835776811355451,0.90835776811355451,0.9405545137659439,0.9405545137659439,0.9405545137659439,0.9710727560904836,0.9710727560904836,0.9710727560904836,1,null,0.12,null,0.16587677725118488,0.20936187417173913,0.25057997551823608,0.2896492658940627,0.32668176861996456,0.36178366693835495,0.39505560847237442,0.42659299381267712,0.45648625005940957,0.48482109010370578,0.51167875839213806,0.53713626387880398,0.5612666008329894,0.58413895813553496,0.60581891766401419,0.62636864233555856,0.64584705434650092,0.66431000411990604,0.68181043044540868,null,0.69,null,12,12,13,13,14,14,15,15,16,16,17,17,18,18,18,19,19,19,20]
["Propane site to source",1.01,null,null,null,null,null,null,null,null,null,null,null,null,null,null,null,null,null,null,null,null,null,null,null,null,"Water Cooled Screw, 150-300 ton",null,0.31,null,0.35653808116496305,0.41656213187539243,0.47359659590698855,0.52779037404875973,0.57928495086555032,0.57928495086555032,0.62821476407406152,0.67470755552155126,0.71888470468352239,0.76086154555106311,0.76086154555106311,0.80074766773514627,0.83855441862053337,0.87439020145028379,0.87439020145028379,0.90835776811355451,0.9405545137659439,0.9710727560904836,0.9710727560904836,null,0.13,null,0.17535545023696686,0.21834639832887848,0.25909611216007433,0.29772143332708467,0.33433311215837402,0.36903612526860086,0.40192997655791562,0.43310898251935126,0.46266254267237084,0.49067539589798181,0.51722786341040927,0.54239607906199927,0.56625220764170558,0.58886465179308578,0.61029824814510492,0.63061445321810894,0.64987151963801804,0.66812466316399799,0.6854262210085289,null,0.31,null,5,6,7,8,9,9,10,11,12,13,13,14,15,16,16,17,18,19,19]
["Other site to source",{"$f":"'Utility Info'!$C$19","v":1},null,null,null,null,null,null,null,null,null,null,null,null,null,null,null,null,null,null,null,null,null,null,null,null,"Central AC/HP"]
[null,null,null,null,null,null,null,null,null,null,null,null,null,null,null,null,null,null,null,null,null,null,null,null,null,null,"SEER 14",null,0.19,null,0.27007659632275571,0.34984937352957773,0.42518180483919837,0.49676219291845047,0.56477741383329672,0.56477741383329672,0.62940503601066577,0.69081378381918845,0.74916397806061075,0.8046079545218795,0.85729046168062173,0.90734903860231375,0.90734903860231375,0.95491437401572443,null,null,null,null,null,null,0.1,null,0.14691943127962082,0.19139282585746042,0.23354770223455956,0.27350493102801854,0.31137908154314553,0.34727875027786304,0.38130687230129201,0.41356101639932885,0.44413366483348704,0.47311247851515359,0.50058054835559584,0.52661663351241306,0.55129538721555749,0.57468757082043354,null,null,null,null,null,null,0.19,null,3,4,5.0000000000000009,6,6.9999999999999991,6.9999999999999991,8,9,10.000000000000002,11,12,13,13,13.999999999999998]
[null,null,null,null,null,null,null,null,null,null,null,null,null,null,null,null,null,null,null,null,null,null,null,null,null,null,"SEER 15",null,0.31,null,0.34984937352957773,0.42518180483919837,0.49676219291845047,0.56477741383329672,0.62940503601066577,0.62940503601066577,0.69081378381918845,0.74916397806061075,0.8046079545218795,0.8046079545218795,0.85729046168062173,0.90734903860231375,0.95491437401572443,0.95491437401572443,null,null,null,null,null,null,0.2,null,0.2417061611374407,0.2812380674288536,0.31870906865294191,0.35422660535823869,0.38789251692724047,0.41980333358032274,0.45005055315670395,0.4787209034660701,0.50589659096309969,0.5316555364579143,0.55607159853830734,0.5792147853443671,0.60115145530271774,0.62194450739594087,null,null,null,null,null,null,0.31,null,4,5.0000000000000009,6,6.9999999999999991,8,8,9,10.000000000000002,11,11,12,13,13.999999999999998,13.999999999999998]
[null,null,null,null,null,null,null,null,null,null,null,null,null,null,null,null,null,null,null,null,null,null,null,null,null,null,"SEER 16",null,0.38,null,0.49676219291845047,0.49676219291845047,0.56477741383329672,0.56477741383329672,0.62940503601066577,0.69081378381918845,0.74916397806061075,0.74916397806061075,0.8046079545218795,0.85729046168062173,0.85729046168062173,0.90734903860231375,0.95491437401572443,0.95491437401572443,null,null,null,null,null,null,0.26,null,0.29857819905213268,0.3351452123716897,0.36980588850397123,0.40265960995637085,0.43380057815769746,0.46331808356179849,0.49129676166995118,0.51781683570611492,0.54295434664086717,0.56678137122357075,0.58936622864793442,0.61077367644353964,0.63106509615501394,0.65029866934124536,null,null,null,null,null,null,0.38,null,6,6,6.9999999999999991,6.9999999999999991,8,9,10.000000000000002,10.000000000000002,11,12,12,13,13.999999999999998,13.999999999999998]
[null,null,null,null,null,null,null,null,null,null,null,null,null,null,null,null,null,null,null,null,null,null,null,null,null,null,"SEER 17",null,0.44,null,0.49676219291845047,0.56477741383329672,0.56477741383329672,0.62940503601066577,0.69081378381918845,0.69081378381918845,0.74916397806061075,0.8046079545218795,0.8046079545218795,0.85729046168062173,0.90734903860231375,0.90734903860231375,0.95491437401572443,0.95491437401572443,null,null,null,null,null,null,0.31,null,0.34597156398104278,0.38006783315738635,0.4123865717131624,0.44302044712148103,0.47205729584974487,0.49958037521302834,0.5256686020976572,0.55039677923948549,0.57383580970567349,0.59605290019495105,0.61711175373929017,0.63707275235951677,0.65599313019859407,0.67392713762899903,null,null,null,null,null,null,0.44,null,6,6.9999999999999991,6.9999999999999991,8,9,9,10.000000000000002,11,11,12,13,13,13.999999999999998,13.999999999999998]
[null,null,null,null,null,null,null,null,null,null,null,null,null,null,null,null,null,null,null,null,null,null,null,null,null,null,"SEER 18",null,0.48,null,0.56477741383329672,0.56477741383329672,0.62940503601066577,0.69081378381918845,0.69081378381918845,0.74916397806061075,0.74916397806061075,0.8046079545218795,0.85729046168062173,0.85729046168062173,0.90734903860231375,0.90734903860231375,0.95491437401572443,0.95491437401572443,null,null,null,null,null,null,0.37,null,0.40284360189573465,0.43397497810022234,0.46348339156419172,0.49145345171961297,0.51796535708020186,0.5430951251945042,0.56691481061090432,0.58949271147953031,0.61089356538344097,0.6311787349606075,0.65040638384891714,0.6686316434586892,0.68590677105089015,0.70228129957430352,null,null,null,null,null,null,0.48,null,6.9999999999999991,6.9999999999999991,8,9,9,10.000000000000002,10.000000000000002,11,12,12,13,13,13.999999999999998,13.999999999999998]

{"sheet":"TRC Test","index":14,"n_rows":45,"n_cols":42,"rows_kept":45,"cut":false,"hidden":true,"merged":[[2,15,2,21],[3,1,3,2],[2,22,2,26],[20,32,20,41],[4,32,4,41],[4,15,4,30],[20,15,20,30],[20,1,20,13],[4,1,4,13]]}
["TRC Test Calculations"]
[null,null,null,null,null,null,null,null,null,null,null,null,null,null,null,"PV Calculations for TRC Test"]
[null,"Values for TRC Test",null,null,null,null,null,null,null,null,null,null,null,null,null,"COST BENEFITS",null,null,null,null,null,null,"COST REDUCTION",null,null,null,null,null,null,null,null,null,"TRC Test Side/Interim Calcs:"]
[null,"Measure Name",null,"Measure Classification","Type of Installation","Ratio of Incremental Savings to Full Savings","Ratio of Incremental Costs to Full Costs","Artificial Lifecycle Benefit Adjusment Factor \n(Savings)","Full Cost Adjustment Factor","Inflated Lifecycle Benefits","Adjusted Lifecycle Benefits","Full Cost","Adjusted Full Cost","Adjusted EUL\n(years)",null,"PV of Cooling kWh Savings","PV of Non-Cooling kWh Savings","PV of kW Savings","PV of Gas Heating MMBtu Savings","PV of Gas Non-Heating MMBtu Savings","PV of Electric CO2","PV of Gas CO2","Sum MMBtu Savings","PV of Propane MMBtu Savings","PV of Oil MMBtu Savings","PV of Steam MMBtu Savings","PV of Other MMBtu Savings","PV of Water Savings","PV of O&M Savings","PV of Full Savings","PV of \"Other\" Costs",null,"RUL","Full Savings\n(MMBtu)","Full or Incremental Savings","Measure Life for PV Calcs","Ratio RUL/EUL","SC?","Vlookup Value - Savings","Vlookup Value - \nCost","Vlookup Value - \nEUL","LRAC kWh Multiplier"]
[]
[null,1,{"$f":"'Measure Summary'!C8","v":""},{"$f":"'Measure Summary'!E8","v":""},{"$f":"IF(AI6=\"Full\",\"AO\",IF(AG6=\"\",\"\",IF(AL6=\"Y\",\"SC\",IF(AG6>0,\"ER\",\"NR\"))))","v":""},{"$f":"IF(D6=\"\",\"\",IF(OR(E6=\"NR\",E6=\"ER\",E6=\"SC\"),VLOOKUP(D6,MeasureQCData,29,FALSE),\"\"))","v":""},{"$f":"IF(D6=\"\",\"\",IF(OR(E6=\"NR\",E6=\"ER\",E6=\"SC\"),VLOOKUP(D6,MeasureQCData,51,FALSE),\"\"))","v":""},{"$f":"IF(E6=\"\",0,IF($E6=\"AO\",1,VLOOKUP($D6,MeasureQCData,AM6,FALSE)))","v":0},{"$f":"IF(E6=\"\",0,IF($E6=\"AO\",1,VLOOKUP($D6,MeasureQCData,AN6,FALSE)))","v":0},{"$f":"AD6","v":0},{"$f":"IF(H6=0,AD6,IF(AD6*H6<0,0,AD6*H6))","v":0},{"$f":"AE6","v":1.0000000000000001E-5},{"$f":"IF(I6=0,AE6,I6*AE6)","v":1.0000000000000001E-5},{"$f":"IF(E6=\"\",0,IF(OR($E6=\"AO\",$E6=\"NR\"),'Measure Summary'!AA8,VLOOKUP($D6,MeasureQCData,AO6,FALSE)))","v":0},null,{"$f":"IF($C6=\"\",0,IF(OR(MIN('Measure Summary'!I8,$AJ6)=0,OR(ElecUtility=\"\",ElecUtility=0,ElecUtility=\"<Select One>\"))=TRUE,0,1.1*'Measure Summary'!I8*HLOOKUP($AJ6,AvoidedCostTable,$E$38)))","v":0},{"$f":"IF($C6=\"\",0,IF(OR(MIN('Measure Summary'!J8,$AJ6)=0,OR(ElecUtility=\"\",ElecUtility=0,ElecUtility=\"<Select One>\"))=TRUE,0,'Measure Summary'!J8*HLOOKUP($AJ6,AvoidedCostTable,$E$38)*$AP6))","v":0},{"$f":"IF($C6=\"\",0,IF(OR(MIN('Measure Summary'!$K8,$AJ6)=0,OR(ElecUtility=\"\",ElecUtility=0,ElecUtility=\"<Select One>\"))=TRUE,0,'Measure Summary'!$K8*HLOOKUP($AJ6,AvoidedCostTable,$E$39,FALSE)))","v":0},{"$f":"IF($C6=\"\",0,IF('Measure Summary'!N8<>\"Natural Gas\",0,IF(MIN('Measure Summary'!G8,$AJ6)=0,0,'Measure Summary'!G8*HLOOKUP($AJ6,AvoidedCostTable,$E$40))))","v":0},{"$f":"IF($C6=\"\",0,IF('Measure Summary'!N8<>\"Natural Gas\",0,IF(MIN('Measure Summary'!H8,$AJ6)=0,0,'Measure Summary'!H8*HLOOKUP($AJ6,AvoidedCostTable,$E$40))))","v":0},{"$f":"IF(OR(N($P6+$Q6)=0,N($AJ6)=0)=TRUE,0,HLOOKUP($AJ6,AvoidedCostTable,12,FALSE)*('Measure Summary'!I8+'Measure Summary'!J8))","v":0},{"$f":"IF(OR(N($S6+$T6)=0,N($AJ6)=0)=TRUE,0,HLOOKUP($AJ6,AvoidedCostTable,13,FALSE)*($W6))","v":0},{"$f":"'Measure Summary'!G8+'Measure Summary'!H8","v":0},{"$f":"IF($C6=\"\",0,IF('Measure Summary'!N8<>\"Propane\",0,IF(MIN('Measure Summary'!G8+'Measure Summary'!H8,$AJ6)=0,0,-PV($D$42,$AJ6,('Measure Summary'!G8+'Measure Summary'!H8))*$D$45)))","v":0},{"$f":"IF($C6=\"\",0,IF('Measure Summary'!N8<>\"Fuel Oil\",0,IF(MIN('Measure Summary'!G8+'Measure Summary'!H8,$AJ6)=0,0,-PV($D$42,$AJ6,('Measure Summary'!G8+'Measure Summary'!H8))*$E$45)))","v":0},{"$f":"IF($C6=\"\",0,IF('Measure Summary'!N8<>\"Steam\",0,IF(MIN('Measure Summary'!G8+'Measure Summary'!H8,$AJ6)=0,0,-PV($D$42,$AJ6,('Measure Summary'!G8+'Measure Summary'!H8))*$F$45)))","v":0},{"$f":"IF($C6=\"\",0,IF('Measure Summary'!N8<>'Utility Info'!$B$19,0,IF(MIN('Measure Summary'!G8+'Measure Summary'!H8,$AJ6)=0,0,-PV($D$42,$AJ6,('Measure Summary'!G8+'Measure Summary'!H8))*$G$45)))","v":0},{"$f":"IF(OR(N('Measure Summary'!$L8)=0,N($AJ6)=0)=TRUE,0,-PV('TRC Test'!$D$42,'Measure Summary'!$AA$8,'Measure Summary'!$L8*'Measure Summary'!$P8))","v":0},{"$f":"IF(N($AJ6)=0,0,-PV($D$42,$AJ6,'Measure Summary'!$M8))","v":0},{"$f":"MAX(SUM($P6:$V6),0)","v":0},{"$f":"IF(OR($D6=Calcs!$A$42,$D6=Calcs!$A$24,$D6=Calcs!$A$56,$D6=Calcs!$A$21,$D6=Calcs!$A$27)=TRUE,'Measure Summary'!$F8/'Measure Summary'!$AA8*$AJ6,'Measure Summary'!$F8-SUM($X6:$AC6))+0.00001","v":1.0000000000000001E-5},null,{"$f":"IF($AI6=\"Inc\",'Measure Summary'!$AA8-(YEAR(TODAY())-'Measure Summary'!$AC8),\"\")","v":""},{"$f":"SUM('Measure Summary'!$G8:$H8)+SUM('Measure Summary'!$I8:$J8)*3412/1000000","v":0},{"$f":"IF($D6=\"\",\"\",VLOOKUP($D6,MeasureQCData,27,FALSE))","v":""},{"$f":"IF(OR($D6=Calcs!$A$42,$D6=Calcs!$A$24,$D6=Calcs!$A$56,$D6=Calcs!$A$21,$D6=Calcs!$A$27)=TRUE,IF($AG6<-3.75,4,IF($AG6<0,ROUND('Measure Summary'!$AA8,0),$AG6)),ROUND(IF(N('Measure Summary'!$AA8)=0,0,'Measure Summary'!$AA8),0))","v":0},{"$f":"IF(OR($AI6=\"Full\",$AI6=\"\"),\"\",IF($AG6>=0,0,-$AG6/'Measure Summary'!$AA8))","v":""},{"$f":"IF($D6=\"\",\"\",IF(AND(VLOOKUP($D6,MeasureQCData,28,FALSE)=\"Y\",$AK6>0.249),\"Y\",\"N\"))","v":""},{"$f":"IF($E6=\"NR\",29,IF($E6=\"SC\",30,IF($E6=\"ER\",$AG6+30,\"\")))","v":""},{"$f":"IF($E6=\"NR\",51,IF($E6=\"SC\",52,IF($E6=\"ER\",$AG6+52,\"\")))","v":""},{"$f":"IF($E6=\"NR\",73,IF($E6=\"SC\",74,IF($E6=\"ER\",$AG6+74,\"\")))","v":""},{"$f":"IF($D$38=\"Upstate\",VLOOKUP($D6,MeasureQCData,96,FALSE),IF($D$38=\"NYC\",VLOOKUP($D6,MeasureQCData,97,FALSE),IF($D$38=\"Lower Hudson\",VLOOKUP($D6,MeasureQCData,98,FALSE),\"\")))","v":""}]
[null,2,{"$f":"'Measure Summary'!C9","v":""},{"$f":"'Measure Summary'!E9","v":""},"",{"$f":"IF(D7=\"\",\"\",IF(OR(E7=\"NR\",E7=\"ER\",E7=\"SC\"),VLOOKUP(D7,MeasureQCData,29,FALSE),\"\"))","v":""},"",0,0,{"$f":"AD7","v":0},0,{"$f":"AE7","v":1.0000000000000001E-5},1.0000000000000001E-5,{"$f":"IF(E7=\"\",0,IF(OR($E7=\"AO\",$E7=\"NR\"),'Measure Summary'!AA9,VLOOKUP($D7,MeasureQCData,AO7,FALSE)))","v":0},null,{"$f":"IF($C7=\"\",0,IF(OR(MIN('Measure Summary'!I9,$AJ7)=0,OR(ElecUtility=\"\",ElecUtility=0,ElecUtility=\"<Select One>\"))=TRUE,0,1.1*'Measure Summary'!I9*HLOOKUP($AJ7,AvoidedCostTable,$E$38)))","v":0},{"$f":"IF($C7=\"\",0,IF(OR(MIN('Measure Summary'!J9,$AJ7)=0,OR(ElecUtility=\"\",ElecUtility=0,ElecUtility=\"<Select One>\"))=TRUE,0,'Measure Summary'!J9*HLOOKUP($AJ7,AvoidedCostTable,$E$38)*$AP7))","v":0},{"$f":"IF($C7=\"\",0,IF(OR(MIN('Measure Summary'!$K9,$AJ7)=0,OR(ElecUtility=\"\",ElecUtility=0,ElecUtility=\"<Select One>\"))=TRUE,0,'Measure Summary'!$K9*HLOOKUP($AJ7,AvoidedCostTable,$E$39,FALSE)))","v":0},{"$f":"IF($C7=\"\",0,IF('Measure Summary'!N9<>\"Natural Gas\",0,IF(MIN('Measure Summary'!G9,$AJ7)=0,0,'Measure Summary'!G9*HLOOKUP($AJ7,AvoidedCostTable,$E$40))))","v":0},{"$f":"IF($C7=\"\",0,IF('Measure Summary'!N9<>\"Natural Gas\",0,IF(MIN('Measure Summary'!H9,$AJ7)=0,0,'Measure Summary'!H9*HLOOKUP($AJ7,AvoidedCostTable,$E$40))))","v":0},{"$f":"IF(OR(N($P7+$Q7)=0,N($AJ7)=0)=TRUE,0,HLOOKUP($AJ7,AvoidedCostTable,12,FALSE)*('Measure Summary'!I9+'Measure Summary'!J9))","v":0},0,{"$f":"'Measure Summary'!G9+'Measure Summary'!H9","v":0},{"$f":"IF($C7=\"\",0,IF('Measure Summary'!N9<>\"Propane\",0,IF(MIN('Measure Summary'!G9+'Measure Summary'!H9,$AJ7)=0,0,-PV($D$42,$AJ7,('Measure Summary'!G9+'Measure Summary'!H9))*$D$45)))","v":0},{"$f":"IF($C7=\"\",0,IF('Measure Summary'!N9<>\"Fuel Oil\",0,IF(MIN('Measure Summary'!G9+'Measure Summary'!H9,$AJ7)=0,0,-PV($D$42,$AJ7,('Measure Summary'!G9+'Measure Summary'!H9))*$E$45)))","v":0},{"$f":"IF($C7=\"\",0,IF('Measure Summary'!N9<>\"Steam\",0,IF(MIN('Measure Summary'!G9+'Measure Summary'!H9,$AJ7)=0,0,-PV($D$42,$AJ7,('Measure Summary'!G9+'Measure Summary'!H9))*$F$45)))","v":0},{"$f":"IF($C7=\"\",0,IF('Measure Summary'!N9<>'Utility Info'!$B$19,0,IF(MIN('Measure Summary'!G9+'Measure Summary'!H9,$AJ7)=0,0,-PV($D$42,$AJ7,('Measure Summary'!G9+'Measure Summary'!H9))*$G$45)))","v":0},{"$f":"IF(OR(N('Measure Summary'!$L9)=0,N($AJ7)=0)=TRUE,0,-PV('TRC Test'!$D$42,'Measure Summary'!$AA$8,'Measure Summary'!$L9*'Measure Summary'!$P9))","v":0},{"$f":"IF(N($AJ7)=0,0,-PV($D$42,$AJ7,'Measure Summary'!$M9))","v":0},{"$f":"MAX(SUM($P7:$V7),0)","v":0},{"$f":"IF(OR($D7=Calcs!$A$42,$D7=Calcs!$A$24,$D7=Calcs!$A$56,$D7=Calcs!$A$21,$D7=Calcs!$A$27)=TRUE,'Measure Summary'!$F9/'Measure Summary'!$AA9*$AJ7,'Measure Summary'!$F9-SUM($X7:$AC7))+0.00001","v":1.0000000000000001E-5},null,{"$f":"IF($AI7=\"Inc\",'Measure Summary'!$AA9-(YEAR(TODAY())-'Measure Summary'!$AC9),\"\")","v":""},{"$f":"SUM('Measure Summary'!$G9:$H9)+SUM('Measure Summary'!$I9:$J9)*3412/1000000","v":0},"",{"$f":"IF(OR($D7=Calcs!$A$42,$D7=Calcs!$A$24,$D7=Calcs!$A$56,$D7=Calcs!$A$21,$D7=Calcs!$A$27)=TRUE,IF($AG7<-3.75,4,IF($AG7<0,ROUND('Measure Summary'!$AA9,0),$AG7)),ROUND(IF(N('Measure Summary'!$AA9)=0,0,'Measure Summary'!$AA9),0))","v":0},{"$f":"IF(OR($AI7=\"Full\",$AI7=\"\"),\"\",IF($AG7>=0,0,-$AG7/'Measure Summary'!$AA9))","v":""},"","","","",""]
[null,3,{"$f":"'Measure Summary'!C10","v":""},{"$f":"'Measure Summary'!E10","v":""},"","","",0,0,0,0,{"$f":"AE8","v":1.0000000000000001E-5},1.0000000000000001E-5,{"$f":"IF(E8=\"\",0,IF(OR($E8=\"AO\",$E8=\"NR\"),'Measure Summary'!AA10,VLOOKUP($D8,MeasureQCData,AO8,FALSE)))","v":0},null,{"$f":"IF($C8=\"\",0,IF(OR(MIN('Measure Summary'!I10,$AJ8)=0,OR(ElecUtility=\"\",ElecUtility=0,ElecUtility=\"<Select One>\"))=TRUE,0,1.1*'Measure Summary'!I10*HLOOKUP($AJ8,AvoidedCostTable,$E$38)))","v":0},{"$f":"IF($C8=\"\",0,IF(OR(MIN('Measure Summary'!J10,$AJ8)=0,OR(ElecUtility=\"\",ElecUtility=0,ElecUtility=\"<Select One>\"))=TRUE,0,'Measure Summary'!J10*HLOOKUP($AJ8,AvoidedCostTable,$E$38)*$AP8))","v":0},{"$f":"IF($C8=\"\",0,IF(OR(MIN('Measure Summary'!$K10,$AJ8)=0,OR(ElecUtility=\"\",ElecUtility=0,ElecUtility=\"<Select One>\"))=TRUE,0,'Measure Summary'!$K10*HLOOKUP($AJ8,AvoidedCostTable,$E$39,FALSE)))","v":0},{"$f":"IF($C8=\"\",0,IF('Measure Summary'!N10<>\"Natural Gas\",0,IF(MIN('Measure Summary'!G10,$AJ8)=0,0,'Measure Summary'!G10*HLOOKUP($AJ8,AvoidedCostTable,$E$40))))","v":0},{"$f":"IF($C8=\"\",0,IF('Measure Summary'!N10<>\"Natural Gas\",0,IF(MIN('Measure Summary'!H10,$AJ8)=0,0,'Measure Summary'!H10*HLOOKUP($AJ8,AvoidedCostTable,$E$40))))","v":0},{"$f":"IF(OR(N($P8+$Q8)=0,N($AJ8)=0)=TRUE,0,HLOOKUP($AJ8,AvoidedCostTable,12,FALSE)*('Measure Summary'!I10+'Measure Summary'!J10))","v":0},0,{"$f":"'Measure Summary'!G10+'Measure Summary'!H10","v":0},{"$f":"IF($C8=\"\",0,IF('Measure Summary'!N10<>\"Propane\",0,IF(MIN('Measure Summary'!G10+'Measure Summary'!H10,$AJ8)=0,0,-PV($D$42,$AJ8,('Measure Summary'!G10+'Measure Summary'!H10))*$D$45)))","v":0},{"$f":"IF($C8=\"\",0,IF('Measure Summary'!N10<>\"Fuel Oil\",0,IF(MIN('Measure Summary'!G10+'Measure Summary'!H10,$AJ8)=0,0,-PV($D$42,$AJ8,('Measure Summary'!G10+'Measure Summary'!H10))*$E$45)))","v":0},{"$f":"IF($C8=\"\",0,IF('Measure Summary'!N10<>\"Steam\",0,IF(MIN('Measure Summary'!G10+'Measure Summary'!H10,$AJ8)=0,0,-PV($D$42,$AJ8,('Measure Summary'!G10+'Measure Summary'!H10))*$F$45)))","v":0},{"$f":"IF($C8=\"\",0,IF('Measure Summary'!N10<>'Utility Info'!$B$19,0,IF(MIN('Measure Summary'!G10+'Measure Summary'!H10,$AJ8)=0,0,-PV($D$42,$AJ8,('Measure Summary'!G10+'Measure Summary'!H10))*$G$45)))","v":0},{"$f":"IF(OR(N('Measure Summary'!$L10)=0,N($AJ8)=0)=TRUE,0,-PV('TRC Test'!$D$42,'Measure Summary'!$AA$8,'Measure Summary'!$L10*'Measure Summary'!$P10))","v":0},{"$f":"IF(N($AJ8)=0,0,-PV($D$42,$AJ8,'Measure Summary'!$M10))","v":0},0,{"$f":"IF(OR($D8=Calcs!$A$42,$D8=Calcs!$A$24,$D8=Calcs!$A$56,$D8=Calcs!$A$21,$D8=Calcs!$A$27)=TRUE,'Measure Summary'!$F10/'Measure Summary'!$AA10*$AJ8,'Measure Summary'!$F10-SUM($X8:$AC8))+0.00001","v":1.0000000000000001E-5},null,{"$f":"IF($AI8=\"Inc\",'Measure Summary'!$AA10-(YEAR(TODAY())-'Measure Summary'!$AC10),\"\")","v":""},{"$f":"SUM('Measure Summary'!$G10:$H10)+SUM('Measure Summary'!$I10:$J10)*3412/1000000","v":0},"",{"$f":"IF(OR($D8=Calcs!$A$42,$D8=Calcs!$A$24,$D8=Calcs!$A$56,$D8=Calcs!$A$21,$D8=Calcs!$A$27)=TRUE,IF($AG8<-3.75,4,IF($AG8<0,ROUND('Measure Summary'!$AA10,0),$AG8)),ROUND(IF(N('Measure Summary'!$AA10)=0,0,'Measure Summary'!$AA10),0))","v":0},{"$f":"IF(OR($AI8=\"Full\",$AI8=\"\"),\"\",IF($AG8>=0,0,-$AG8/'Measure Summary'!$AA10))","v":""},"","","","",""]
[null,4,{"$f":"'Measure Summary'!C11","v":""},{"$f":"'Measure Summary'!E11","v":""},"","","",0,0,0,0,1.0000000000000001E-5,1.0000000000000001E-5,{"$f":"IF(E9=\"\",0,IF(OR($E9=\"AO\",$E9=\"NR\"),'Measure Summary'!AA11,VLOOKUP($D9,MeasureQCData,AO9,FALSE)))","v":0},null,{"$f":"IF($C9=\"\",0,IF(OR(MIN('Measure Summary'!I11,$AJ9)=0,OR(ElecUtility=\"\",ElecUtility=0,ElecUtility=\"<Select One>\"))=TRUE,0,1.1*'Measure Summary'!I11*HLOOKUP($AJ9,AvoidedCostTable,$E$38)))","v":0},{"$f":"IF($C9=\"\",0,IF(OR(MIN('Measure Summary'!J11,$AJ9)=0,OR(ElecUtility=\"\",ElecUtility=0,ElecUtility=\"<Select One>\"))=TRUE,0,'Measure Summary'!J11*HLOOKUP($AJ9,AvoidedCostTable,$E$38)*$AP9))","v":0},{"$f":"IF($C9=\"\",0,IF(OR(MIN('Measure Summary'!$K11,$AJ9)=0,OR(ElecUtility=\"\",ElecUtility=0,ElecUtility=\"<Select One>\"))=TRUE,0,'Measure Summary'!$K11*HLOOKUP($AJ9,AvoidedCostTable,$E$39,FALSE)))","v":0},{"$f":"IF($C9=\"\",0,IF('Measure Summary'!N11<>\"Natural Gas\",0,IF(MIN('Measure Summary'!G11,$AJ9)=0,0,'Measure Summary'!G11*HLOOKUP($AJ9,AvoidedCostTable,$E$40))))","v":0},{"$f":"IF($C9=\"\",0,IF('Measure Summary'!N11<>\"Natural Gas\",0,IF(MIN('Measure Summary'!H11,$AJ9)=0,0,'Measure Summary'!H11*HLOOKUP($AJ9,AvoidedCostTable,$E$40))))","v":0},{"$f":"IF(OR(N($P9+$Q9)=0,N($AJ9)=0)=TRUE,0,HLOOKUP($AJ9,AvoidedCostTable,12,FALSE)*('Measure Summary'!I11+'Measure Summary'!J11))","v":0},0,{"$f":"'Measure Summary'!G11+'Measure Summary'!H11","v":0},{"$f":"IF($C9=\"\",0,IF('Measure Summary'!N11<>\"Propane\",0,IF(MIN('Measure Summary'!G11+'Measure Summary'!H11,$AJ9)=0,0,-PV($D$42,$AJ9,('Measure Summary'!G11+'Measure Summary'!H11))*$D$45)))","v":0},{"$f":"IF($C9=\"\",0,IF('Measure Summary'!N11<>\"Fuel Oil\",0,IF(MIN('Measure Summary'!G11+'Measure Summary'!H11,$AJ9)=0,0,-PV($D$42,$AJ9,('Measure Summary'!G11+'Measure Summary'!H11))*$E$45)))","v":0},{"$f":"IF($C9=\"\",0,IF('Measure Summary'!N11<>\"Steam\",0,IF(MIN('Measure Summary'!G11+'Measure Summary'!H11,$AJ9)=0,0,-PV($D$42,$AJ9,('Measure Summary'!G11+'Measure Summary'!H11))*$F$45)))","v":0},{"$f":"IF($C9=\"\",0,IF('Measure Summary'!N11<>'Utility Info'!$B$19,0,IF(MIN('Measure Summary'!G11+'Measure Summary'!H11,$AJ9)=0,0,-PV($D$42,$AJ9,('Measure Summary'!G11+'Measure Summary'!H11))*$G$45)))","v":0},{"$f":"IF(OR(N('Measure Summary'!$L11)=0,N($AJ9)=0)=TRUE,0,-PV('TRC Test'!$D$42,'Measure Summary'!$AA$8,'Measure Summary'!$L11*'Measure Summary'!$P11))","v":0},{"$f":"IF(N($AJ9)=0,0,-PV($D$42,$AJ9,'Measure Summary'!$M11))","v":0},0,{"$f":"IF(OR($D9=Calcs!$A$42,$D9=Calcs!$A$24,$D9=Calcs!$A$56,$D9=Calcs!$A$21,$D9=Calcs!$A$27)=TRUE,'Measure Summary'!$F11/'Measure Summary'!$AA11*$AJ9,'Measure Summary'!$F11-SUM($X9:$AC9))+0.00001","v":1.0000000000000001E-5},null,{"$f":"IF($AI9=\"Inc\",'Measure Summary'!$AA11-(YEAR(TODAY())-'Measure Summary'!$AC11),\"\")","v":""},{"$f":"SUM('Measure Summary'!$G11:$H11)+SUM('Measure Summary'!$I11:$J11)*3412/1000000","v":0},"",{"$f":"IF(OR($D9=Calcs!$A$42,$D9=Calcs!$A$24,$D9=Calcs!$A$56,$D9=Calcs!$A$21,$D9=Calcs!$A$27)=TRUE,IF($AG9<-3.75,4,IF($AG9<0,ROUND('Measure Summary'!$AA11,0),$AG9)),ROUND(IF(N('Measure Summary'!$AA11)=0,0,'Measure Summary'!$AA11),0))","v":0},{"$f":"IF(OR($AI9=\"Full\",$AI9=\"\"),\"\",IF($AG9>=0,0,-$AG9/'Measure Summary'!$AA11))","v":""},"","","","",""]
[null,5,{"$f":"'Measure Summary'!C12","v":""},{"$f":"'Measure Summary'!E12","v":""},"","","",0,0,0,0,1.0000000000000001E-5,1.0000000000000001E-5,{"$f":"IF(E10=\"\",0,IF(OR($E10=\"AO\",$E10=\"NR\"),'Measure Summary'!AA12,VLOOKUP($D10,MeasureQCData,AO10,FALSE)))","v":0},null,{"$f":"IF($C10=\"\",0,IF(OR(MIN('Measure Summary'!I12,$AJ10)=0,OR(ElecUtility=\"\",ElecUtility=0,ElecUtility=\"<Select One>\"))=TRUE,0,1.1*'Measure Summary'!I12*HLOOKUP($AJ10,AvoidedCostTable,$E$38)))","v":0},{"$f":"IF($C10=\"\",0,IF(OR(MIN('Measure Summary'!J12,$AJ10)=0,OR(ElecUtility=\"\",ElecUtility=0,ElecUtility=\"<Select One>\"))=TRUE,0,'Measure Summary'!J12*HLOOKUP($AJ10,AvoidedCostTable,$E$38)*$AP10))","v":0},{"$f":"IF($C10=\"\",0,IF(OR(MIN('Measure Summary'!$K12,$AJ10)=0,OR(ElecUtility=\"\",ElecUtility=0,ElecUtility=\"<Select One>\"))=TRUE,0,'Measure Summary'!$K12*HLOOKUP($AJ10,AvoidedCostTable,$E$39,FALSE)))","v":0},{"$f":"IF($C10=\"\",0,IF('Measure Summary'!N12<>\"Natural Gas\",0,IF(MIN('Measure Summary'!G12,$AJ10)=0,0,'Measure Summary'!G12*HLOOKUP($AJ10,AvoidedCostTable,$E$40))))","v":0},{"$f":"IF($C10=\"\",0,IF('Measure Summary'!N12<>\"Natural Gas\",0,IF(MIN('Measure Summary'!H12,$AJ10)=0,0,'Measure Summary'!H12*HLOOKUP($AJ10,AvoidedCostTable,$E$40))))","v":0},{"$f":"IF(OR(N($P10+$Q10)=0,N($AJ10)=0)=TRUE,0,HLOOKUP($AJ10,AvoidedCostTable,12,FALSE)*('Measure Summary'!I12+'Measure Summary'!J12))","v":0},0,{"$f":"'Measure Summary'!G12+'Measure Summary'!H12","v":0},{"$f":"IF($C10=\"\",0,IF('Measure Summary'!N12<>\"Propane\",0,IF(MIN('Measure Summary'!G12+'Measure Summary'!H12,$AJ10)=0,0,-PV($D$42,$AJ10,('Measure Summary'!G12+'Measure Summary'!H12))*$D$45)))","v":0},{"$f":"IF($C10=\"\",0,IF('Measure Summary'!N12<>\"Fuel Oil\",0,IF(MIN('Measure Summary'!G12+'Measure Summary'!H12,$AJ10)=0,0,-PV($D$42,$AJ10,('Measure Summary'!G12+'Measure Summary'!H12))*$E$45)))","v":0},{"$f":"IF($C10=\"\",0,IF('Measure Summary'!N12<>\"Steam\",0,IF(MIN('Measure Summary'!G12+'Measure Summary'!H12,$AJ10)=0,0,-PV($D$42,$AJ10,('Measure Summary'!G12+'Measure Summary'!H12))*$F$45)))","v":0},{"$f":"IF($C10=\"\",0,IF('Measure Summary'!N12<>'Utility Info'!$B$19,0,IF(MIN('Measure Summary'!G12+'Measure Summary'!H12,$AJ10)=0,0,-PV($D$42,$AJ10,('Measure Summary'!G12+'Measure Summary'!H12))*$G$45)))","v":0},{"$f":"IF(OR(N('Measure Summary'!$L12)=0,N($AJ10)=0)=TRUE,0,-PV('TRC Test'!$D$42,'Measure Summary'!$AA$8,'Measure Summary'!$L12*'Measure Summary'!$P12))","v":0},{"$f":"IF(N($AJ10)=0,0,-PV($D$42,$AJ10,'Measure Summary'!$M12))","v":0},0,{"$f":"IF(OR($D10=Calcs!$A$42,$D10=Calcs!$A$24,$D10=Calcs!$A$56,$D10=Calcs!$A$21,$D10=Calcs!$A$27)=TRUE,'Measure Summary'!$F12/'Measure Summary'!$AA12*$AJ10,'Measure Summary'!$F12-SUM($X10:$AC10))+0.00001","v":1.0000000000000001E-5},null,{"$f":"IF($AI10=\"Inc\",'Measure Summary'!$AA12-(YEAR(TODAY())-'Measure Summary'!$AC12),\"\")","v":""},{"$f":"SUM('Measure Summary'!$G12:$H12)+SUM('Measure Summary'!$I12:$J12)*3412/1000000","v":0},"",{"$f":"IF(OR($D10=Calcs!$A$42,$D10=Calcs!$A$24,$D10=Calcs!$A$56,$D10=Calcs!$A$21,$D10=Calcs!$A$27)=TRUE,IF($AG10<-3.75,4,IF($AG10<0,ROUND('Measure Summary'!$AA12,0),$AG10)),ROUND(IF(N('Measure Summary'!$AA12)=0,0,'Measure Summary'!$AA12),0))","v":0},{"$f":"IF(OR($AI10=\"Full\",$AI10=\"\"),\"\",IF($AG10>=0,0,-$AG10/'Measure Summary'!$AA12))","v":""},"","","","",""]
[null,6,{"$f":"'Measure Summary'!C13","v":""},{"$f":"'Measure Summary'!E13","v":""},"","","",0,0,0,0,1.0000000000000001E-5,1.0000000000000001E-5,{"$f":"IF(E11=\"\",0,IF(OR($E11=\"AO\",$E11=\"NR\"),'Measure Summary'!AA13,VLOOKUP($D11,MeasureQCData,AO11,FALSE)))","v":0},null,{"$f":"IF($C11=\"\",0,IF(OR(MIN('Measure Summary'!I13,$AJ11)=0,OR(ElecUtility=\"\",ElecUtility=0,ElecUtility=\"<Select One>\"))=TRUE,0,1.1*'Measure Summary'!I13*HLOOKUP($AJ11,AvoidedCostTable,$E$38)))","v":0},{"$f":"IF($C11=\"\",0,IF(OR(MIN('Measure Summary'!J13,$AJ11)=0,OR(ElecUtility=\"\",ElecUtility=0,ElecUtility=\"<Select One>\"))=TRUE,0,'Measure Summary'!J13*HLOOKUP($AJ11,AvoidedCostTable,$E$38)*$AP11))","v":0},{"$f":"IF($C11=\"\",0,IF(OR(MIN('Measure Summary'!$K13,$AJ11)=0,OR(ElecUtility=\"\",ElecUtility=0,ElecUtility=\"<Select One>\"))=TRUE,0,'Measure Summary'!$K13*HLOOKUP($AJ11,AvoidedCostTable,$E$39,FALSE)))","v":0},{"$f":"IF($C11=\"\",0,IF('Measure Summary'!N13<>\"Natural Gas\",0,IF(MIN('Measure Summary'!G13,$AJ11)=0,0,'Measure Summary'!G13*HLOOKUP($AJ11,AvoidedCostTable,$E$40))))","v":0},{"$f":"IF($C11=\"\",0,IF('Measure Summary'!N13<>\"Natural Gas\",0,IF(MIN('Measure Summary'!H13,$AJ11)=0,0,'Measure Summary'!H13*HLOOKUP($AJ11,AvoidedCostTable,$E$40))))","v":0},{"$f":"IF(OR(N($P11+$Q11)=0,N($AJ11)=0)=TRUE,0,HLOOKUP($AJ11,AvoidedCostTable,12,FALSE)*('Measure Summary'!I13+'Measure Summary'!J13))","v":0},0,{"$f":"'Measure Summary'!G13+'Measure Summary'!H13","v":0},{"$f":"IF($C11=\"\",0,IF('Measure Summary'!N13<>\"Propane\",0,IF(MIN('Measure Summary'!G13+'Measure Summary'!H13,$AJ11)=0,0,-PV($D$42,$AJ11,('Measure Summary'!G13+'Measure Summary'!H13))*$D$45)))","v":0},{"$f":"IF($C11=\"\",0,IF('Measure Summary'!N13<>\"Fuel Oil\",0,IF(MIN('Measure Summary'!G13+'Measure Summary'!H13,$AJ11)=0,0,-PV($D$42,$AJ11,('Measure Summary'!G13+'Measure Summary'!H13))*$E$45)))","v":0},{"$f":"IF($C11=\"\",0,IF('Measure Summary'!N13<>\"Steam\",0,IF(MIN('Measure Summary'!G13+'Measure Summary'!H13,$AJ11)=0,0,-PV($D$42,$AJ11,('Measure Summary'!G13+'Measure Summary'!H13))*$F$45)))","v":0},{"$f":"IF($C11=\"\",0,IF('Measure Summary'!N13<>'Utility Info'!$B$19,0,IF(MIN('Measure Summary'!G13+'Measure Summary'!H13,$AJ11)=0,0,-PV($D$42,$AJ11,('Measure Summary'!G13+'Measure Summary'!H13))*$G$45)))","v":0},{"$f":"IF(OR(N('Measure Summary'!$L13)=0,N($AJ11)=0)=TRUE,0,-PV('TRC Test'!$D$42,'Measure Summary'!$AA$8,'Measure Summary'!$L13*'Measure Summary'!$P13))","v":0},{"$f":"IF(N($AJ11)=0,0,-PV($D$42,$AJ11,'Measure Summary'!$M13))","v":0},0,{"$f":"IF(OR($D11=Calcs!$A$42,$D11=Calcs!$A$24,$D11=Calcs!$A$56,$D11=Calcs!$A$21,$D11=Calcs!$A$27)=TRUE,'Measure Summary'!$F13/'Measure Summary'!$AA13*$AJ11,'Measure Summary'!$F13-SUM($X11:$AC11))+0.00001","v":1.0000000000000001E-5},null,{"$f":"IF($AI11=\"Inc\",'Measure Summary'!$AA13-(YEAR(TODAY())-'Measure Summary'!$AC13),\"\")","v":""},{"$f":"SUM('Measure Summary'!$G13:$H13)+SUM('Measure Summary'!$I13:$J13)*3412/1000000","v":0},"",{"$f":"IF(OR($D11=Calcs!$A$42,$D11=Calcs!$A$24,$D11=Calcs!$A$56,$D11=Calcs!$A$21,$D11=Calcs!$A$27)=TRUE,IF($AG11<-3.75,4,IF($AG11<0,ROUND('Measure Summary'!$AA13,0),$AG11)),ROUND(IF(N('Measure Summary'!$AA13)=0,0,'Measure Summary'!$AA13),0))","v":0},{"$f":"IF(OR($AI11=\"Full\",$AI11=\"\"),\"\",IF($AG11>=0,0,-$AG11/'Measure Summary'!$AA13))","v":""},"","","","",""]
[null,7,{"$f":"'Measure Summary'!C14","v":""},{"$f":"'Measure Summary'!E14","v":""},"","","",0,0,0,0,1.0000000000000001E-5,1.0000000000000001E-5,{"$f":"IF(E12=\"\",0,IF(OR($E12=\"AO\",$E12=\"NR\"),'Measure Summary'!AA14,VLOOKUP($D12,MeasureQCData,AO12,FALSE)))","v":0},null,{"$f":"IF($C12=\"\",0,IF(OR(MIN('Measure Summary'!I14,$AJ12)=0,OR(ElecUtility=\"\",ElecUtility=0,ElecUtility=\"<Select One>\"))=TRUE,0,1.1*'Measure Summary'!I14*HLOOKUP($AJ12,AvoidedCostTable,$E$38)))","v":0},{"$f":"IF($C12=\"\",0,IF(OR(MIN('Measure Summary'!J14,$AJ12)=0,OR(ElecUtility=\"\",ElecUtility=0,ElecUtility=\"<Select One>\"))=TRUE,0,'Measure Summary'!J14*HLOOKUP($AJ12,AvoidedCostTable,$E$38)*$AP12))","v":0},{"$f":"IF($C12=\"\",0,IF(OR(MIN('Measure Summary'!$K14,$AJ12)=0,OR(ElecUtility=\"\",ElecUtility=0,ElecUtility=\"<Select One>\"))=TRUE,0,'Measure Summary'!$K14*HLOOKUP($AJ12,AvoidedCostTable,$E$39,FALSE)))","v":0},{"$f":"IF($C12=\"\",0,IF('Measure Summary'!N14<>\"Natural Gas\",0,IF(MIN('Measure Summary'!G14,$AJ12)=0,0,'Measure Summary'!G14*HLOOKUP($AJ12,AvoidedCostTable,$E$40))))","v":0},{"$f":"IF($C12=\"\",0,IF('Measure Summary'!N14<>\"Natural Gas\",0,IF(MIN('Measure Summary'!H14,$AJ12)=0,0,'Measure Summary'!H14*HLOOKUP($AJ12,AvoidedCostTable,$E$40))))","v":0},{"$f":"IF(OR(N($P12+$Q12)=0,N($AJ12)=0)=TRUE,0,HLOOKUP($AJ12,AvoidedCostTable,12,FALSE)*('Measure Summary'!I14+'Measure Summary'!J14))","v":0},0,{"$f":"'Measure Summary'!G14+'Measure Summary'!H14","v":0},{"$f":"IF($C12=\"\",0,IF('Measure Summary'!N14<>\"Propane\",0,IF(MIN('Measure Summary'!G14+'Measure Summary'!H14,$AJ12)=0,0,-PV($D$42,$AJ12,('Measure Summary'!G14+'Measure Summary'!H14))*$D$45)))","v":0},{"$f":"IF($C12=\"\",0,IF('Measure Summary'!N14<>\"Fuel Oil\",0,IF(MIN('Measure Summary'!G14+'Measure Summary'!H14,$AJ12)=0,0,-PV($D$42,$AJ12,('Measure Summary'!G14+'Measure Summary'!H14))*$E$45)))","v":0},{"$f":"IF($C12=\"\",0,IF('Measure Summary'!N14<>\"Steam\",0,IF(MIN('Measure Summary'!G14+'Measure Summary'!H14,$AJ12)=0,0,-PV($D$42,$AJ12,('Measure Summary'!G14+'Measure Summary'!H14))*$F$45)))","v":0},{"$f":"IF($C12=\"\",0,IF('Measure Summary'!N14<>'Utility Info'!$B$19,0,IF(MIN('Measure Summary'!G14+'Measure Summary'!H14,$AJ12)=0,0,-PV($D$42,$AJ12,('Measure Summary'!G14+'Measure Summary'!H14))*$G$45)))","v":0},{"$f":"IF(OR(N('Measure Summary'!$L14)=0,N($AJ12)=0)=TRUE,0,-PV('TRC Test'!$D$42,'Measure Summary'!$AA$8,'Measure Summary'!$L14*'Measure Summary'!$P14))","v":0},{"$f":"IF(N($AJ12)=0,0,-PV($D$42,$AJ12,'Measure Summary'!$M14))","v":0},0,{"$f":"IF(OR($D12=Calcs!$A$42,$D12=Calcs!$A$24,$D12=Calcs!$A$56,$D12=Calcs!$A$21,$D12=Calcs!$A$27)=TRUE,'Measure Summary'!$F14/'Measure Summary'!$AA14*$AJ12,'Measure Summary'!$F14-SUM($X12:$AC12))+0.00001","v":1.0000000000000001E-5},null,{"$f":"IF($AI12=\"Inc\",'Measure Summary'!$AA14-(YEAR(TODAY())-'Measure Summary'!$AC14),\"\")","v":""},{"$f":"SUM('Measure Summary'!$G14:$H14)+SUM('Measure Summary'!$I14:$J14)*3412/1000000","v":0},"",{"$f":"IF(OR($D12=Calcs!$A$42,$D12=Calcs!$A$24,$D12=Calcs!$A$56,$D12=Calcs!$A$21,$D12=Calcs!$A$27)=TRUE,IF($AG12<-3.75,4,IF($AG12<0,ROUND('Measure Summary'!$AA14,0),$AG12)),ROUND(IF(N('Measure Summary'!$AA14)=0,0,'Measure Summary'!$AA14),0))","v":0},{"$f":"IF(OR($AI12=\"Full\",$AI12=\"\"),\"\",IF($AG12>=0,0,-$AG12/'Measure Summary'!$AA14))","v":""},"","","","",""]
[null,8,{"$f":"'Measure Summary'!C15","v":""},{"$f":"'Measure Summary'!E15","v":""},"","","",0,0,0,0,1.0000000000000001E-5,1.0000000000000001E-5,{"$f":"IF(E13=\"\",0,IF(OR($E13=\"AO\",$E13=\"NR\"),'Measure Summary'!AA15,VLOOKUP($D13,MeasureQCData,AO13,FALSE)))","v":0},null,{"$f":"IF($C13=\"\",0,IF(OR(MIN('Measure Summary'!I15,$AJ13)=0,OR(ElecUtility=\"\",ElecUtility=0,ElecUtility=\"<Select One>\"))=TRUE,0,1.1*'Measure Summary'!I15*HLOOKUP($AJ13,AvoidedCostTable,$E$38)))","v":0},{"$f":"IF($C13=\"\",0,IF(OR(MIN('Measure Summary'!J15,$AJ13)=0,OR(ElecUtility=\"\",ElecUtility=0,ElecUtility=\"<Select One>\"))=TRUE,0,'Measure Summary'!J15*HLOOKUP($AJ13,AvoidedCostTable,$E$38)*$AP13))","v":0},{"$f":"IF($C13=\"\",0,IF(OR(MIN('Measure Summary'!$K15,$AJ13)=0,OR(ElecUtility=\"\",ElecUtility=0,ElecUtility=\"<Select One>\"))=TRUE,0,'Measure Summary'!$K15*HLOOKUP($AJ13,AvoidedCostTable,$E$39,FALSE)))","v":0},{"$f":"IF($C13=\"\",0,IF('Measure Summary'!N15<>\"Natural Gas\",0,IF(MIN('Measure Summary'!G15,$AJ13)=0,0,'Measure Summary'!G15*HLOOKUP($AJ13,AvoidedCostTable,$E$40))))","v":0},{"$f":"IF($C13=\"\",0,IF('Measure Summary'!N15<>\"Natural Gas\",0,IF(MIN('Measure Summary'!H15,$AJ13)=0,0,'Measure Summary'!H15*HLOOKUP($AJ13,AvoidedCostTable,$E$40))))","v":0},{"$f":"IF(OR(N($P13+$Q13)=0,N($AJ13)=0)=TRUE,0,HLOOKUP($AJ13,AvoidedCostTable,12,FALSE)*('Measure Summary'!I15+'Measure Summary'!J15))","v":0},0,{"$f":"'Measure Summary'!G15+'Measure Summary'!H15","v":0},{"$f":"IF($C13=\"\",0,IF('Measure Summary'!N15<>\"Propane\",0,IF(MIN('Measure Summary'!G15+'Measure Summary'!H15,$AJ13)=0,0,-PV($D$42,$AJ13,('Measure Summary'!G15+'Measure Summary'!H15))*$D$45)))","v":0},{"$f":"IF($C13=\"\",0,IF('Measure Summary'!N15<>\"Fuel Oil\",0,IF(MIN('Measure Summary'!G15+'Measure Summary'!H15,$AJ13)=0,0,-PV($D$42,$AJ13,('Measure Summary'!G15+'Measure Summary'!H15))*$E$45)))","v":0},{"$f":"IF($C13=\"\",0,IF('Measure Summary'!N15<>\"Steam\",0,IF(MIN('Measure Summary'!G15+'Measure Summary'!H15,$AJ13)=0,0,-PV($D$42,$AJ13,('Measure Summary'!G15+'Measure Summary'!H15))*$F$45)))","v":0},{"$f":"IF($C13=\"\",0,IF('Measure Summary'!N15<>'Utility Info'!$B$19,0,IF(MIN('Measure Summary'!G15+'Measure Summary'!H15,$AJ13)=0,0,-PV($D$42,$AJ13,('Measure Summary'!G15+'Measure Summary'!H15))*$G$45)))","v":0},{"$f":"IF(OR(N('Measure Summary'!$L15)=0,N($AJ13)=0)=TRUE,0,-PV('TRC Test'!$D$42,'Measure Summary'!$AA$8,'Measure Summary'!$L15*'Measure Summary'!$P15))","v":0},{"$f":"IF(N($AJ13)=0,0,-PV($D$42,$AJ13,'Measure Summary'!$M15))","v":0},0,{"$f":"IF(OR($D13=Calcs!$A$42,$D13=Calcs!$A$24,$D13=Calcs!$A$56,$D13=Calcs!$A$21,$D13=Calcs!$A$27)=TRUE,'Measure Summary'!$F15/'Measure Summary'!$AA15*$AJ13,'Measure Summary'!$F15-SUM($X13:$AC13))+0.00001","v":1.0000000000000001E-5},null,{"$f":"IF($AI13=\"Inc\",'Measure Summary'!$AA15-(YEAR(TODAY())-'Measure Summary'!$AC15),\"\")","v":""},{"$f":"SUM('Measure Summary'!$G15:$H15)+SUM('Measure Summary'!$I15:$J15)*3412/1000000","v":0},"",{"$f":"IF(OR($D13=Calcs!$A$42,$D13=Calcs!$A$24,$D13=Calcs!$A$56,$D13=Calcs!$A$21,$D13=Calcs!$A$27)=TRUE,IF($AG13<-3.75,4,IF($AG13<0,ROUND('Measure Summary'!$AA15,0),$AG13)),ROUND(IF(N('Measure Summary'!$AA15)=0,0,'Measure Summary'!$AA15),0))","v":0},{"$f":"IF(OR($AI13=\"Full\",$AI13=\"\"),\"\",IF($AG13>=0,0,-$AG13/'Measure Summary'!$AA15))","v":""},"","","","",""]
[null,9,{"$f":"'Measure Summary'!C16","v":""},{"$f":"'Measure Summary'!E16","v":""},"","","",0,0,0,0,1.0000000000000001E-5,1.0000000000000001E-5,{"$f":"IF(E14=\"\",0,IF(OR($E14=\"AO\",$E14=\"NR\"),'Measure Summary'!AA16,VLOOKUP($D14,MeasureQCData,AO14,FALSE)))","v":0},null,{"$f":"IF($C14=\"\",0,IF(OR(MIN('Measure Summary'!I16,$AJ14)=0,OR(ElecUtility=\"\",ElecUtility=0,ElecUtility=\"<Select One>\"))=TRUE,0,1.1*'Measure Summary'!I16*HLOOKUP($AJ14,AvoidedCostTable,$E$38)))","v":0},{"$f":"IF($C14=\"\",0,IF(OR(MIN('Measure Summary'!J16,$AJ14)=0,OR(ElecUtility=\"\",ElecUtility=0,ElecUtility=\"<Select One>\"))=TRUE,0,'Measure Summary'!J16*HLOOKUP($AJ14,AvoidedCostTable,$E$38)*$AP14))","v":0},{"$f":"IF($C14=\"\",0,IF(OR(MIN('Measure Summary'!$K16,$AJ14)=0,OR(ElecUtility=\"\",ElecUtility=0,ElecUtility=\"<Select One>\"))=TRUE,0,'Measure Summary'!$K16*HLOOKUP($AJ14,AvoidedCostTable,$E$39,FALSE)))","v":0},{"$f":"IF($C14=\"\",0,IF('Measure Summary'!N16<>\"Natural Gas\",0,IF(MIN('Measure Summary'!G16,$AJ14)=0,0,'Measure Summary'!G16*HLOOKUP($AJ14,AvoidedCostTable,$E$40))))","v":0},{"$f":"IF($C14=\"\",0,IF('Measure Summary'!N16<>\"Natural Gas\",0,IF(MIN('Measure Summary'!H16,$AJ14)=0,0,'Measure Summary'!H16*HLOOKUP($AJ14,AvoidedCostTable,$E$40))))","v":0},{"$f":"IF(OR(N($P14+$Q14)=0,N($AJ14)=0)=TRUE,0,HLOOKUP($AJ14,AvoidedCostTable,12,FALSE)*('Measure Summary'!I16+'Measure Summary'!J16))","v":0},0,{"$f":"'Measure Summary'!G16+'Measure Summary'!H16","v":0},{"$f":"IF($C14=\"\",0,IF('Measure Summary'!N16<>\"Propane\",0,IF(MIN('Measure Summary'!G16+'Measure Summary'!H16,$AJ14)=0,0,-PV($D$42,$AJ14,('Measure Summary'!G16+'Measure Summary'!H16))*$D$45)))","v":0},{"$f":"IF($C14=\"\",0,IF('Measure Summary'!N16<>\"Fuel Oil\",0,IF(MIN('Measure Summary'!G16+'Measure Summary'!H16,$AJ14)=0,0,-PV($D$42,$AJ14,('Measure Summary'!G16+'Measure Summary'!H16))*$E$45)))","v":0},{"$f":"IF($C14=\"\",0,IF('Measure Summary'!N16<>\"Steam\",0,IF(MIN('Measure Summary'!G16+'Measure Summary'!H16,$AJ14)=0,0,-PV($D$42,$AJ14,('Measure Summary'!G16+'Measure Summary'!H16))*$F$45)))","v":0},{"$f":"IF($C14=\"\",0,IF('Measure Summary'!N16<>'Utility Info'!$B$19,0,IF(MIN('Measure Summary'!G16+'Measure Summary'!H16,$AJ14)=0,0,-PV($D$42,$AJ14,('Measure Summary'!G16+'Measure Summary'!H16))*$G$45)))","v":0},{"$f":"IF(OR(N('Measure Summary'!$L16)=0,N($AJ14)=0)=TRUE,0,-PV('TRC Test'!$D$42,'Measure Summary'!$AA$8,'Measure Summary'!$L16*'Measure Summary'!$P16))","v":0},{"$f":"IF(N($AJ14)=0,0,-PV($D$42,$AJ14,'Measure Summary'!$M16))","v":0},0,{"$f":"IF(OR($D14=Calcs!$A$42,$D14=Calcs!$A$24,$D14=Calcs!$A$56,$D14=Calcs!$A$21,$D14=Calcs!$A$27)=TRUE,'Measure Summary'!$F16/'Measure Summary'!$AA16*$AJ14,'Measure Summary'!$F16-SUM($X14:$AC14))+0.00001","v":1.0000000000000001E-5},null,{"$f":"IF($AI14=\"Inc\",'Measure Summary'!$AA16-(YEAR(TODAY())-'Measure Summary'!$AC16),\"\")","v":""},{"$f":"SUM('Measure Summary'!$G16:$H16)+SUM('Measure Summary'!$I16:$J16)*3412/1000000","v":0},"",{"$f":"IF(OR($D14=Calcs!$A$42,$D14=Calcs!$A$24,$D14=Calcs!$A$56,$D14=Calcs!$A$21,$D14=Calcs!$A$27)=TRUE,IF($AG14<-3.75,4,IF($AG14<0,ROUND('Measure Summary'!$AA16,0),$AG14)),ROUND(IF(N('Measure Summary'!$AA16)=0,0,'Measure Summary'!$AA16),0))","v":0},{"$f":"IF(OR($AI14=\"Full\",$AI14=\"\"),\"\",IF($AG14>=0,0,-$AG14/'Measure Summary'!$AA16))","v":""},"","","","",""]
[null,10,{"$f":"'Measure Summary'!C17","v":""},{"$f":"'Measure Summary'!E17","v":""},"","","",0,0,0,0,1.0000000000000001E-5,1.0000000000000001E-5,{"$f":"IF(E15=\"\",0,IF(OR($E15=\"AO\",$E15=\"NR\"),'Measure Summary'!AA17,VLOOKUP($D15,MeasureQCData,AO15,FALSE)))","v":0},null,{"$f":"IF($C15=\"\",0,IF(OR(MIN('Measure Summary'!I17,$AJ15)=0,OR(ElecUtility=\"\",ElecUtility=0,ElecUtility=\"<Select One>\"))=TRUE,0,1.1*'Measure Summary'!I17*HLOOKUP($AJ15,AvoidedCostTable,$E$38)))","v":0},{"$f":"IF($C15=\"\",0,IF(OR(MIN('Measure Summary'!J17,$AJ15)=0,OR(ElecUtility=\"\",ElecUtility=0,ElecUtility=\"<Select One>\"))=TRUE,0,'Measure Summary'!J17*HLOOKUP($AJ15,AvoidedCostTable,$E$38)*$AP15))","v":0},{"$f":"IF($C15=\"\",0,IF(OR(MIN('Measure Summary'!$K17,$AJ15)=0,OR(ElecUtility=\"\",ElecUtility=0,ElecUtility=\"<Select One>\"))=TRUE,0,'Measure Summary'!$K17*HLOOKUP($AJ15,AvoidedCostTable,$E$39,FALSE)))","v":0},{"$f":"IF($C15=\"\",0,IF('Measure Summary'!N17<>\"Natural Gas\",0,IF(MIN('Measure Summary'!G17,$AJ15)=0,0,'Measure Summary'!G17*HLOOKUP($AJ15,AvoidedCostTable,$E$40))))","v":0},{"$f":"IF($C15=\"\",0,IF('Measure Summary'!N17<>\"Natural Gas\",0,IF(MIN('Measure Summary'!H17,$AJ15)=0,0,'Measure Summary'!H17*HLOOKUP($AJ15,AvoidedCostTable,$E$40))))","v":0},{"$f":"IF(OR(N($P15+$Q15)=0,N($AJ15)=0)=TRUE,0,HLOOKUP($AJ15,AvoidedCostTable,12,FALSE)*('Measure Summary'!I17+'Measure Summary'!J17))","v":0},0,{"$f":"'Measure Summary'!G17+'Measure Summary'!H17","v":0},{"$f":"IF($C15=\"\",0,IF('Measure Summary'!N17<>\"Propane\",0,IF(MIN('Measure Summary'!G17+'Measure Summary'!H17,$AJ15)=0,0,-PV($D$42,$AJ15,('Measure Summary'!G17+'Measure Summary'!H17))*$D$45)))","v":0},{"$f":"IF($C15=\"\",0,IF('Measure Summary'!N17<>\"Fuel Oil\",0,IF(MIN('Measure Summary'!G17+'Measure Summary'!H17,$AJ15)=0,0,-PV($D$42,$AJ15,('Measure Summary'!G17+'Measure Summary'!H17))*$E$45)))","v":0},{"$f":"IF($C15=\"\",0,IF('Measure Summary'!N17<>\"Steam\",0,IF(MIN('Measure Summary'!G17+'Measure Summary'!H17,$AJ15)=0,0,-PV($D$42,$AJ15,('Measure Summary'!G17+'Measure Summary'!H17))*$F$45)))","v":0},{"$f":"IF($C15=\"\",0,IF('Measure Summary'!N17<>'Utility Info'!$B$19,0,IF(MIN('Measure Summary'!G17+'Measure Summary'!H17,$AJ15)=0,0,-PV($D$42,$AJ15,('Measure Summary'!G17+'Measure Summary'!H17))*$G$45)))","v":0},{"$f":"IF(OR(N('Measure Summary'!$L17)=0,N($AJ15)=0)=TRUE,0,-PV('TRC Test'!$D$42,'Measure Summary'!$AA$8,'Measure Summary'!$L17*'Measure Summary'!$P17))","v":0},{"$f":"IF(N($AJ15)=0,0,-PV($D$42,$AJ15,'Measure Summary'!$M17))","v":0},0,{"$f":"IF(OR($D15=Calcs!$A$42,$D15=Calcs!$A$24,$D15=Calcs!$A$56,$D15=Calcs!$A$21,$D15=Calcs!$A$27)=TRUE,'Measure Summary'!$F17/'Measure Summary'!$AA17*$AJ15,'Measure Summary'!$F17-SUM($X15:$AC15))+0.00001","v":1.0000000000000001E-5},null,{"$f":"IF($AI15=\"Inc\",'Measure Summary'!$AA17-(YEAR(TODAY())-'Measure Summary'!$AC17),\"\")","v":""},{"$f":"SUM('Measure Summary'!$G17:$H17)+SUM('Measure Summary'!$I17:$J17)*3412/1000000","v":0},"",{"$f":"IF(OR($D15=Calcs!$A$42,$D15=Calcs!$A$24,$D15=Calcs!$A$56,$D15=Calcs!$A$21,$D15=Calcs!$A$27)=TRUE,IF($AG15<-3.75,4,IF($AG15<0,ROUND('Measure Summary'!$AA17,0),$AG15)),ROUND(IF(N('Measure Summary'!$AA17)=0,0,'Measure Summary'!$AA17),0))","v":0},{"$f":"IF(OR($AI15=\"Full\",$AI15=\"\"),\"\",IF($AG15>=0,0,-$AG15/'Measure Summary'!$AA17))","v":""},"","","","",""]
[null,11,{"$f":"'Measure Summary'!C18","v":""},{"$f":"'Measure Summary'!E18","v":""},"","","",0,0,0,0,1.0000000000000001E-5,1.0000000000000001E-5,{"$f":"IF(E16=\"\",0,IF(OR($E16=\"AO\",$E16=\"NR\"),'Measure Summary'!AA18,VLOOKUP($D16,MeasureQCData,AO16,FALSE)))","v":0},null,{"$f":"IF($C16=\"\",0,IF(OR(MIN('Measure Summary'!I18,$AJ16)=0,OR(ElecUtility=\"\",ElecUtility=0,ElecUtility=\"<Select One>\"))=TRUE,0,1.1*'Measure Summary'!I18*HLOOKUP($AJ16,AvoidedCostTable,$E$38)))","v":0},{"$f":"IF($C16=\"\",0,IF(OR(MIN('Measure Summary'!J18,$AJ16)=0,OR(ElecUtility=\"\",ElecUtility=0,ElecUtility=\"<Select One>\"))=TRUE,0,'Measure Summary'!J18*HLOOKUP($AJ16,AvoidedCostTable,$E$38)*$AP16))","v":0},{"$f":"IF($C16=\"\",0,IF(OR(MIN('Measure Summary'!$K18,$AJ16)=0,OR(ElecUtility=\"\",ElecUtility=0,ElecUtility=\"<Select One>\"))=TRUE,0,'Measure Summary'!$K18*HLOOKUP($AJ16,AvoidedCostTable,$E$39,FALSE)))","v":0},{"$f":"IF($C16=\"\",0,IF('Measure Summary'!N18<>\"Natural Gas\",0,IF(MIN('Measure Summary'!G18,$AJ16)=0,0,'Measure Summary'!G18*HLOOKUP($AJ16,AvoidedCostTable,$E$40))))","v":0},{"$f":"IF($C16=\"\",0,IF('Measure Summary'!N18<>\"Natural Gas\",0,IF(MIN('Measure Summary'!H18,$AJ16)=0,0,'Measure Summary'!H18*HLOOKUP($AJ16,AvoidedCostTable,$E$40))))","v":0},{"$f":"IF(OR(N($P16+$Q16)=0,N($AJ16)=0)=TRUE,0,HLOOKUP($AJ16,AvoidedCostTable,12,FALSE)*('Measure Summary'!I18+'Measure Summary'!J18))","v":0},0,{"$f":"'Measure Summary'!G18+'Measure Summary'!H18","v":0},{"$f":"IF($C16=\"\",0,IF('Measure Summary'!N18<>\"Propane\",0,IF(MIN('Measure Summary'!G18+'Measure Summary'!H18,$AJ16)=0,0,-PV($D$42,$AJ16,('Measure Summary'!G18+'Measure Summary'!H18))*$D$45)))","v":0},{"$f":"IF($C16=\"\",0,IF('Measure Summary'!N18<>\"Fuel Oil\",0,IF(MIN('Measure Summary'!G18+'Measure Summary'!H18,$AJ16)=0,0,-PV($D$42,$AJ16,('Measure Summary'!G18+'Measure Summary'!H18))*$E$45)))","v":0},{"$f":"IF($C16=\"\",0,IF('Measure Summary'!N18<>\"Steam\",0,IF(MIN('Measure Summary'!G18+'Measure Summary'!H18,$AJ16)=0,0,-PV($D$42,$AJ16,('Measure Summary'!G18+'Measure Summary'!H18))*$F$45)))","v":0},{"$f":"IF($C16=\"\",0,IF('Measure Summary'!N18<>'Utility Info'!$B$19,0,IF(MIN('Measure Summary'!G18+'Measure Summary'!H18,$AJ16)=0,0,-PV($D$42,$AJ16,('Measure Summary'!G18+'Measure Summary'!H18))*$G$45)))","v":0},{"$f":"IF(OR(N('Measure Summary'!$L18)=0,N($AJ16)=0)=TRUE,0,-PV('TRC Test'!$D$42,'Measure Summary'!$AA$8,'Measure Summary'!$L18*'Measure Summary'!$P18))","v":0},{"$f":"IF(N($AJ16)=0,0,-PV($D$42,$AJ16,'Measure Summary'!$M18))","v":0},0,{"$f":"IF(OR($D16=Calcs!$A$42,$D16=Calcs!$A$24,$D16=Calcs!$A$56,$D16=Calcs!$A$21,$D16=Calcs!$A$27)=TRUE,'Measure Summary'!$F18/'Measure Summary'!$AA18*$AJ16,'Measure Summary'!$F18-SUM($X16:$AC16))+0.00001","v":1.0000000000000001E-5},null,{"$f":"IF($AI16=\"Inc\",'Measure Summary'!$AA18-(YEAR(TODAY())-'Measure Summary'!$AC18),\"\")","v":""},{"$f":"SUM('Measure Summary'!$G18:$H18)+SUM('Measure Summary'!$I18:$J18)*3412/1000000","v":0},"",{"$f":"IF(OR($D16=Calcs!$A$42,$D16=Calcs!$A$24,$D16=Calcs!$A$56,$D16=Calcs!$A$21,$D16=Calcs!$A$27)=TRUE,IF($AG16<-3.75,4,IF($AG16<0,ROUND('Measure Summary'!$AA18,0),$AG16)),ROUND(IF(N('Measure Summary'!$AA18)=0,0,'Measure Summary'!$AA18),0))","v":0},{"$f":"IF(OR($AI16=\"Full\",$AI16=\"\"),\"\",IF($AG16>=0,0,-$AG16/'Measure Summary'!$AA18))","v":""},"","","","",""]
[null,12,{"$f":"'Measure Summary'!C19","v":""},{"$f":"'Measure Summary'!E19","v":""},"","","",0,0,0,0,1.0000000000000001E-5,1.0000000000000001E-5,{"$f":"IF(E17=\"\",0,IF(OR($E17=\"AO\",$E17=\"NR\"),'Measure Summary'!AA19,VLOOKUP($D17,MeasureQCData,AO17,FALSE)))","v":0},null,{"$f":"IF($C17=\"\",0,IF(OR(MIN('Measure Summary'!I19,$AJ17)=0,OR(ElecUtility=\"\",ElecUtility=0,ElecUtility=\"<Select One>\"))=TRUE,0,1.1*'Measure Summary'!I19*HLOOKUP($AJ17,AvoidedCostTable,$E$38)))","v":0},{"$f":"IF($C17=\"\",0,IF(OR(MIN('Measure Summary'!J19,$AJ17)=0,OR(ElecUtility=\"\",ElecUtility=0,ElecUtility=\"<Select One>\"))=TRUE,0,'Measure Summary'!J19*HLOOKUP($AJ17,AvoidedCostTable,$E$38)*$AP17))","v":0},{"$f":"IF($C17=\"\",0,IF(OR(MIN('Measure Summary'!$K19,$AJ17)=0,OR(ElecUtility=\"\",ElecUtility=0,ElecUtility=\"<Select One>\"))=TRUE,0,'Measure Summary'!$K19*HLOOKUP($AJ17,AvoidedCostTable,$E$39,FALSE)))","v":0},{"$f":"IF($C17=\"\",0,IF('Measure Summary'!N19<>\"Natural Gas\",0,IF(MIN('Measure Summary'!G19,$AJ17)=0,0,'Measure Summary'!G19*HLOOKUP($AJ17,AvoidedCostTable,$E$40))))","v":0},{"$f":"IF($C17=\"\",0,IF('Measure Summary'!N19<>\"Natural Gas\",0,IF(MIN('Measure Summary'!H19,$AJ17)=0,0,'Measure Summary'!H19*HLOOKUP($AJ17,AvoidedCostTable,$E$40))))","v":0},{"$f":"IF(OR(N($P17+$Q17)=0,N($AJ17)=0)=TRUE,0,HLOOKUP($AJ17,AvoidedCostTable,12,FALSE)*('Measure Summary'!I19+'Measure Summary'!J19))","v":0},0,{"$f":"'Measure Summary'!G19+'Measure Summary'!H19","v":0},{"$f":"IF($C17=\"\",0,IF('Measure Summary'!N19<>\"Propane\",0,IF(MIN('Measure Summary'!G19+'Measure Summary'!H19,$AJ17)=0,0,-PV($D$42,$AJ17,('Measure Summary'!G19+'Measure Summary'!H19))*$D$45)))","v":0},{"$f":"IF($C17=\"\",0,IF('Measure Summary'!N19<>\"Fuel Oil\",0,IF(MIN('Measure Summary'!G19+'Measure Summary'!H19,$AJ17)=0,0,-PV($D$42,$AJ17,('Measure Summary'!G19+'Measure Summary'!H19))*$E$45)))","v":0},{"$f":"IF($C17=\"\",0,IF('Measure Summary'!N19<>\"Steam\",0,IF(MIN('Measure Summary'!G19+'Measure Summary'!H19,$AJ17)=0,0,-PV($D$42,$AJ17,('Measure Summary'!G19+'Measure Summary'!H19))*$F$45)))","v":0},{"$f":"IF($C17=\"\",0,IF('Measure Summary'!N19<>'Utility Info'!$B$19,0,IF(MIN('Measure Summary'!G19+'Measure Summary'!H19,$AJ17)=0,0,-PV($D$42,$AJ17,('Measure Summary'!G19+'Measure Summary'!H19))*$G$45)))","v":0},{"$f":"IF(OR(N('Measure Summary'!$L19)=0,N($AJ17)=0)=TRUE,0,-PV('TRC Test'!$D$42,'Measure Summary'!$AA$8,'Measure Summary'!$L19*'Measure Summary'!$P19))","v":0},{"$f":"IF(N($AJ17)=0,0,-PV($D$42,$AJ17,'Measure Summary'!$M19))","v":0},0,{"$f":"IF(OR($D17=Calcs!$A$42,$D17=Calcs!$A$24,$D17=Calcs!$A$56,$D17=Calcs!$A$21,$D17=Calcs!$A$27)=TRUE,'Measure Summary'!$F19/'Measure Summary'!$AA19*$AJ17,'Measure Summary'!$F19-SUM($X17:$AC17))+0.00001","v":1.0000000000000001E-5},null,{"$f":"IF($AI17=\"Inc\",'Measure Summary'!$AA19-(YEAR(TODAY())-'Measure Summary'!$AC19),\"\")","v":""},{"$f":"SUM('Measure Summary'!$G19:$H19)+SUM('Measure Summary'!$I19:$J19)*3412/1000000","v":0},"",{"$f":"IF(OR($D17=Calcs!$A$42,$D17=Calcs!$A$24,$D17=Calcs!$A$56,$D17=Calcs!$A$21,$D17=Calcs!$A$27)=TRUE,IF($AG17<-3.75,4,IF($AG17<0,ROUND('Measure Summary'!$AA19,0),$AG17)),ROUND(IF(N('Measure Summary'!$AA19)=0,0,'Measure Summary'!$AA19),0))","v":0},{"$f":"IF(OR($AI17=\"Full\",$AI17=\"\"),\"\",IF($AG17>=0,0,-$AG17/'Measure Summary'!$AA19))","v":""},"","","","",""]
[null,13,{"$f":"'Measure Summary'!C20","v":""},{"$f":"'Measure Summary'!E20","v":""},"","","",0,0,0,0,1.0000000000000001E-5,1.0000000000000001E-5,{"$f":"IF(E18=\"\",0,IF(OR($E18=\"AO\",$E18=\"NR\"),'Measure Summary'!AA20,VLOOKUP($D18,MeasureQCData,AO18,FALSE)))","v":0},null,{"$f":"IF($C18=\"\",0,IF(OR(MIN('Measure Summary'!I20,$AJ18)=0,OR(ElecUtility=\"\",ElecUtility=0,ElecUtility=\"<Select One>\"))=TRUE,0,1.1*'Measure Summary'!I20*HLOOKUP($AJ18,AvoidedCostTable,$E$38)))","v":0},{"$f":"IF($C18=\"\",0,IF(OR(MIN('Measure Summary'!J20,$AJ18)=0,OR(ElecUtility=\"\",ElecUtility=0,ElecUtility=\"<Select One>\"))=TRUE,0,'Measure Summary'!J20*HLOOKUP($AJ18,AvoidedCostTable,$E$38)*$AP18))","v":0},{"$f":"IF($C18=\"\",0,IF(OR(MIN('Measure Summary'!$K20,$AJ18)=0,OR(ElecUtility=\"\",ElecUtility=0,ElecUtility=\"<Select One>\"))=TRUE,0,'Measure Summary'!$K20*HLOOKUP($AJ18,AvoidedCostTable,$E$39,FALSE)))","v":0},{"$f":"IF($C18=\"\",0,IF('Measure Summary'!N20<>\"Natural Gas\",0,IF(MIN('Measure Summary'!G20,$AJ18)=0,0,'Measure Summary'!G20*HLOOKUP($AJ18,AvoidedCostTable,$E$40))))","v":0},{"$f":"IF($C18=\"\",0,IF('Measure Summary'!N20<>\"Natural Gas\",0,IF(MIN('Measure Summary'!H20,$AJ18)=0,0,'Measure Summary'!H20*HLOOKUP($AJ18,AvoidedCostTable,$E$40))))","v":0},{"$f":"IF(OR(N($P18+$Q18)=0,N($AJ18)=0)=TRUE,0,HLOOKUP($AJ18,AvoidedCostTable,12,FALSE)*('Measure Summary'!I20+'Measure Summary'!J20))","v":0},0,{"$f":"'Measure Summary'!G20+'Measure Summary'!H20","v":0},{"$f":"IF($C18=\"\",0,IF('Measure Summary'!N20<>\"Propane\",0,IF(MIN('Measure Summary'!G20+'Measure Summary'!H20,$AJ18)=0,0,-PV($D$42,$AJ18,('Measure Summary'!G20+'Measure Summary'!H20))*$D$45)))","v":0},{"$f":"IF($C18=\"\",0,IF('Measure Summary'!N20<>\"Fuel Oil\",0,IF(MIN('Measure Summary'!G20+'Measure Summary'!H20,$AJ18)=0,0,-PV($D$42,$AJ18,('Measure Summary'!G20+'Measure Summary'!H20))*$E$45)))","v":0},{"$f":"IF($C18=\"\",0,IF('Measure Summary'!N20<>\"Steam\",0,IF(MIN('Measure Summary'!G20+'Measure Summary'!H20,$AJ18)=0,0,-PV($D$42,$AJ18,('Measure Summary'!G20+'Measure Summary'!H20))*$F$45)))","v":0},{"$f":"IF($C18=\"\",0,IF('Measure Summary'!N20<>'Utility Info'!$B$19,0,IF(MIN('Measure Summary'!G20+'Measure Summary'!H20,$AJ18)=0,0,-PV($D$42,$AJ18,('Measure Summary'!G20+'Measure Summary'!H20))*$G$45)))","v":0},{"$f":"IF(OR(N('Measure Summary'!$L20)=0,N($AJ18)=0)=TRUE,0,-PV('TRC Test'!$D$42,'Measure Summary'!$AA$8,'Measure Summary'!$L20*'Measure Summary'!$P20))","v":0},{"$f":"IF(N($AJ18)=0,0,-PV($D$42,$AJ18,'Measure Summary'!$M20))","v":0},0,{"$f":"IF(OR($D18=Calcs!$A$42,$D18=Calcs!$A$24,$D18=Calcs!$A$56,$D18=Calcs!$A$21,$D18=Calcs!$A$27)=TRUE,'Measure Summary'!$F20/'Measure Summary'!$AA20*$AJ18,'Measure Summary'!$F20-SUM($X18:$AC18))+0.00001","v":1.0000000000000001E-5},null,{"$f":"IF($AI18=\"Inc\",'Measure Summary'!$AA20-(YEAR(TODAY())-'Measure Summary'!$AC20),\"\")","v":""},{"$f":"SUM('Measure Summary'!$G20:$H20)+SUM('Measure Summary'!$I20:$J20)*3412/1000000","v":0},"",{"$f":"IF(OR($D18=Calcs!$A$42,$D18=Calcs!$A$24,$D18=Calcs!$A$56,$D18=Calcs!$A$21,$D18=Calcs!$A$27)=TRUE,IF($AG18<-3.75,4,IF($AG18<0,ROUND('Measure Summary'!$AA20,0),$AG18)),ROUND(IF(N('Measure Summary'!$AA20)=0,0,'Measure Summary'!$AA20),0))","v":0},{"$f":"IF(OR($AI18=\"Full\",$AI18=\"\"),\"\",IF($AG18>=0,0,-$AG18/'Measure Summary'!$AA20))","v":""},"","","","",""]
[null,14,{"$f":"'Measure Summary'!C21","v":""},{"$f":"'Measure Summary'!E21","v":""},"","","",0,0,0,0,1.0000000000000001E-5,1.0000000000000001E-5,{"$f":"IF(E19=\"\",0,IF(OR($E19=\"AO\",$E19=\"NR\"),'Measure Summary'!AA21,VLOOKUP($D19,MeasureQCData,AO19,FALSE)))","v":0},null,{"$f":"IF($C19=\"\",0,IF(OR(MIN('Measure Summary'!I21,$AJ19)=0,OR(ElecUtility=\"\",ElecUtility=0,ElecUtility=\"<Select One>\"))=TRUE,0,1.1*'Measure Summary'!I21*HLOOKUP($AJ19,AvoidedCostTable,$E$38)))","v":0},{"$f":"IF($C19=\"\",0,IF(OR(MIN('Measure Summary'!J21,$AJ19)=0,OR(ElecUtility=\"\",ElecUtility=0,ElecUtility=\"<Select One>\"))=TRUE,0,'Measure Summary'!J21*HLOOKUP($AJ19,AvoidedCostTable,$E$38)*$AP19))","v":0},{"$f":"IF($C19=\"\",0,IF(OR(MIN('Measure Summary'!$K21,$AJ19)=0,OR(ElecUtility=\"\",ElecUtility=0,ElecUtility=\"<Select One>\"))=TRUE,0,'Measure Summary'!$K21*HLOOKUP($AJ19,AvoidedCostTable,$E$39,FALSE)))","v":0},{"$f":"IF($C19=\"\",0,IF('Measure Summary'!N21<>\"Natural Gas\",0,IF(MIN('Measure Summary'!G21,$AJ19)=0,0,'Measure Summary'!G21*HLOOKUP($AJ19,AvoidedCostTable,$E$40))))","v":0},{"$f":"IF($C19=\"\",0,IF('Measure Summary'!N21<>\"Natural Gas\",0,IF(MIN('Measure Summary'!H21,$AJ19)=0,0,'Measure Summary'!H21*HLOOKUP($AJ19,AvoidedCostTable,$E$40))))","v":0},{"$f":"IF(OR(N($P19+$Q19)=0,N($AJ19)=0)=TRUE,0,HLOOKUP($AJ19,AvoidedCostTable,12,FALSE)*('Measure Summary'!I21+'Measure Summary'!J21))","v":0},0,{"$f":"'Measure Summary'!G21+'Measure Summary'!H21","v":0},{"$f":"IF($C19=\"\",0,IF('Measure Summary'!N21<>\"Propane\",0,IF(MIN('Measure Summary'!G21+'Measure Summary'!H21,$AJ19)=0,0,-PV($D$42,$AJ19,('Measure Summary'!G21+'Measure Summary'!H21))*$D$45)))","v":0},{"$f":"IF($C19=\"\",0,IF('Measure Summary'!N21<>\"Fuel Oil\",0,IF(MIN('Measure Summary'!G21+'Measure Summary'!H21,$AJ19)=0,0,-PV($D$42,$AJ19,('Measure Summary'!G21+'Measure Summary'!H21))*$E$45)))","v":0},{"$f":"IF($C19=\"\",0,IF('Measure Summary'!N21<>\"Steam\",0,IF(MIN('Measure Summary'!G21+'Measure Summary'!H21,$AJ19)=0,0,-PV($D$42,$AJ19,('Measure Summary'!G21+'Measure Summary'!H21))*$F$45)))","v":0},{"$f":"IF($C19=\"\",0,IF('Measure Summary'!N21<>'Utility Info'!$B$19,0,IF(MIN('Measure Summary'!G21+'Measure Summary'!H21,$AJ19)=0,0,-PV($D$42,$AJ19,('Measure Summary'!G21+'Measure Summary'!H21))*$G$45)))","v":0},{"$f":"IF(OR(N('Measure Summary'!$L21)=0,N($AJ19)=0)=TRUE,0,-PV('TRC Test'!$D$42,'Measure Summary'!$AA$8,'Measure Summary'!$L21*'Measure Summary'!$P21))","v":0},{"$f":"IF(N($AJ19)=0,0,-PV($D$42,$AJ19,'Measure Summary'!$M21))","v":0},0,{"$f":"IF(OR($D19=Calcs!$A$42,$D19=Calcs!$A$24,$D19=Calcs!$A$56,$D19=Calcs!$A$21,$D19=Calcs!$A$27)=TRUE,'Measure Summary'!$F21/'Measure Summary'!$AA21*$AJ19,'Measure Summary'!$F21-SUM($X19:$AC19))+0.00001","v":1.0000000000000001E-5},null,{"$f":"IF($AI19=\"Inc\",'Measure Summary'!$AA21-(YEAR(TODAY())-'Measure Summary'!$AC21),\"\")","v":""},{"$f":"SUM('Measure Summary'!$G21:$H21)+SUM('Measure Summary'!$I21:$J21)*3412/1000000","v":0},"",{"$f":"IF(OR($D19=Calcs!$A$42,$D19=Calcs!$A$24,$D19=Calcs!$A$56,$D19=Calcs!$A$21,$D19=Calcs!$A$27)=TRUE,IF($AG19<-3.75,4,IF($AG19<0,ROUND('Measure Summary'!$AA21,0),$AG19)),ROUND(IF(N('Measure Summary'!$AA21)=0,0,'Measure Summary'!$AA21),0))","v":0},{"$f":"IF(OR($AI19=\"Full\",$AI19=\"\"),\"\",IF($AG19>=0,0,-$AG19/'Measure Summary'!$AA21))","v":""},"","","","",""]
[null,15,{"$f":"'Measure Summary'!C22","v":""},{"$f":"'Measure Summary'!E22","v":""},"","","",0,0,0,0,1.0000000000000001E-5,1.0000000000000001E-5,{"$f":"IF(E20=\"\",0,IF(OR($E20=\"AO\",$E20=\"NR\"),'Measure Summary'!AA22,VLOOKUP($D20,MeasureQCData,AO20,FALSE)))","v":0},null,{"$f":"IF($C20=\"\",0,IF(OR(MIN('Measure Summary'!I22,$AJ20)=0,OR(ElecUtility=\"\",ElecUtility=0,ElecUtility=\"<Select One>\"))=TRUE,0,1.1*'Measure Summary'!I22*HLOOKUP($AJ20,AvoidedCostTable,$E$38)))","v":0},{"$f":"IF($C20=\"\",0,IF(OR(MIN('Measure Summary'!J22,$AJ20)=0,OR(ElecUtility=\"\",ElecUtility=0,ElecUtility=\"<Select One>\"))=TRUE,0,'Measure Summary'!J22*HLOOKUP($AJ20,AvoidedCostTable,$E$38)*$AP20))","v":0},{"$f":"IF($C20=\"\",0,IF(OR(MIN('Measure Summary'!$K22,$AJ20)=0,OR(ElecUtility=\"\",ElecUtility=0,ElecUtility=\"<Select One>\"))=TRUE,0,'Measure Summary'!$K22*HLOOKUP($AJ20,AvoidedCostTable,$E$39,FALSE)))","v":0},{"$f":"IF($C20=\"\",0,IF('Measure Summary'!N22<>\"Natural Gas\",0,IF(MIN('Measure Summary'!G22,$AJ20)=0,0,'Measure Summary'!G22*HLOOKUP($AJ20,AvoidedCostTable,$E$40))))","v":0},{"$f":"IF($C20=\"\",0,IF('Measure Summary'!N22<>\"Natural Gas\",0,IF(MIN('Measure Summary'!H22,$AJ20)=0,0,'Measure Summary'!H22*HLOOKUP($AJ20,AvoidedCostTable,$E$40))))","v":0},{"$f":"IF(OR(N($P20+$Q20)=0,N($AJ20)=0)=TRUE,0,HLOOKUP($AJ20,AvoidedCostTable,12,FALSE)*('Measure Summary'!I22+'Measure Summary'!J22))","v":0},0,{"$f":"'Measure Summary'!G22+'Measure Summary'!H22","v":0},{"$f":"IF($C20=\"\",0,IF('Measure Summary'!N22<>\"Propane\",0,IF(MIN('Measure Summary'!G22+'Measure Summary'!H22,$AJ20)=0,0,-PV($D$42,$AJ20,('Measure Summary'!G22+'Measure Summary'!H22))*$D$45)))","v":0},{"$f":"IF($C20=\"\",0,IF('Measure Summary'!N22<>\"Fuel Oil\",0,IF(MIN('Measure Summary'!G22+'Measure Summary'!H22,$AJ20)=0,0,-PV($D$42,$AJ20,('Measure Summary'!G22+'Measure Summary'!H22))*$E$45)))","v":0},{"$f":"IF($C20=\"\",0,IF('Measure Summary'!N22<>\"Steam\",0,IF(MIN('Measure Summary'!G22+'Measure Summary'!H22,$AJ20)=0,0,-PV($D$42,$AJ20,('Measure Summary'!G22+'Measure Summary'!H22))*$F$45)))","v":0},{"$f":"IF($C20=\"\",0,IF('Measure Summary'!N22<>'Utility Info'!$B$19,0,IF(MIN('Measure Summary'!G22+'Measure Summary'!H22,$AJ20)=0,0,-PV($D$42,$AJ20,('Measure Summary'!G22+'Measure Summary'!H22))*$G$45)))","v":0},{"$f":"IF(OR(N('Measure Summary'!$L22)=0,N($AJ20)=0)=TRUE,0,-PV('TRC Test'!$D$42,'Measure Summary'!$AA$8,'Measure Summary'!$L22*'Measure Summary'!$P22))","v":0},{"$f":"IF(N($AJ20)=0,0,-PV($D$42,$AJ20,'Measure Summary'!$M22))","v":0},0,{"$f":"IF(OR($D20=Calcs!$A$42,$D20=Calcs!$A$24,$D20=Calcs!$A$56,$D20=Calcs!$A$21,$D20=Calcs!$A$27)=TRUE,'Measure Summary'!$F22/'Measure Summary'!$AA22*$AJ20,'Measure Summary'!$F22-SUM($X20:$AC20))+0.00001","v":1.0000000000000001E-5},null,{"$f":"IF($AI20=\"Inc\",'Measure Summary'!$AA22-(YEAR(TODAY())-'Measure Summary'!$AC22),\"\")","v":""},{"$f":"SUM('Measure Summary'!$G22:$H22)+SUM('Measure Summary'!$I22:$J22)*3412/1000000","v":0},"",{"$f":"IF(OR($D20=Calcs!$A$42,$D20=Calcs!$A$24,$D20=Calcs!$A$56,$D20=Calcs!$A$21,$D20=Calcs!$A$27)=TRUE,IF($AG20<-3.75,4,IF($AG20<0,ROUND('Measure Summary'!$AA22,0),$AG20)),ROUND(IF(N('Measure Summary'!$AA22)=0,0,'Measure Summary'!$AA22),0))","v":0},{"$f":"IF(OR($AI20=\"Full\",$AI20=\"\"),\"\",IF($AG20>=0,0,-$AG20/'Measure Summary'!$AA22))","v":""},"","","","",""]
[]
[null,16,{"$f":"'Measure Summary'!C24","v":""},{"$f":"'Measure Summary'!E24","v":""},"",{"$f":"IF(D22=\"\",\"\",IF(OR(E22=\"NR\",E22=\"ER\",E22=\"SC\"),VLOOKUP(D22,MeasureQCData,29,FALSE),\"\"))","v":""},{"$f":"IF(D22=\"\",\"\",IF(OR(E22=\"NR\",E22=\"ER\",E22=\"SC\"),VLOOKUP(D22,MeasureQCData,51,FALSE),\"\"))","v":""},{"$f":"IF(E22=\"\",0,IF($E22=\"AO\",1,VLOOKUP($D22,MeasureQCData,AM22,FALSE)))","v":0},{"$f":"IF(E22=\"\",0,IF($E22=\"AO\",1,VLOOKUP($D22,MeasureQCData,AN22,FALSE)))","v":0},0,{"$f":"IF(H22=0,AD22,IF(AD22*H22<0,0,AD22*H22))","v":0},1.0000000000000001E-5,{"$f":"IF(I22=0,AE22,I22*AE22)","v":1.0000000000000001E-5},{"$f":"IF(E22=\"\",0,IF(OR($E22=\"AO\",$E22=\"NR\"),'Measure Summary'!AA24,VLOOKUP($D22,MeasureQCData,AO22,FALSE)))","v":0},null,{"$f":"IF($C22=\"\",0,IF(OR(MIN('Measure Summary'!I24,$AJ22)=0,OR(ElecUtility=\"\",ElecUtility=0,ElecUtility=\"<Select One>\"))=TRUE,0,1.1*'Measure Summary'!I24*HLOOKUP($AJ22,AvoidedCostTable,$E$38)))","v":0},{"$f":"IF($C22=\"\",0,IF(OR(MIN('Measure Summary'!J24,$AJ22)=0,OR(ElecUtility=\"\",ElecUtility=0,ElecUtility=\"<Select One>\"))=TRUE,0,'Measure Summary'!J24*HLOOKUP($AJ22,AvoidedCostTable,$E$38)*$AP22))","v":0},{"$f":"IF($C22=\"\",0,IF(OR(MIN('Measure Summary'!$K24,$AJ22)=0,OR(ElecUtility=\"\",ElecUtility=0,ElecUtility=\"<Select One>\"))=TRUE,0,'Measure Summary'!$K24*HLOOKUP($AJ22,AvoidedCostTable,$E$39,FALSE)))","v":0},{"$f":"IF($C22=\"\",0,IF('Measure Summary'!N24<>\"Natural Gas\",0,IF(MIN('Measure Summary'!G24,$AJ22)=0,0,'Measure Summary'!G24*HLOOKUP($AJ22,AvoidedCostTable,$E$40))))","v":0},{"$f":"IF($C22=\"\",0,IF('Measure Summary'!N24<>\"Natural Gas\",0,IF(MIN('Measure Summary'!H24,$AJ22)=0,0,'Measure Summary'!H24*HLOOKUP($AJ22,AvoidedCostTable,$E$40))))","v":0},{"$f":"IF(OR(N($P22+$Q22)=0,N($AJ22)=0)=TRUE,0,HLOOKUP($AJ22,AvoidedCostTable,12,FALSE)*('Measure Summary'!I24+'Measure Summary'!J24))","v":0},0,{"$f":"'Measure Summary'!G24+'Measure Summary'!H24","v":0},{"$f":"IF($C22=\"\",0,IF('Measure Summary'!N24<>\"Propane\",0,IF(MIN('Measure Summary'!G24+'Measure Summary'!H24,$AJ22)=0,0,-PV($D$42,$AJ22,('Measure Summary'!G24+'Measure Summary'!H24))*$D$45)))","v":0},{"$f":"IF($C22=\"\",0,IF('Measure Summary'!N24<>\"Fuel Oil\",0,IF(MIN('Measure Summary'!G24+'Measure Summary'!H24,$AJ22)=0,0,-PV($D$42,$AJ22,('Measure Summary'!G24+'Measure Summary'!H24))*$E$45)))","v":0},{"$f":"IF($C22=\"\",0,IF('Measure Summary'!N24<>\"Steam\",0,IF(MIN('Measure Summary'!G24+'Measure Summary'!H24,$AJ22)=0,0,-PV($D$42,$AJ22,('Measure Summary'!G24+'Measure Summary'!H24))*$F$45)))","v":0},{"$f":"IF($C22=\"\",0,IF('Measure Summary'!N24<>'Utility Info'!$B$19,0,IF(MIN('Measure Summary'!G24+'Measure Summary'!H24,$AJ22)=0,0,-PV($D$42,$AJ22,('Measure Summary'!G24+'Measure Summary'!H24))*$G$45)))","v":0},{"$f":"IF(OR(N('Measure Summary'!$L24)=0,N($AJ22)=0)=TRUE,0,-PV('TRC Test'!$D$42,'Measure Summary'!$AA$8,'Measure Summary'!$L24*'Measure Summary'!$P24))","v":0},{"$f":"IF(N($AJ22)=0,0,-PV($D$42,$AJ22,'Measure Summary'!$M24))","v":0},0,{"$f":"IF(OR($D22=Calcs!$A$42,$D22=Calcs!$A$24,$D22=Calcs!$A$56,$D22=Calcs!$A$21,$D22=Calcs!$A$27)=TRUE,'Measure Summary'!$F24/'Measure Summary'!$AA24*$AJ22,'Measure Summary'!$F24-SUM($X22:$AC22))+0.00001","v":1.0000000000000001E-5},null,{"$f":"IF($AI22=\"Inc\",'Measure Summary'!$AA24-(YEAR(TODAY())-'Measure Summary'!$AC24),\"\")","v":""},{"$f":"SUM('Measure Summary'!$G24:$H24)+SUM('Measure Summary'!$I24:$J24)*3412/1000000","v":0},{"$f":"IF($D22=\"\",\"\",VLOOKUP($D22,MeasureQCData,27,FALSE))","v":""},{"$f":"IF(OR($D22=Calcs!$A$42,$D22=Calcs!$A$24,$D22=Calcs!$A$56,$D22=Calcs!$A$21,$D22=Calcs!$A$27)=TRUE,IF($AG22<-3.75,4,IF($AG22<0,ROUND('Measure Summary'!$AA24,0),$AG22)),ROUND(IF(N('Measure Summary'!$AA24)=0,0,'Measure Summary'!$AA24),0))","v":0},{"$f":"IF(OR($AI22=\"Full\",$AI22=\"\"),\"\",IF($AG22>=0,0,-$AG22/'Measure Summary'!$AA24))","v":""},{"$f":"IF($D22=\"\",\"\",IF(AND(VLOOKUP($D22,MeasureQCData,28,FALSE)=\"Y\",$AK22>0.249),\"Y\",\"N\"))","v":""},"",{"$f":"IF($E22=\"NR\",51,IF($E22=\"SC\",52,IF($E22=\"ER\",$AG22+52,\"\")))","v":""},{"$f":"IF($E22=\"NR\",73,IF($E22=\"SC\",74,IF($E22=\"ER\",$AG22+74,\"\")))","v":""},{"$f":"IF($D$38=\"Upstate\",VLOOKUP($D22,MeasureQCData,96,FALSE),IF($D$38=\"NYC\",VLOOKUP($D22,MeasureQCData,97,FALSE),IF($D$38=\"Lower Hudson\",VLOOKUP($D22,MeasureQCData,98,FALSE),\"\")))","v":""}]
[null,17,{"$f":"'Measure Summary'!C25","v":""},{"$f":"'Measure Summary'!E25","v":""},"","","",0,0,0,0,1.0000000000000001E-5,1.0000000000000001E-5,{"$f":"IF(E23=\"\",0,IF(OR($E23=\"AO\",$E23=\"NR\"),'Measure Summary'!AA25,VLOOKUP($D23,MeasureQCData,AO23,FALSE)))","v":0},null,{"$f":"IF($C23=\"\",0,IF(OR(MIN('Measure Summary'!I25,$AJ23)=0,OR(ElecUtility=\"\",ElecUtility=0,ElecUtility=\"<Select One>\"))=TRUE,0,1.1*'Measure Summary'!I25*HLOOKUP($AJ23,AvoidedCostTable,$E$38)))","v":0},{"$f":"IF($C23=\"\",0,IF(OR(MIN('Measure Summary'!J25,$AJ23)=0,OR(ElecUtility=\"\",ElecUtility=0,ElecUtility=\"<Select One>\"))=TRUE,0,'Measure Summary'!J25*HLOOKUP($AJ23,AvoidedCostTable,$E$38)*$AP23))","v":0},{"$f":"IF($C23=\"\",0,IF(OR(MIN('Measure Summary'!$K25,$AJ23)=0,OR(ElecUtility=\"\",ElecUtility=0,ElecUtility=\"<Select One>\"))=TRUE,0,'Measure Summary'!$K25*HLOOKUP($AJ23,AvoidedCostTable,$E$39,FALSE)))","v":0},{"$f":"IF($C23=\"\",0,IF('Measure Summary'!N25<>\"Natural Gas\",0,IF(MIN('Measure Summary'!G25,$AJ23)=0,0,'Measure Summary'!G25*HLOOKUP($AJ23,AvoidedCostTable,$E$40))))","v":0},{"$f":"IF($C23=\"\",0,IF('Measure Summary'!N25<>\"Natural Gas\",0,IF(MIN('Measure Summary'!H25,$AJ23)=0,0,'Measure Summary'!H25*HLOOKUP($AJ23,AvoidedCostTable,$E$40))))","v":0},{"$f":"IF(OR(N($P23+$Q23)=0,N($AJ23)=0)=TRUE,0,HLOOKUP($AJ23,AvoidedCostTable,12,FALSE)*('Measure Summary'!I25+'Measure Summary'!J25))","v":0},0,{"$f":"'Measure Summary'!G25+'Measure Summary'!H25","v":0},{"$f":"IF($C23=\"\",0,IF('Measure Summary'!N25<>\"Propane\",0,IF(MIN('Measure Summary'!G25+'Measure Summary'!H25,$AJ23)=0,0,-PV($D$42,$AJ23,('Measure Summary'!G25+'Measure Summary'!H25))*$D$45)))","v":0},{"$f":"IF($C23=\"\",0,IF('Measure Summary'!N25<>\"Fuel Oil\",0,IF(MIN('Measure Summary'!G25+'Measure Summary'!H25,$AJ23)=0,0,-PV($D$42,$AJ23,('Measure Summary'!G25+'Measure Summary'!H25))*$E$45)))","v":0},{"$f":"IF($C23=\"\",0,IF('Measure Summary'!N25<>\"Steam\",0,IF(MIN('Measure Summary'!G25+'Measure Summary'!H25,$AJ23)=0,0,-PV($D$42,$AJ23,('Measure Summary'!G25+'Measure Summary'!H25))*$F$45)))","v":0},{"$f":"IF($C23=\"\",0,IF('Measure Summary'!N25<>'Utility Info'!$B$19,0,IF(MIN('Measure Summary'!G25+'Measure Summary'!H25,$AJ23)=0,0,-PV($D$42,$AJ23,('Measure Summary'!G25+'Measure Summary'!H25))*$G$45)))","v":0},{"$f":"IF(OR(N('Measure Summary'!$L25)=0,N($AJ23)=0)=TRUE,0,-PV('TRC Test'!$D$42,'Measure Summary'!$AA$8,'Measure Summary'!$L25*'Measure Summary'!$P25))","v":0},{"$f":"IF(N($AJ23)=0,0,-PV($D$42,$AJ23,'Measure Summary'!$M25))","v":0},0,{"$f":"IF(OR($D23=Calcs!$A$42,$D23=Calcs!$A$24,$D23=Calcs!$A$56,$D23=Calcs!$A$21,$D23=Calcs!$A$27)=TRUE,'Measure Summary'!$F25/'Measure Summary'!$AA25*$AJ23,'Measure Summary'!$F25-SUM($X23:$AC23))+0.00001","v":1.0000000000000001E-5},null,{"$f":"IF($AI23=\"Inc\",'Measure Summary'!$AA25-(YEAR(TODAY())-'Measure Summary'!$AC25),\"\")","v":""},{"$f":"SUM('Measure Summary'!$G25:$H25)+SUM('Measure Summary'!$I25:$J25)*3412/1000000","v":0},"",{"$f":"IF(OR($D23=Calcs!$A$42,$D23=Calcs!$A$24,$D23=Calcs!$A$56,$D23=Calcs!$A$21,$D23=Calcs!$A$27)=TRUE,IF($AG23<-3.75,4,IF($AG23<0,ROUND('Measure Summary'!$AA25,0),$AG23)),ROUND(IF(N('Measure Summary'!$AA25)=0,0,'Measure Summary'!$AA25),0))","v":0},{"$f":"IF(OR($AI23=\"Full\",$AI23=\"\"),\"\",IF($AG23>=0,0,-$AG23/'Measure Summary'!$AA25))","v":""},"","","","",""]
[null,18,{"$f":"'Measure Summary'!C26","v":""},{"$f":"'Measure Summary'!E26","v":""},"","","",0,0,0,0,1.0000000000000001E-5,1.0000000000000001E-5,{"$f":"IF(E24=\"\",0,IF(OR($E24=\"AO\",$E24=\"NR\"),'Measure Summary'!AA26,VLOOKUP($D24,MeasureQCData,AO24,FALSE)))","v":0},null,{"$f":"IF($C24=\"\",0,IF(OR(MIN('Measure Summary'!I26,$AJ24)=0,OR(ElecUtility=\"\",ElecUtility=0,ElecUtility=\"<Select One>\"))=TRUE,0,1.1*'Measure Summary'!I26*HLOOKUP($AJ24,AvoidedCostTable,$E$38)))","v":0},{"$f":"IF($C24=\"\",0,IF(OR(MIN('Measure Summary'!J26,$AJ24)=0,OR(ElecUtility=\"\",ElecUtility=0,ElecUtility=\"<Select One>\"))=TRUE,0,'Measure Summary'!J26*HLOOKUP($AJ24,AvoidedCostTable,$E$38)*$AP24))","v":0},{"$f":"IF($C24=\"\",0,IF(OR(MIN('Measure Summary'!$K26,$AJ24)=0,OR(ElecUtility=\"\",ElecUtility=0,ElecUtility=\"<Select One>\"))=TRUE,0,'Measure Summary'!$K26*HLOOKUP($AJ24,AvoidedCostTable,$E$39,FALSE)))","v":0},{"$f":"IF($C24=\"\",0,IF('Measure Summary'!N26<>\"Natural Gas\",0,IF(MIN('Measure Summary'!G26,$AJ24)=0,0,'Measure Summary'!G26*HLOOKUP($AJ24,AvoidedCostTable,$E$40))))","v":0},{"$f":"IF($C24=\"\",0,IF('Measure Summary'!N26<>\"Natural Gas\",0,IF(MIN('Measure Summary'!H26,$AJ24)=0,0,'Measure Summary'!H26*HLOOKUP($AJ24,AvoidedCostTable,$E$40))))","v":0},{"$f":"IF(OR(N($P24+$Q24)=0,N($AJ24)=0)=TRUE,0,HLOOKUP($AJ24,AvoidedCostTable,12,FALSE)*('Measure Summary'!I26+'Measure Summary'!J26))","v":0},0,{"$f":"'Measure Summary'!G26+'Measure Summary'!H26","v":0},{"$f":"IF($C24=\"\",0,IF('Measure Summary'!N26<>\"Propane\",0,IF(MIN('Measure Summary'!G26+'Measure Summary'!H26,$AJ24)=0,0,-PV($D$42,$AJ24,('Measure Summary'!G26+'Measure Summary'!H26))*$D$45)))","v":0},{"$f":"IF($C24=\"\",0,IF('Measure Summary'!N26<>\"Fuel Oil\",0,IF(MIN('Measure Summary'!G26+'Measure Summary'!H26,$AJ24)=0,0,-PV($D$42,$AJ24,('Measure Summary'!G26+'Measure Summary'!H26))*$E$45)))","v":0},{"$f":"IF($C24=\"\",0,IF('Measure Summary'!N26<>\"Steam\",0,IF(MIN('Measure Summary'!G26+'Measure Summary'!H26,$AJ24)=0,0,-PV($D$42,$AJ24,('Measure Summary'!G26+'Measure Summary'!H26))*$F$45)))","v":0},{"$f":"IF($C24=\"\",0,IF('Measure Summary'!N26<>'Utility Info'!$B$19,0,IF(MIN('Measure Summary'!G26+'Measure Summary'!H26,$AJ24)=0,0,-PV($D$42,$AJ24,('Measure Summary'!G26+'Measure Summary'!H26))*$G$45)))","v":0},{"$f":"IF(OR(N('Measure Summary'!$L26)=0,N($AJ24)=0)=TRUE,0,-PV('TRC Test'!$D$42,'Measure Summary'!$AA$8,'Measure Summary'!$L26*'Measure Summary'!$P26))","v":0},{"$f":"IF(N($AJ24)=0,0,-PV($D$42,$AJ24,'Measure Summary'!$M26))","v":0},0,{"$f":"IF(OR($D24=Calcs!$A$42,$D24=Calcs!$A$24,$D24=Calcs!$A$56,$D24=Calcs!$A$21,$D24=Calcs!$A$27)=TRUE,'Measure Summary'!$F26/'Measure Summary'!$AA26*$AJ24,'Measure Summary'!$F26-SUM($X24:$AC24))+0.00001","v":1.0000000000000001E-5},null,{"$f":"IF($AI24=\"Inc\",'Measure Summary'!$AA26-(YEAR(TODAY())-'Measure Summary'!$AC26),\"\")","v":""},{"$f":"SUM('Measure Summary'!$G26:$H26)+SUM('Measure Summary'!$I26:$J26)*3412/1000000","v":0},"",{"$f":"IF(OR($D24=Calcs!$A$42,$D24=Calcs!$A$24,$D24=Calcs!$A$56,$D24=Calcs!$A$21,$D24=Calcs!$A$27)=TRUE,IF($AG24<-3.75,4,IF($AG24<0,ROUND('Measure Summary'!$AA26,0),$AG24)),ROUND(IF(N('Measure Summary'!$AA26)=0,0,'Measure Summary'!$AA26),0))","v":0},{"$f":"IF(OR($AI24=\"Full\",$AI24=\"\"),\"\",IF($AG24>=0,0,-$AG24/'Measure Summary'!$AA26))","v":""},"","","","",""]
[null,19,{"$f":"'Measure Summary'!C27","v":""},{"$f":"'Measure Summary'!E27","v":""},"","","",0,0,0,0,1.0000000000000001E-5,1.0000000000000001E-5,{"$f":"IF(E25=\"\",0,IF(OR($E25=\"AO\",$E25=\"NR\"),'Measure Summary'!AA27,VLOOKUP($D25,MeasureQCData,AO25,FALSE)))","v":0},null,{"$f":"IF($C25=\"\",0,IF(OR(MIN('Measure Summary'!I27,$AJ25)=0,OR(ElecUtility=\"\",ElecUtility=0,ElecUtility=\"<Select One>\"))=TRUE,0,1.1*'Measure Summary'!I27*HLOOKUP($AJ25,AvoidedCostTable,$E$38)))","v":0},{"$f":"IF($C25=\"\",0,IF(OR(MIN('Measure Summary'!J27,$AJ25)=0,OR(ElecUtility=\"\",ElecUtility=0,ElecUtility=\"<Select One>\"))=TRUE,0,'Measure Summary'!J27*HLOOKUP($AJ25,AvoidedCostTable,$E$38)*$AP25))","v":0},{"$f":"IF($C25=\"\",0,IF(OR(MIN('Measure Summary'!$K27,$AJ25)=0,OR(ElecUtility=\"\",ElecUtility=0,ElecUtility=\"<Select One>\"))=TRUE,0,'Measure Summary'!$K27*HLOOKUP($AJ25,AvoidedCostTable,$E$39,FALSE)))","v":0},{"$f":"IF($C25=\"\",0,IF('Measure Summary'!N27<>\"Natural Gas\",0,IF(MIN('Measure Summary'!G27,$AJ25)=0,0,'Measure Summary'!G27*HLOOKUP($AJ25,AvoidedCostTable,$E$40))))","v":0},{"$f":"IF($C25=\"\",0,IF('Measure Summary'!N27<>\"Natural Gas\",0,IF(MIN('Measure Summary'!H27,$AJ25)=0,0,'Measure Summary'!H27*HLOOKUP($AJ25,AvoidedCostTable,$E$40))))","v":0},{"$f":"IF(OR(N($P25+$Q25)=0,N($AJ25)=0)=TRUE,0,HLOOKUP($AJ25,AvoidedCostTable,12,FALSE)*('Measure Summary'!I27+'Measure Summary'!J27))","v":0},0,{"$f":"'Measure Summary'!G27+'Measure Summary'!H27","v":0},{"$f":"IF($C25=\"\",0,IF('Measure Summary'!N27<>\"Propane\",0,IF(MIN('Measure Summary'!G27+'Measure Summary'!H27,$AJ25)=0,0,-PV($D$42,$AJ25,('Measure Summary'!G27+'Measure Summary'!H27))*$D$45)))","v":0},{"$f":"IF($C25=\"\",0,IF('Measure Summary'!N27<>\"Fuel Oil\",0,IF(MIN('Measure Summary'!G27+'Measure Summary'!H27,$AJ25)=0,0,-PV($D$42,$AJ25,('Measure Summary'!G27+'Measure Summary'!H27))*$E$45)))","v":0},{"$f":"IF($C25=\"\",0,IF('Measure Summary'!N27<>\"Steam\",0,IF(MIN('Measure Summary'!G27+'Measure Summary'!H27,$AJ25)=0,0,-PV($D$42,$AJ25,('Measure Summary'!G27+'Measure Summary'!H27))*$F$45)))","v":0},{"$f":"IF($C25=\"\",0,IF('Measure Summary'!N27<>'Utility Info'!$B$19,0,IF(MIN('Measure Summary'!G27+'Measure Summary'!H27,$AJ25)=0,0,-PV($D$42,$AJ25,('Measure Summary'!G27+'Measure Summary'!H27))*$G$45)))","v":0},{"$f":"IF(OR(N('Measure Summary'!$L27)=0,N($AJ25)=0)=TRUE,0,-PV('TRC Test'!$D$42,'Measure Summary'!$AA$8,'Measure Summary'!$L27*'Measure Summary'!$P27))","v":0},{"$f":"IF(N($AJ25)=0,0,-PV($D$42,$AJ25,'Measure Summary'!$M27))","v":0},0,{"$f":"IF(OR($D25=Calcs!$A$42,$D25=Calcs!$A$24,$D25=Calcs!$A$56,$D25=Calcs!$A$21,$D25=Calcs!$A$27)=TRUE,'Measure Summary'!$F27/'Measure Summary'!$AA27*$AJ25,'Measure Summary'!$F27-SUM($X25:$AC25))+0.00001","v":1.0000000000000001E-5},null,{"$f":"IF($AI25=\"Inc\",'Measure Summary'!$AA27-(YEAR(TODAY())-'Measure Summary'!$AC27),\"\")","v":""},{"$f":"SUM('Measure Summary'!$G27:$H27)+SUM('Measure Summary'!$I27:$J27)*3412/1000000","v":0},"",{"$f":"IF(OR($D25=Calcs!$A$42,$D25=Calcs!$A$24,$D25=Calcs!$A$56,$D25=Calcs!$A$21,$D25=Calcs!$A$27)=TRUE,IF($AG25<-3.75,4,IF($AG25<0,ROUND('Measure Summary'!$AA27,0),$AG25)),ROUND(IF(N('Measure Summary'!$AA27)=0,0,'Measure Summary'!$AA27),0))","v":0},{"$f":"IF(OR($AI25=\"Full\",$AI25=\"\"),\"\",IF($AG25>=0,0,-$AG25/'Measure Summary'!$AA27))","v":""},"","","","",""]
[null,20,{"$f":"'Measure Summary'!C28","v":""},{"$f":"'Measure Summary'!E28","v":""},"","","",0,0,0,0,1.0000000000000001E-5,1.0000000000000001E-5,{"$f":"IF(E26=\"\",0,IF(OR($E26=\"AO\",$E26=\"NR\"),'Measure Summary'!AA28,VLOOKUP($D26,MeasureQCData,AO26,FALSE)))","v":0},null,{"$f":"IF($C26=\"\",0,IF(OR(MIN('Measure Summary'!I28,$AJ26)=0,OR(ElecUtility=\"\",ElecUtility=0,ElecUtility=\"<Select One>\"))=TRUE,0,1.1*'Measure Summary'!I28*HLOOKUP($AJ26,AvoidedCostTable,$E$38)))","v":0},{"$f":"IF($C26=\"\",0,IF(OR(MIN('Measure Summary'!J28,$AJ26)=0,OR(ElecUtility=\"\",ElecUtility=0,ElecUtility=\"<Select One>\"))=TRUE,0,'Measure Summary'!J28*HLOOKUP($AJ26,AvoidedCostTable,$E$38)*$AP26))","v":0},{"$f":"IF($C26=\"\",0,IF(OR(MIN('Measure Summary'!$K28,$AJ26)=0,OR(ElecUtility=\"\",ElecUtility=0,ElecUtility=\"<Select One>\"))=TRUE,0,'Measure Summary'!$K28*HLOOKUP($AJ26,AvoidedCostTable,$E$39,FALSE)))","v":0},{"$f":"IF($C26=\"\",0,IF('Measure Summary'!N28<>\"Natural Gas\",0,IF(MIN('Measure Summary'!G28,$AJ26)=0,0,'Measure Summary'!G28*HLOOKUP($AJ26,AvoidedCostTable,$E$40))))","v":0},{"$f":"IF($C26=\"\",0,IF('Measure Summary'!N28<>\"Natural Gas\",0,IF(MIN('Measure Summary'!H28,$AJ26)=0,0,'Measure Summary'!H28*HLOOKUP($AJ26,AvoidedCostTable,$E$40))))","v":0},{"$f":"IF(OR(N($P26+$Q26)=0,N($AJ26)=0)=TRUE,0,HLOOKUP($AJ26,AvoidedCostTable,12,FALSE)*('Measure Summary'!I28+'Measure Summary'!J28))","v":0},0,{"$f":"'Measure Summary'!G28+'Measure Summary'!H28","v":0},{"$f":"IF($C26=\"\",0,IF('Measure Summary'!N28<>\"Propane\",0,IF(MIN('Measure Summary'!G28+'Measure Summary'!H28,$AJ26)=0,0,-PV($D$42,$AJ26,('Measure Summary'!G28+'Measure Summary'!H28))*$D$45)))","v":0},{"$f":"IF($C26=\"\",0,IF('Measure Summary'!N28<>\"Fuel Oil\",0,IF(MIN('Measure Summary'!G28+'Measure Summary'!H28,$AJ26)=0,0,-PV($D$42,$AJ26,('Measure Summary'!G28+'Measure Summary'!H28))*$E$45)))","v":0},{"$f":"IF($C26=\"\",0,IF('Measure Summary'!N28<>\"Steam\",0,IF(MIN('Measure Summary'!G28+'Measure Summary'!H28,$AJ26)=0,0,-PV($D$42,$AJ26,('Measure Summary'!G28+'Measure Summary'!H28))*$F$45)))","v":0},{"$f":"IF($C26=\"\",0,IF('Measure Summary'!N28<>'Utility Info'!$B$19,0,IF(MIN('Measure Summary'!G28+'Measure Summary'!H28,$AJ26)=0,0,-PV($D$42,$AJ26,('Measure Summary'!G28+'Measure Summary'!H28))*$G$45)))","v":0},{"$f":"IF(OR(N('Measure Summary'!$L28)=0,N($AJ26)=0)=TRUE,0,-PV('TRC Test'!$D$42,'Measure Summary'!$AA$8,'Measure Summary'!$L28*'Measure Summary'!$P28))","v":0},{"$f":"IF(N($AJ26)=0,0,-PV($D$42,$AJ26,'Measure Summary'!$M28))","v":0},0,{"$f":"IF(OR($D26=Calcs!$A$42,$D26=Calcs!$A$24,$D26=Calcs!$A$56,$D26=Calcs!$A$21,$D26=Calcs!$A$27)=TRUE,'Measure Summary'!$F28/'Measure Summary'!$AA28*$AJ26,'Measure Summary'!$F28-SUM($X26:$AC26))+0.00001","v":1.0000000000000001E-5},null,{"$f":"IF($AI26=\"Inc\",'Measure Summary'!$AA28-(YEAR(TODAY())-'Measure Summary'!$AC28),\"\")","v":""},{"$f":"SUM('Measure Summary'!$G28:$H28)+SUM('Measure Summary'!$I28:$J28)*3412/1000000","v":0},"",{"$f":"IF(OR($D26=Calcs!$A$42,$D26=Calcs!$A$24,$D26=Calcs!$A$56,$D26=Calcs!$A$21,$D26=Calcs!$A$27)=TRUE,IF($AG26<-3.75,4,IF($AG26<0,ROUND('Measure Summary'!$AA28,0),$AG26)),ROUND(IF(N('Measure Summary'!$AA28)=0,0,'Measure Summary'!$AA28),0))","v":0},{"$f":"IF(OR($AI26=\"Full\",$AI26=\"\"),\"\",IF($AG26>=0,0,-$AG26/'Measure Summary'!$AA28))","v":""},"","","","",""]
[null,21,{"$f":"'Measure Summary'!C29","v":""},{"$f":"'Measure Summary'!E29","v":""},"","","",0,0,0,0,1.0000000000000001E-5,1.0000000000000001E-5,{"$f":"IF(E27=\"\",0,IF(OR($E27=\"AO\",$E27=\"NR\"),'Measure Summary'!AA29,VLOOKUP($D27,MeasureQCData,AO27,FALSE)))","v":0},null,{"$f":"IF($C27=\"\",0,IF(OR(MIN('Measure Summary'!I29,$AJ27)=0,OR(ElecUtility=\"\",ElecUtility=0,ElecUtility=\"<Select One>\"))=TRUE,0,1.1*'Measure Summary'!I29*HLOOKUP($AJ27,AvoidedCostTable,$E$38)))","v":0},{"$f":"IF($C27=\"\",0,IF(OR(MIN('Measure Summary'!J29,$AJ27)=0,OR(ElecUtility=\"\",ElecUtility=0,ElecUtility=\"<Select One>\"))=TRUE,0,'Measure Summary'!J29*HLOOKUP($AJ27,AvoidedCostTable,$E$38)*$AP27))","v":0},{"$f":"IF($C27=\"\",0,IF(OR(MIN('Measure Summary'!$K29,$AJ27)=0,OR(ElecUtility=\"\",ElecUtility=0,ElecUtility=\"<Select One>\"))=TRUE,0,'Measure Summary'!$K29*HLOOKUP($AJ27,AvoidedCostTable,$E$39,FALSE)))","v":0},{"$f":"IF($C27=\"\",0,IF('Measure Summary'!N29<>\"Natural Gas\",0,IF(MIN('Measure Summary'!G29,$AJ27)=0,0,'Measure Summary'!G29*HLOOKUP($AJ27,AvoidedCostTable,$E$40))))","v":0},{"$f":"IF($C27=\"\",0,IF('Measure Summary'!N29<>\"Natural Gas\",0,IF(MIN('Measure Summary'!H29,$AJ27)=0,0,'Measure Summary'!H29*HLOOKUP($AJ27,AvoidedCostTable,$E$40))))","v":0},{"$f":"IF(OR(N($P27+$Q27)=0,N($AJ27)=0)=TRUE,0,HLOOKUP($AJ27,AvoidedCostTable,12,FALSE)*('Measure Summary'!I29+'Measure Summary'!J29))","v":0},0,{"$f":"'Measure Summary'!G29+'Measure Summary'!H29","v":0},{"$f":"IF($C27=\"\",0,IF('Measure Summary'!N29<>\"Propane\",0,IF(MIN('Measure Summary'!G29+'Measure Summary'!H29,$AJ27)=0,0,-PV($D$42,$AJ27,('Measure Summary'!G29+'Measure Summary'!H29))*$D$45)))","v":0},{"$f":"IF($C27=\"\",0,IF('Measure Summary'!N29<>\"Fuel Oil\",0,IF(MIN('Measure Summary'!G29+'Measure Summary'!H29,$AJ27)=0,0,-PV($D$42,$AJ27,('Measure Summary'!G29+'Measure Summary'!H29))*$E$45)))","v":0},{"$f":"IF($C27=\"\",0,IF('Measure Summary'!N29<>\"Steam\",0,IF(MIN('Measure Summary'!G29+'Measure Summary'!H29,$AJ27)=0,0,-PV($D$42,$AJ27,('Measure Summary'!G29+'Measure Summary'!H29))*$F$45)))","v":0},{"$f":"IF($C27=\"\",0,IF('Measure Summary'!N29<>'Utility Info'!$B$19,0,IF(MIN('Measure Summary'!G29+'Measure Summary'!H29,$AJ27)=0,0,-PV($D$42,$AJ27,('Measure Summary'!G29+'Measure Summary'!H29))*$G$45)))","v":0},{"$f":"IF(OR(N('Measure Summary'!$L29)=0,N($AJ27)=0)=TRUE,0,-PV('TRC Test'!$D$42,'Measure Summary'!$AA$8,'Measure Summary'!$L29*'Measure Summary'!$P29))","v":0},{"$f":"IF(N($AJ27)=0,0,-PV($D$42,$AJ27,'Measure Summary'!$M29))","v":0},0,{"$f":"IF(OR($D27=Calcs!$A$42,$D27=Calcs!$A$24,$D27=Calcs!$A$56,$D27=Calcs!$A$21,$D27=Calcs!$A$27)=TRUE,'Measure Summary'!$F29/'Measure Summary'!$AA29*$AJ27,'Measure Summary'!$F29-SUM($X27:$AC27))+0.00001","v":1.0000000000000001E-5},null,{"$f":"IF($AI27=\"Inc\",'Measure Summary'!$AA29-(YEAR(TODAY())-'Measure Summary'!$AC29),\"\")","v":""},{"$f":"SUM('Measure Summary'!$G29:$H29)+SUM('Measure Summary'!$I29:$J29)*3412/1000000","v":0},"",{"$f":"IF(OR($D27=Calcs!$A$42,$D27=Calcs!$A$24,$D27=Calcs!$A$56,$D27=Calcs!$A$21,$D27=Calcs!$A$27)=TRUE,IF($AG27<-3.75,4,IF($AG27<0,ROUND('Measure Summary'!$AA29,0),$AG27)),ROUND(IF(N('Measure Summary'!$AA29)=0,0,'Measure Summary'!$AA29),0))","v":0},{"$f":"IF(OR($AI27=\"Full\",$AI27=\"\"),\"\",IF($AG27>=0,0,-$AG27/'Measure Summary'!$AA29))","v":""},"","","","",""]
[null,22,{"$f":"'Measure Summary'!C30","v":""},{"$f":"'Measure Summary'!E30","v":""},"","","",0,0,0,0,1.0000000000000001E-5,1.0000000000000001E-5,{"$f":"IF(E28=\"\",0,IF(OR($E28=\"AO\",$E28=\"NR\"),'Measure Summary'!AA30,VLOOKUP($D28,MeasureQCData,AO28,FALSE)))","v":0},null,{"$f":"IF($C28=\"\",0,IF(OR(MIN('Measure Summary'!I30,$AJ28)=0,OR(ElecUtility=\"\",ElecUtility=0,ElecUtility=\"<Select One>\"))=TRUE,0,1.1*'Measure Summary'!I30*HLOOKUP($AJ28,AvoidedCostTable,$E$38)))","v":0},{"$f":"IF($C28=\"\",0,IF(OR(MIN('Measure Summary'!J30,$AJ28)=0,OR(ElecUtility=\"\",ElecUtility=0,ElecUtility=\"<Select One>\"))=TRUE,0,'Measure Summary'!J30*HLOOKUP($AJ28,AvoidedCostTable,$E$38)*$AP28))","v":0},{"$f":"IF($C28=\"\",0,IF(OR(MIN('Measure Summary'!$K30,$AJ28)=0,OR(ElecUtility=\"\",ElecUtility=0,ElecUtility=\"<Select One>\"))=TRUE,0,'Measure Summary'!$K30*HLOOKUP($AJ28,AvoidedCostTable,$E$39,FALSE)))","v":0},{"$f":"IF($C28=\"\",0,IF('Measure Summary'!N30<>\"Natural Gas\",0,IF(MIN('Measure Summary'!G30,$AJ28)=0,0,'Measure Summary'!G30*HLOOKUP($AJ28,AvoidedCostTable,$E$40))))","v":0},{"$f":"IF($C28=\"\",0,IF('Measure Summary'!N30<>\"Natural Gas\",0,IF(MIN('Measure Summary'!H30,$AJ28)=0,0,'Measure Summary'!H30*HLOOKUP($AJ28,AvoidedCostTable,$E$40))))","v":0},{"$f":"IF(OR(N($P28+$Q28)=0,N($AJ28)=0)=TRUE,0,HLOOKUP($AJ28,AvoidedCostTable,12,FALSE)*('Measure Summary'!I30+'Measure Summary'!J30))","v":0},0,{"$f":"'Measure Summary'!G30+'Measure Summary'!H30","v":0},{"$f":"IF($C28=\"\",0,IF('Measure Summary'!N30<>\"Propane\",0,IF(MIN('Measure Summary'!G30+'Measure Summary'!H30,$AJ28)=0,0,-PV($D$42,$AJ28,('Measure Summary'!G30+'Measure Summary'!H30))*$D$45)))","v":0},{"$f":"IF($C28=\"\",0,IF('Measure Summary'!N30<>\"Fuel Oil\",0,IF(MIN('Measure Summary'!G30+'Measure Summary'!H30,$AJ28)=0,0,-PV($D$42,$AJ28,('Measure Summary'!G30+'Measure Summary'!H30))*$E$45)))","v":0},{"$f":"IF($C28=\"\",0,IF('Measure Summary'!N30<>\"Steam\",0,IF(MIN('Measure Summary'!G30+'Measure Summary'!H30,$AJ28)=0,0,-PV($D$42,$AJ28,('Measure Summary'!G30+'Measure Summary'!H30))*$F$45)))","v":0},{"$f":"IF($C28=\"\",0,IF('Measure Summary'!N30<>'Utility Info'!$B$19,0,IF(MIN('Measure Summary'!G30+'Measure Summary'!H30,$AJ28)=0,0,-PV($D$42,$AJ28,('Measure Summary'!G30+'Measure Summary'!H30))*$G$45)))","v":0},{"$f":"IF(OR(N('Measure Summary'!$L30)=0,N($AJ28)=0)=TRUE,0,-PV('TRC Test'!$D$42,'Measure Summary'!$AA$8,'Measure Summary'!$L30*'Measure Summary'!$P30))","v":0},{"$f":"IF(N($AJ28)=0,0,-PV($D$42,$AJ28,'Measure Summary'!$M30))","v":0},0,{"$f":"IF(OR($D28=Calcs!$A$42,$D28=Calcs!$A$24,$D28=Calcs!$A$56,$D28=Calcs!$A$21,$D28=Calcs!$A$27)=TRUE,'Measure Summary'!$F30/'Measure Summary'!$AA30*$AJ28,'Measure Summary'!$F30-SUM($X28:$AC28))+0.00001","v":1.0000000000000001E-5},null,{"$f":"IF($AI28=\"Inc\",'Measure Summary'!$AA30-(YEAR(TODAY())-'Measure Summary'!$AC30),\"\")","v":""},{"$f":"SUM('Measure Summary'!$G30:$H30)+SUM('Measure Summary'!$I30:$J30)*3412/1000000","v":0},"",{"$f":"IF(OR($D28=Calcs!$A$42,$D28=Calcs!$A$24,$D28=Calcs!$A$56,$D28=Calcs!$A$21,$D28=Calcs!$A$27)=TRUE,IF($AG28<-3.75,4,IF($AG28<0,ROUND('Measure Summary'!$AA30,0),$AG28)),ROUND(IF(N('Measure Summary'!$AA30)=0,0,'Measure Summary'!$AA30),0))","v":0},{"$f":"IF(OR($AI28=\"Full\",$AI28=\"\"),\"\",IF($AG28>=0,0,-$AG28/'Measure Summary'!$AA30))","v":""},"","","","",""]
[null,23,{"$f":"'Measure Summary'!C31","v":""},{"$f":"'Measure Summary'!E31","v":""},"","","",0,0,0,0,1.0000000000000001E-5,1.0000000000000001E-5,{"$f":"IF(E29=\"\",0,IF(OR($E29=\"AO\",$E29=\"NR\"),'Measure Summary'!AA31,VLOOKUP($D29,MeasureQCData,AO29,FALSE)))","v":0},null,{"$f":"IF($C29=\"\",0,IF(OR(MIN('Measure Summary'!I31,$AJ29)=0,OR(ElecUtility=\"\",ElecUtility=0,ElecUtility=\"<Select One>\"))=TRUE,0,1.1*'Measure Summary'!I31*HLOOKUP($AJ29,AvoidedCostTable,$E$38)))","v":0},{"$f":"IF($C29=\"\",0,IF(OR(MIN('Measure Summary'!J31,$AJ29)=0,OR(ElecUtility=\"\",ElecUtility=0,ElecUtility=\"<Select One>\"))=TRUE,0,'Measure Summary'!J31*HLOOKUP($AJ29,AvoidedCostTable,$E$38)*$AP29))","v":0},{"$f":"IF($C29=\"\",0,IF(OR(MIN('Measure Summary'!$K31,$AJ29)=0,OR(ElecUtility=\"\",ElecUtility=0,ElecUtility=\"<Select One>\"))=TRUE,0,'Measure Summary'!$K31*HLOOKUP($AJ29,AvoidedCostTable,$E$39,FALSE)))","v":0},{"$f":"IF($C29=\"\",0,IF('Measure Summary'!N31<>\"Natural Gas\",0,IF(MIN('Measure Summary'!G31,$AJ29)=0,0,'Measure Summary'!G31*HLOOKUP($AJ29,AvoidedCostTable,$E$40))))","v":0},{"$f":"IF($C29=\"\",0,IF('Measure Summary'!N31<>\"Natural Gas\",0,IF(MIN('Measure Summary'!H31,$AJ29)=0,0,'Measure Summary'!H31*HLOOKUP($AJ29,AvoidedCostTable,$E$40))))","v":0},{"$f":"IF(OR(N($P29+$Q29)=0,N($AJ29)=0)=TRUE,0,HLOOKUP($AJ29,AvoidedCostTable,12,FALSE)*('Measure Summary'!I31+'Measure Summary'!J31))","v":0},0,{"$f":"'Measure Summary'!G31+'Measure Summary'!H31","v":0},{"$f":"IF($C29=\"\",0,IF('Measure Summary'!N31<>\"Propane\",0,IF(MIN('Measure Summary'!G31+'Measure Summary'!H31,$AJ29)=0,0,-PV($D$42,$AJ29,('Measure Summary'!G31+'Measure Summary'!H31))*$D$45)))","v":0},{"$f":"IF($C29=\"\",0,IF('Measure Summary'!N31<>\"Fuel Oil\",0,IF(MIN('Measure Summary'!G31+'Measure Summary'!H31,$AJ29)=0,0,-PV($D$42,$AJ29,('Measure Summary'!G31+'Measure Summary'!H31))*$E$45)))","v":0},{"$f":"IF($C29=\"\",0,IF('Measure Summary'!N31<>\"Steam\",0,IF(MIN('Measure Summary'!G31+'Measure Summary'!H31,$AJ29)=0,0,-PV($D$42,$AJ29,('Measure Summary'!G31+'Measure Summary'!H31))*$F$45)))","v":0},{"$f":"IF($C29=\"\",0,IF('Measure Summary'!N31<>'Utility Info'!$B$19,0,IF(MIN('Measure Summary'!G31+'Measure Summary'!H31,$AJ29)=0,0,-PV($D$42,$AJ29,('Measure Summary'!G31+'Measure Summary'!H31))*$G$45)))","v":0},{"$f":"IF(OR(N('Measure Summary'!$L31)=0,N($AJ29)=0)=TRUE,0,-PV('TRC Test'!$D$42,'Measure Summary'!$AA$8,'Measure Summary'!$L31*'Measure Summary'!$P31))","v":0},{"$f":"IF(N($AJ29)=0,0,-PV($D$42,$AJ29,'Measure Summary'!$M31))","v":0},0,{"$f":"IF(OR($D29=Calcs!$A$42,$D29=Calcs!$A$24,$D29=Calcs!$A$56,$D29=Calcs!$A$21,$D29=Calcs!$A$27)=TRUE,'Measure Summary'!$F31/'Measure Summary'!$AA31*$AJ29,'Measure Summary'!$F31-SUM($X29:$AC29))+0.00001","v":1.0000000000000001E-5},null,{"$f":"IF($AI29=\"Inc\",'Measure Summary'!$AA31-(YEAR(TODAY())-'Measure Summary'!$AC31),\"\")","v":""},{"$f":"SUM('Measure Summary'!$G31:$H31)+SUM('Measure Summary'!$I31:$J31)*3412/1000000","v":0},"",{"$f":"IF(OR($D29=Calcs!$A$42,$D29=Calcs!$A$24,$D29=Calcs!$A$56,$D29=Calcs!$A$21,$D29=Calcs!$A$27)=TRUE,IF($AG29<-3.75,4,IF($AG29<0,ROUND('Measure Summary'!$AA31,0),$AG29)),ROUND(IF(N('Measure Summary'!$AA31)=0,0,'Measure Summary'!$AA31),0))","v":0},{"$f":"IF(OR($AI29=\"Full\",$AI29=\"\"),\"\",IF($AG29>=0,0,-$AG29/'Measure Summary'!$AA31))","v":""},"","","","",""]
[null,24,{"$f":"'Measure Summary'!C32","v":""},{"$f":"'Measure Summary'!E32","v":""},"","","",0,0,0,0,1.0000000000000001E-5,1.0000000000000001E-5,{"$f":"IF(E30=\"\",0,IF(OR($E30=\"AO\",$E30=\"NR\"),'Measure Summary'!AA32,VLOOKUP($D30,MeasureQCData,AO30,FALSE)))","v":0},null,{"$f":"IF($C30=\"\",0,IF(OR(MIN('Measure Summary'!I32,$AJ30)=0,OR(ElecUtility=\"\",ElecUtility=0,ElecUtility=\"<Select One>\"))=TRUE,0,1.1*'Measure Summary'!I32*HLOOKUP($AJ30,AvoidedCostTable,$E$38)))","v":0},{"$f":"IF($C30=\"\",0,IF(OR(MIN('Measure Summary'!J32,$AJ30)=0,OR(ElecUtility=\"\",ElecUtility=0,ElecUtility=\"<Select One>\"))=TRUE,0,'Measure Summary'!J32*HLOOKUP($AJ30,AvoidedCostTable,$E$38)*$AP30))","v":0},{"$f":"IF($C30=\"\",0,IF(OR(MIN('Measure Summary'!$K32,$AJ30)=0,OR(ElecUtility=\"\",ElecUtility=0,ElecUtility=\"<Select One>\"))=TRUE,0,'Measure Summary'!$K32*HLOOKUP($AJ30,AvoidedCostTable,$E$39,FALSE)))","v":0},{"$f":"IF($C30=\"\",0,IF('Measure Summary'!N32<>\"Natural Gas\",0,IF(MIN('Measure Summary'!G32,$AJ30)=0,0,'Measure Summary'!G32*HLOOKUP($AJ30,AvoidedCostTable,$E$40))))","v":0},{"$f":"IF($C30=\"\",0,IF('Measure Summary'!N32<>\"Natural Gas\",0,IF(MIN('Measure Summary'!H32,$AJ30)=0,0,'Measure Summary'!H32*HLOOKUP($AJ30,AvoidedCostTable,$E$40))))","v":0},{"$f":"IF(OR(N($P30+$Q30)=0,N($AJ30)=0)=TRUE,0,HLOOKUP($AJ30,AvoidedCostTable,12,FALSE)*('Measure Summary'!I32+'Measure Summary'!J32))","v":0},0,{"$f":"'Measure Summary'!G32+'Measure Summary'!H32","v":0},{"$f":"IF($C30=\"\",0,IF('Measure Summary'!N32<>\"Propane\",0,IF(MIN('Measure Summary'!G32+'Measure Summary'!H32,$AJ30)=0,0,-PV($D$42,$AJ30,('Measure Summary'!G32+'Measure Summary'!H32))*$D$45)))","v":0},{"$f":"IF($C30=\"\",0,IF('Measure Summary'!N32<>\"Fuel Oil\",0,IF(MIN('Measure Summary'!G32+'Measure Summary'!H32,$AJ30)=0,0,-PV($D$42,$AJ30,('Measure Summary'!G32+'Measure Summary'!H32))*$E$45)))","v":0},{"$f":"IF($C30=\"\",0,IF('Measure Summary'!N32<>\"Steam\",0,IF(MIN('Measure Summary'!G32+'Measure Summary'!H32,$AJ30)=0,0,-PV($D$42,$AJ30,('Measure Summary'!G32+'Measure Summary'!H32))*$F$45)))","v":0},{"$f":"IF($C30=\"\",0,IF('Measure Summary'!N32<>'Utility Info'!$B$19,0,IF(MIN('Measure Summary'!G32+'Measure Summary'!H32,$AJ30)=0,0,-PV($D$42,$AJ30,('Measure Summary'!G32+'Measure Summary'!H32))*$G$45)))","v":0},{"$f":"IF(OR(N('Measure Summary'!$L32)=0,N($AJ30)=0)=TRUE,0,-PV('TRC Test'!$D$42,'Measure Summary'!$AA$8,'Measure Summary'!$L32*'Measure Summary'!$P32))","v":0},{"$f":"IF(N($AJ30)=0,0,-PV($D$42,$AJ30,'Measure Summary'!$M32))","v":0},0,{"$f":"IF(OR($D30=Calcs!$A$42,$D30=Calcs!$A$24,$D30=Calcs!$A$56,$D30=Calcs!$A$21,$D30=Calcs!$A$27)=TRUE,'Measure Summary'!$F32/'Measure Summary'!$AA32*$AJ30,'Measure Summary'!$F32-SUM($X30:$AC30))+0.00001","v":1.0000000000000001E-5},null,{"$f":"IF($AI30=\"Inc\",'Measure Summary'!$AA32-(YEAR(TODAY())-'Measure Summary'!$AC32),\"\")","v":""},{"$f":"SUM('Measure Summary'!$G32:$H32)+SUM('Measure Summary'!$I32:$J32)*3412/1000000","v":0},"",{"$f":"IF(OR($D30=Calcs!$A$42,$D30=Calcs!$A$24,$D30=Calcs!$A$56,$D30=Calcs!$A$21,$D30=Calcs!$A$27)=TRUE,IF($AG30<-3.75,4,IF($AG30<0,ROUND('Measure Summary'!$AA32,0),$AG30)),ROUND(IF(N('Measure Summary'!$AA32)=0,0,'Measure Summary'!$AA32),0))","v":0},{"$f":"IF(OR($AI30=\"Full\",$AI30=\"\"),\"\",IF($AG30>=0,0,-$AG30/'Measure Summary'!$AA32))","v":""},"","","","",""]
[null,25,{"$f":"'Measure Summary'!C33","v":""},{"$f":"'Measure Summary'!E33","v":""},"","","",0,0,0,0,1.0000000000000001E-5,1.0000000000000001E-5,{"$f":"IF(E31=\"\",0,IF(OR($E31=\"AO\",$E31=\"NR\"),'Measure Summary'!AA33,VLOOKUP($D31,MeasureQCData,AO31,FALSE)))","v":0},null,{"$f":"IF($C31=\"\",0,IF(OR(MIN('Measure Summary'!I33,$AJ31)=0,OR(ElecUtility=\"\",ElecUtility=0,ElecUtility=\"<Select One>\"))=TRUE,0,1.1*'Measure Summary'!I33*HLOOKUP($AJ31,AvoidedCostTable,$E$38)))","v":0},{"$f":"IF($C31=\"\",0,IF(OR(MIN('Measure Summary'!J33,$AJ31)=0,OR(ElecUtility=\"\",ElecUtility=0,ElecUtility=\"<Select One>\"))=TRUE,0,'Measure Summary'!J33*HLOOKUP($AJ31,AvoidedCostTable,$E$38)*$AP31))","v":0},{"$f":"IF($C31=\"\",0,IF(OR(MIN('Measure Summary'!$K33,$AJ31)=0,OR(ElecUtility=\"\",ElecUtility=0,ElecUtility=\"<Select One>\"))=TRUE,0,'Measure Summary'!$K33*HLOOKUP($AJ31,AvoidedCostTable,$E$39,FALSE)))","v":0},{"$f":"IF($C31=\"\",0,IF('Measure Summary'!N33<>\"Natural Gas\",0,IF(MIN('Measure Summary'!G33,$AJ31)=0,0,'Measure Summary'!G33*HLOOKUP($AJ31,AvoidedCostTable,$E$40))))","v":0},{"$f":"IF($C31=\"\",0,IF('Measure Summary'!N33<>\"Natural Gas\",0,IF(MIN('Measure Summary'!H33,$AJ31)=0,0,'Measure Summary'!H33*HLOOKUP($AJ31,AvoidedCostTable,$E$40))))","v":0},{"$f":"IF(OR(N($P31+$Q31)=0,N($AJ31)=0)=TRUE,0,HLOOKUP($AJ31,AvoidedCostTable,12,FALSE)*('Measure Summary'!I33+'Measure Summary'!J33))","v":0},0,{"$f":"'Measure Summary'!G33+'Measure Summary'!H33","v":0},{"$f":"IF($C31=\"\",0,IF('Measure Summary'!N33<>\"Propane\",0,IF(MIN('Measure Summary'!G33+'Measure Summary'!H33,$AJ31)=0,0,-PV($D$42,$AJ31,('Measure Summary'!G33+'Measure Summary'!H33))*$D$45)))","v":0},{"$f":"IF($C31=\"\",0,IF('Measure Summary'!N33<>\"Fuel Oil\",0,IF(MIN('Measure Summary'!G33+'Measure Summary'!H33,$AJ31)=0,0,-PV($D$42,$AJ31,('Measure Summary'!G33+'Measure Summary'!H33))*$E$45)))","v":0},{"$f":"IF($C31=\"\",0,IF('Measure Summary'!N33<>\"Steam\",0,IF(MIN('Measure Summary'!G33+'Measure Summary'!H33,$AJ31)=0,0,-PV($D$42,$AJ31,('Measure Summary'!G33+'Measure Summary'!H33))*$F$45)))","v":0},{"$f":"IF($C31=\"\",0,IF('Measure Summary'!N33<>'Utility Info'!$B$19,0,IF(MIN('Measure Summary'!G33+'Measure Summary'!H33,$AJ31)=0,0,-PV($D$42,$AJ31,('Measure Summary'!G33+'Measure Summary'!H33))*$G$45)))","v":0},{"$f":"IF(OR(N('Measure Summary'!$L33)=0,N($AJ31)=0)=TRUE,0,-PV('TRC Test'!$D$42,'Measure Summary'!$AA$8,'Measure Summary'!$L33*'Measure Summary'!$P33))","v":0},{"$f":"IF(N($AJ31)=0,0,-PV($D$42,$AJ31,'Measure Summary'!$M33))","v":0},0,{"$f":"IF(OR($D31=Calcs!$A$42,$D31=Calcs!$A$24,$D31=Calcs!$A$56,$D31=Calcs!$A$21,$D31=Calcs!$A$27)=TRUE,'Measure Summary'!$F33/'Measure Summary'!$AA33*$AJ31,'Measure Summary'!$F33-SUM($X31:$AC31))+0.00001","v":1.0000000000000001E-5},null,{"$f":"IF($AI31=\"Inc\",'Measure Summary'!$AA33-(YEAR(TODAY())-'Measure Summary'!$AC33),\"\")","v":""},{"$f":"SUM('Measure Summary'!$G33:$H33)+SUM('Measure Summary'!$I33:$J33)*3412/1000000","v":0},"",{"$f":"IF(OR($D31=Calcs!$A$42,$D31=Calcs!$A$24,$D31=Calcs!$A$56,$D31=Calcs!$A$21,$D31=Calcs!$A$27)=TRUE,IF($AG31<-3.75,4,IF($AG31<0,ROUND('Measure Summary'!$AA33,0),$AG31)),ROUND(IF(N('Measure Summary'!$AA33)=0,0,'Measure Summary'!$AA33),0))","v":0},{"$f":"IF(OR($AI31=\"Full\",$AI31=\"\"),\"\",IF($AG31>=0,0,-$AG31/'Measure Summary'!$AA33))","v":""},"","","","",""]
[]
[]
[]
[null,null,"Data References for TRC Test"]
[null,null,"Factor","Value","Look-Up Value"]
[null,null,"Up/Down State",{"$f":"UpDown","v":{"$error":"#N/A"}},"N/A"]
[null,null,"kWh - utility",{"$f":"IF(OR(ElecUtility=\"<Select One>\",ElecUtility=0,ElecUtility=\"\"),\"NEED Elec Utility\",IF(OR(ElecUtility=\"NYSEG\",ElecUtility=\"RG&E\",ElecUtility=\"National Grid\",ElecUtility=\"Other\"),\"Upstate\",IF(UpDown=\"N\",\"NYC\",\"Lower Hudson\")))","v":"NEED Elec Utility"},{"$f":"IF(D38=\"NYC\",4, IF(D38=\"Lower Hudson\",3,IF(D38=\"Upstate\",2,\"\")))","v":""}]
[null,null,"Cooling kW - utility",{"$f":"IF(OR(ElecUtility=\"<Select One>\",ElecUtility=0,ElecUtility=\"\"),\"NEED Elec Utility\",IF(UpDown=\"N\",\"NYC\",\"Upstate\"))","v":"NEED Elec Utility"},{"$f":"IF(D39=\"NYC\",6,IF(D39=\"Upstate\",5,\"\"))","v":""}]
[null,null,"Heating Gas - utility",{"$f":"IF(OR(GasUtility=\"<Select One>\",GasUtility=0,GasUtility=\"\"),\"NEED Gas Utility\",IF(OR(GasUtility=\"Con Edison\",GasUtility=\"O&R\",GasUtility=\"KEDLI\")=TRUE,\"Downstate\",\"Upstate\"))","v":"NEED Gas Utility"},{"$f":"IF(D40=\"Downstate\",7,IF(D40=\"Upstate\",8,\"\"))","v":""}]
[null,null,"Baseload Gas - utility",{"$f":"D40","v":"NEED Gas Utility"},{"$f":"IF(D41=\"Downstate\",9,IF(D41=\"Upstate\",10,\"\"))","v":""}]
[null,null,"Discount Rate for TRC Test",{"$f":"'Avoided Costs'!D2","v":5.5E-2},"N/A"]
[]
[null,null,null,"Propane","Fuel Oil","Steam","Other"]
[null,null,"$/MMBtu",{"$f":"'Utility Info'!F18","v":0},{"$f":"'Utility Info'!F16","v":0},{"$f":"'Utility Info'!F17","v":0},{"$f":"'Utility Info'!F19","v":0}]

{"sheet":"CRIS Data Entry","index":15,"n_rows":31,"n_cols":34,"rows_kept":31,"cut":false,"hidden":true,"merged":[[20,30,20,31],[3,1,3,2],[3,6,3,7],[4,1,4,21],[20,1,20,21],[20,23,20,28],[4,23,4,28],[4,30,4,31]]}
["CRIS Data Entry - Measures Tab"]
[]
[]
[null,"Measure Type / Measure",null,"Measure Description","Cost","Proposed Lifespan\n(years)","Proposed Quantity",null,"Most Affected Fuel","Full MMBtu Savings","Full kWh Savings","kW Demand Savings","Water/Sewer Savings\n(1,000 gals)","O&M Savings","Cost Savings","Payback Years","SIR","TRC B/C Ratio","Full Life Cycle Savings","Years for LLC","Existing Equipment Year of Manufacture","Savings Accrue to Tenants?",null,"Type of Installation","TBD","Adjusted Full Cost","Ratio of Incremental to Full Savings","Ratio of Incremental to Full Costs","Adjusted EUL\n(years)",null,"Reported MMBtu Savings","Reported kWh Savings",null,"Previously Installed Measure?"]
[]
[null,{"$f":"'Measure Descriptions'!B8","v":1},{"$f":"'Measure Summary'!E8","v":""},{"$f":"'Measure Summary'!C8","v":""},{"$f":"'Measure Summary'!F8","v":0},{"$f":"'Measure Summary'!AA8","v":""},{"$f":"'Measure Summary'!W8","v":0},{"$f":"'Measure Summary'!X8","v":""},{"$f":"IF('Measure Summary'!N8=\"\",\"\",'Measure Summary'!N8)","v":""},{"$f":"SUM('Measure Summary'!G8:H8)","v":0},{"$f":"SUM('Measure Summary'!I8:J8)","v":0},{"$f":"'Measure Summary'!K8","v":0},{"$f":"'Measure Summary'!L8","v":0},{"$f":"'Measure Summary'!M8","v":0},{"$f":"'Measure Summary'!O8","v":""},{"$f":"'Measure Summary'!Q8","v":""},{"$f":"'Measure Summary'!R8","v":""},{"$f":"IF('Measure Summary'!T8=\"N/A\",\"\",'Measure Summary'!T8)","v":0},{"$f":"'Measure Summary'!AD8","v":""},{"$f":"F6","v":""},{"$f":"IF('Measure Summary'!AC8=\"\",\"\",'Measure Summary'!AC8)","v":""},{"$f":"IF(C6<>0,\"no\",\"\")","v":"no"},null,{"$f":"'TRC Test'!E6","v":""},null,{"$f":"IF(OR(X6=\"ER\",X6=\"SC\"),'TRC Test'!M6,\"\")","v":""},{"$f":"IF(X6=\"\",\"\",'TRC Test'!F6)","v":""},{"$f":"IF(X6=\"\",\"\",'TRC Test'!G6)","v":""},{"$f":"IF(OR(X6=\"ER\",X6=\"SC\"),'TRC Test'!N6,\"\")","v":""},null,{"$f":"IF($X6=\"NR\",J6*$AA6,\"\")","v":""},{"$f":"IF($X6=\"NR\",K6*$AA6,\"\")","v":""},null,{"$f":"IF('Measure Summary'!Y8=\"\",\"\",'Measure Summary'!Y8)","v":""}]
[null,{"$f":"'Measure Descriptions'!B9","v":2},{"$f":"'Measure Summary'!E9","v":""},{"$f":"'Measure Summary'!C9","v":""},{"$f":"'Measure Summary'!F9","v":0},{"$f":"'Measure Summary'!AA9","v":""},{"$f":"'Measure Summary'!W9","v":0},{"$f":"'Measure Summary'!X9","v":""},{"$f":"IF('Measure Summary'!N9=\"\",\"\",'Measure Summary'!N9)","v":""},{"$f":"SUM('Measure Summary'!G9:H9)","v":0},{"$f":"SUM('Measure Summary'!I9:J9)","v":0},{"$f":"'Measure Summary'!K9","v":0},{"$f":"'Measure Summary'!L9","v":0},{"$f":"'Measure Summary'!M9","v":0},{"$f":"'Measure Summary'!O9","v":""},{"$f":"'Measure Summary'!Q9","v":""},{"$f":"'Measure Summary'!R9","v":""},{"$f":"IF('Measure Summary'!T9=\"N/A\",\"\",'Measure Summary'!T9)","v":0},{"$f":"'Measure Summary'!AD9","v":""},{"$f":"F7","v":""},{"$f":"IF('Measure Summary'!AC9=\"\",\"\",'Measure Summary'!AC9)","v":""},"no",null,{"$f":"'TRC Test'!E7","v":""},null,{"$f":"IF(OR(X7=\"ER\",X7=\"SC\"),'TRC Test'!M7,\"\")","v":""},{"$f":"IF(X7=\"\",\"\",'TRC Test'!F7)","v":""},{"$f":"IF(X7=\"\",\"\",'TRC Test'!G7)","v":""},{"$f":"IF(OR(X7=\"ER\",X7=\"SC\"),'TRC Test'!N7,\"\")","v":""},null,"","",null,{"$f":"IF('Measure Summary'!Y9=\"\",\"\",'Measure Summary'!Y9)","v":""}]
[null,{"$f":"'Measure Descriptions'!B10","v":3},{"$f":"'Measure Summary'!E10","v":""},{"$f":"'Measure Summary'!C10","v":""},{"$f":"'Measure Summary'!F10","v":0},{"$f":"'Measure Summary'!AA10","v":""},{"$f":"'Measure Summary'!W10","v":0},{"$f":"'Measure Summary'!X10","v":""},{"$f":"IF('Measure Summary'!N10=\"\",\"\",'Measure Summary'!N10)","v":""},{"$f":"SUM('Measure Summary'!G10:H10)","v":0},{"$f":"SUM('Measure Summary'!I10:J10)","v":0},{"$f":"'Measure Summary'!K10","v":0},{"$f":"'Measure Summary'!L10","v":0},{"$f":"'Measure Summary'!M10","v":0},{"$f":"'Measure Summary'!O10","v":""},{"$f":"'Measure Summary'!Q10","v":""},{"$f":"'Measure Summary'!R10","v":""},{"$f":"IF('Measure Summary'!T10=\"N/A\",\"\",'Measure Summary'!T10)","v":0},{"$f":"'Measure Summary'!AD10","v":""},"",{"$f":"IF('Measure Summary'!AC10=\"\",\"\",'Measure Summary'!AC10)","v":""},"no",null,{"$f":"'TRC Test'!E8","v":""},null,{"$f":"IF(OR(X8=\"ER\",X8=\"SC\"),'TRC Test'!M8,\"\")","v":""},{"$f":"IF(X8=\"\",\"\",'TRC Test'!F8)","v":""},{"$f":"IF(X8=\"\",\"\",'TRC Test'!G8)","v":""},{"$f":"IF(OR(X8=\"ER\",X8=\"SC\"),'TRC Test'!N8,\"\")","v":""},null,"","",null,{"$f":"IF('Measure Summary'!Y10=\"\",\"\",'Measure Summary'!Y10)","v":""}]
[null,{"$f":"'Measure Descriptions'!B11","v":4},{"$f":"'Measure Summary'!E11","v":""},{"$f":"'Measure Summary'!C11","v":""},{"$f":"'Measure Summary'!F11","v":0},{"$f":"'Measure Summary'!AA11","v":""},{"$f":"'Measure Summary'!W11","v":0},{"$f":"'Measure Summary'!X11","v":""},{"$f":"IF('Measure Summary'!N11=\"\",\"\",'Measure Summary'!N11)","v":""},{"$f":"SUM('Measure Summary'!G11:H11)","v":0},{"$f":"SUM('Measure Summary'!I11:J11)","v":0},{"$f":"'Measure Summary'!K11","v":0},{"$f":"'Measure Summary'!L11","v":0},{"$f":"'Measure Summary'!M11","v":0},{"$f":"'Measure Summary'!O11","v":""},{"$f":"'Measure Summary'!Q11","v":""},{"$f":"'Measure Summary'!R11","v":""},{"$f":"IF('Measure Summary'!T11=\"N/A\",\"\",'Measure Summary'!T11)","v":0},{"$f":"'Measure Summary'!AD11","v":""},"",{"$f":"IF('Measure Summary'!AC11=\"\",\"\",'Measure Summary'!AC11)","v":""},"no",null,{"$f":"'TRC Test'!E9","v":""},null,{"$f":"IF(OR(X9=\"ER\",X9=\"SC\"),'TRC Test'!M9,\"\")","v":""},{"$f":"IF(X9=\"\",\"\",'TRC Test'!F9)","v":""},{"$f":"IF(X9=\"\",\"\",'TRC Test'!G9)","v":""},{"$f":"IF(OR(X9=\"ER\",X9=\"SC\"),'TRC Test'!N9,\"\")","v":""},null,"","",null,{"$f":"IF('Measure Summary'!Y11=\"\",\"\",'Measure Summary'!Y11)","v":""}]
[null,{"$f":"'Measure Descriptions'!B12","v":5},{"$f":"'Measure Summary'!E12","v":""},{"$f":"'Measure Summary'!C12","v":""},{"$f":"'Measure Summary'!F12","v":0},{"$f":"'Measure Summary'!AA12","v":""},{"$f":"'Measure Summary'!W12","v":0},{"$f":"'Measure Summary'!X12","v":""},{"$f":"IF('Measure Summary'!N12=\"\",\"\",'Measure Summary'!N12)","v":""},{"$f":"SUM('Measure Summary'!G12:H12)","v":0},{"$f":"SUM('Measure Summary'!I12:J12)","v":0},{"$f":"'Measure Summary'!K12","v":0},{"$f":"'Measure Summary'!L12","v":0},{"$f":"'Measure Summary'!M12","v":0},{"$f":"'Measure Summary'!O12","v":""},{"$f":"'Measure Summary'!Q12","v":""},{"$f":"'Measure Summary'!R12","v":""},{"$f":"IF('Measure Summary'!T12=\"N/A\",\"\",'Measure Summary'!T12)","v":0},{"$f":"'Measure Summary'!AD12","v":""},"",{"$f":"IF('Measure Summary'!AC12=\"\",\"\",'Measure Summary'!AC12)","v":""},"no",null,{"$f":"'TRC Test'!E10","v":""},null,{"$f":"IF(OR(X10=\"ER\",X10=\"SC\"),'TRC Test'!M10,\"\")","v":""},{"$f":"IF(X10=\"\",\"\",'TRC Test'!F10)","v":""},{"$f":"IF(X10=\"\",\"\",'TRC Test'!G10)","v":""},{"$f":"IF(OR(X10=\"ER\",X10=\"SC\"),'TRC Test'!N10,\"\")","v":""},null,"","",null,{"$f":"IF('Measure Summary'!Y12=\"\",\"\",'Measure Summary'!Y12)","v":""}]
[null,{"$f":"'Measure Descriptions'!B13","v":6},{"$f":"'Measure Summary'!E13","v":""},{"$f":"'Measure Summary'!C13","v":""},{"$f":"'Measure Summary'!F13","v":0},{"$f":"'Measure Summary'!AA13","v":""},{"$f":"'Measure Summary'!W13","v":0},{"$f":"'Measure Summary'!X13","v":""},{"$f":"IF('Measure Summary'!N13=\"\",\"\",'Measure Summary'!N13)","v":""},{"$f":"SUM('Measure Summary'!G13:H13)","v":0},{"$f":"SUM('Measure Summary'!I13:J13)","v":0},{"$f":"'Measure Summary'!K13","v":0},{"$f":"'Measure Summary'!L13","v":0},{"$f":"'Measure Summary'!M13","v":0},{"$f":"'Measure Summary'!O13","v":""},{"$f":"'Measure Summary'!Q13","v":""},{"$f":"'Measure Summary'!R13","v":""},{"$f":"IF('Measure Summary'!T13=\"N/A\",\"\",'Measure Summary'!T13)","v":0},{"$f":"'Measure Summary'!AD13","v":""},"",{"$f":"IF('Measure Summary'!AC13=\"\",\"\",'Measure Summary'!AC13)","v":""},"no",null,{"$f":"'TRC Test'!E11","v":""},null,{"$f":"IF(OR(X11=\"ER\",X11=\"SC\"),'TRC Test'!M11,\"\")","v":""},{"$f":"IF(X11=\"\",\"\",'TRC Test'!F11)","v":""},{"$f":"IF(X11=\"\",\"\",'TRC Test'!G11)","v":""},{"$f":"IF(OR(X11=\"ER\",X11=\"SC\"),'TRC Test'!N11,\"\")","v":""},null,"","",null,{"$f":"IF('Measure Summary'!Y13=\"\",\"\",'Measure Summary'!Y13)","v":""}]
[null,{"$f":"'Measure Descriptions'!B14","v":7},{"$f":"'Measure Summary'!E14","v":""},{"$f":"'Measure Summary'!C14","v":""},{"$f":"'Measure Summary'!F14","v":0},{"$f":"'Measure Summary'!AA14","v":""},{"$f":"'Measure Summary'!W14","v":0},{"$f":"'Measure Summary'!X14","v":""},{"$f":"IF('Measure Summary'!N14=\"\",\"\",'Measure Summary'!N14)","v":""},{"$f":"SUM('Measure Summary'!G14:H14)","v":0},{"$f":"SUM('Measure Summary'!I14:J14)","v":0},{"$f":"'Measure Summary'!K14","v":0},{"$f":"'Measure Summary'!L14","v":0},{"$f":"'Measure Summary'!M14","v":0},{"$f":"'Measure Summary'!O14","v":""},{"$f":"'Measure Summary'!Q14","v":""},{"$f":"'Measure Summary'!R14","v":""},{"$f":"IF('Measure Summary'!T14=\"N/A\",\"\",'Measure Summary'!T14)","v":0},{"$f":"'Measure Summary'!AD14","v":""},"",{"$f":"IF('Measure Summary'!AC14=\"\",\"\",'Measure Summary'!AC14)","v":""},"no",null,{"$f":"'TRC Test'!E12","v":""},null,{"$f":"IF(OR(X12=\"ER\",X12=\"SC\"),'TRC Test'!M12,\"\")","v":""},{"$f":"IF(X12=\"\",\"\",'TRC Test'!F12)","v":""},{"$f":"IF(X12=\"\",\"\",'TRC Test'!G12)","v":""},{"$f":"IF(OR(X12=\"ER\",X12=\"SC\"),'TRC Test'!N12,\"\")","v":""},null,"","",null,{"$f":"IF('Measure Summary'!Y14=\"\",\"\",'Measure Summary'!Y14)","v":""}]
[null,{"$f":"'Measure Descriptions'!B15","v":8},{"$f":"'Measure Summary'!E15","v":""},{"$f":"'Measure Summary'!C15","v":""},{"$f":"'Measure Summary'!F15","v":0},{"$f":"'Measure Summary'!AA15","v":""},{"$f":"'Measure Summary'!W15","v":0},{"$f":"'Measure Summary'!X15","v":""},{"$f":"IF('Measure Summary'!N15=\"\",\"\",'Measure Summary'!N15)","v":""},{"$f":"SUM('Measure Summary'!G15:H15)","v":0},{"$f":"SUM('Measure Summary'!I15:J15)","v":0},{"$f":"'Measure Summary'!K15","v":0},{"$f":"'Measure Summary'!L15","v":0},{"$f":"'Measure Summary'!M15","v":0},{"$f":"'Measure Summary'!O15","v":""},{"$f":"'Measure Summary'!Q15","v":""},{"$f":"'Measure Summary'!R15","v":""},{"$f":"IF('Measure Summary'!T15=\"N/A\",\"\",'Measure Summary'!T15)","v":0},{"$f":"'Measure Summary'!AD15","v":""},"",{"$f":"IF('Measure Summary'!AC15=\"\",\"\",'Measure Summary'!AC15)","v":""},"no",null,{"$f":"'TRC Test'!E13","v":""},null,{"$f":"IF(OR(X13=\"ER\",X13=\"SC\"),'TRC Test'!M13,\"\")","v":""},{"$f":"IF(X13=\"\",\"\",'TRC Test'!F13)","v":""},{"$f":"IF(X13=\"\",\"\",'TRC Test'!G13)","v":""},{"$f":"IF(OR(X13=\"ER\",X13=\"SC\"),'TRC Test'!N13,\"\")","v":""},null,"","",null,{"$f":"IF('Measure Summary'!Y15=\"\",\"\",'Measure Summary'!Y15)","v":""}]
[null,{"$f":"'Measure Descriptions'!B16","v":9},{"$f":"'Measure Summary'!E16","v":""},{"$f":"'Measure Summary'!C16","v":""},{"$f":"'Measure Summary'!F16","v":0},{"$f":"'Measure Summary'!AA16","v":""},{"$f":"'Measure Summary'!W16","v":0},{"$f":"'Measure Summary'!X16","v":""},{"$f":"IF('Measure Summary'!N16=\"\",\"\",'Measure Summary'!N16)","v":""},{"$f":"SUM('Measure Summary'!G16:H16)","v":0},{"$f":"SUM('Measure Summary'!I16:J16)","v":0},{"$f":"'Measure Summary'!K16","v":0},{"$f":"'Measure Summary'!L16","v":0},{"$f":"'Measure Summary'!M16","v":0},{"$f":"'Measure Summary'!O16","v":""},{"$f":"'Measure Summary'!Q16","v":""},{"$f":"'Measure Summary'!R16","v":""},{"$f":"IF('Measure Summary'!T16=\"N/A\",\"\",'Measure Summary'!T16)","v":0},{"$f":"'Measure Summary'!AD16","v":""},"",{"$f":"IF('Measure Summary'!AC16=\"\",\"\",'Measure Summary'!AC16)","v":""},"no",null,{"$f":"'TRC Test'!E14","v":""},null,{"$f":"IF(OR(X14=\"ER\",X14=\"SC\"),'TRC Test'!M14,\"\")","v":""},{"$f":"IF(X14=\"\",\"\",'TRC Test'!F14)","v":""},{"$f":"IF(X14=\"\",\"\",'TRC Test'!G14)","v":""},{"$f":"IF(OR(X14=\"ER\",X14=\"SC\"),'TRC Test'!N14,\"\")","v":""},null,"","",null,{"$f":"IF('Measure Summary'!Y16=\"\",\"\",'Measure Summary'!Y16)","v":""}]
[null,{"$f":"'Measure Descriptions'!B17","v":10},{"$f":"'Measure Summary'!E17","v":""},{"$f":"'Measure Summary'!C17","v":""},{"$f":"'Measure Summary'!F17","v":0},{"$f":"'Measure Summary'!AA17","v":""},{"$f":"'Measure Summary'!W17","v":0},{"$f":"'Measure Summary'!X17","v":""},{"$f":"IF('Measure Summary'!N17=\"\",\"\",'Measure Summary'!N17)","v":""},{"$f":"SUM('Measure Summary'!G17:H17)","v":0},{"$f":"SUM('Measure Summary'!I17:J17)","v":0},{"$f":"'Measure Summary'!K17","v":0},{"$f":"'Measure Summary'!L17","v":0},{"$f":"'Measure Summary'!M17","v":0},{"$f":"'Measure Summary'!O17","v":""},{"$f":"'Measure Summary'!Q17","v":""},{"$f":"'Measure Summary'!R17","v":""},{"$f":"IF('Measure Summary'!T17=\"N/A\",\"\",'Measure Summary'!T17)","v":0},{"$f":"'Measure Summary'!AD17","v":""},"",{"$f":"IF('Measure Summary'!AC17=\"\",\"\",'Measure Summary'!AC17)","v":""},"no",null,{"$f":"'TRC Test'!E15","v":""},null,{"$f":"IF(OR(X15=\"ER\",X15=\"SC\"),'TRC Test'!M15,\"\")","v":""},{"$f":"IF(X15=\"\",\"\",'TRC Test'!F15)","v":""},{"$f":"IF(X15=\"\",\"\",'TRC Test'!G15)","v":""},{"$f":"IF(OR(X15=\"ER\",X15=\"SC\"),'TRC Test'!N15,\"\")","v":""},null,"","",null,{"$f":"IF('Measure Summary'!Y17=\"\",\"\",'Measure Summary'!Y17)","v":""}]
[null,{"$f":"'Measure Descriptions'!B18","v":11},{"$f":"'Measure Summary'!E18","v":""},{"$f":"'Measure Summary'!C18","v":""},{"$f":"'Measure Summary'!F18","v":0},{"$f":"'Measure Summary'!AA18","v":""},{"$f":"'Measure Summary'!W18","v":0},{"$f":"'Measure Summary'!X18","v":""},{"$f":"IF('Measure Summary'!N18=\"\",\"\",'Measure Summary'!N18)","v":""},{"$f":"SUM('Measure Summary'!G18:H18)","v":0},{"$f":"SUM('Measure Summary'!I18:J18)","v":0},{"$f":"'Measure Summary'!K18","v":0},{"$f":"'Measure Summary'!L18","v":0},{"$f":"'Measure Summary'!M18","v":0},{"$f":"'Measure Summary'!O18","v":""},{"$f":"'Measure Summary'!Q18","v":""},{"$f":"'Measure Summary'!R18","v":""},{"$f":"IF('Measure Summary'!T18=\"N/A\",\"\",'Measure Summary'!T18)","v":0},{"$f":"'Measure Summary'!AD18","v":""},"",{"$f":"IF('Measure Summary'!AC18=\"\",\"\",'Measure Summary'!AC18)","v":""},"no",null,{"$f":"'TRC Test'!E16","v":""},null,{"$f":"IF(OR(X16=\"ER\",X16=\"SC\"),'TRC Test'!M16,\"\")","v":""},{"$f":"IF(X16=\"\",\"\",'TRC Test'!F16)","v":""},{"$f":"IF(X16=\"\",\"\",'TRC Test'!G16)","v":""},{"$f":"IF(OR(X16=\"ER\",X16=\"SC\"),'TRC Test'!N16,\"\")","v":""},null,"","",null,{"$f":"IF('Measure Summary'!Y18=\"\",\"\",'Measure Summary'!Y18)","v":""}]
[null,{"$f":"'Measure Descriptions'!B19","v":12},{"$f":"'Measure Summary'!E19","v":""},{"$f":"'Measure Summary'!C19","v":""},{"$f":"'Measure Summary'!F19","v":0},{"$f":"'Measure Summary'!AA19","v":""},{"$f":"'Measure Summary'!W19","v":0},{"$f":"'Measure Summary'!X19","v":""},{"$f":"IF('Measure Summary'!N19=\"\",\"\",'Measure Summary'!N19)","v":""},{"$f":"SUM('Measure Summary'!G19:H19)","v":0},{"$f":"SUM('Measure Summary'!I19:J19)","v":0},{"$f":"'Measure Summary'!K19","v":0},{"$f":"'Measure Summary'!L19","v":0},{"$f":"'Measure Summary'!M19","v":0},{"$f":"'Measure Summary'!O19","v":""},{"$f":"'Measure Summary'!Q19","v":""},{"$f":"'Measure Summary'!R19","v":""},{"$f":"IF('Measure Summary'!T19=\"N/A\",\"\",'Measure Summary'!T19)","v":0},{"$f":"'Measure Summary'!AD19","v":""},"",{"$f":"IF('Measure Summary'!AC19=\"\",\"\",'Measure Summary'!AC19)","v":""},"no",null,{"$f":"'TRC Test'!E17","v":""},null,{"$f":"IF(OR(X17=\"ER\",X17=\"SC\"),'TRC Test'!M17,\"\")","v":""},{"$f":"IF(X17=\"\",\"\",'TRC Test'!F17)","v":""},{"$f":"IF(X17=\"\",\"\",'TRC Test'!G17)","v":""},{"$f":"IF(OR(X17=\"ER\",X17=\"SC\"),'TRC Test'!N17,\"\")","v":""},null,"","",null,{"$f":"IF('Measure Summary'!Y19=\"\",\"\",'Measure Summary'!Y19)","v":""}]
[null,{"$f":"'Measure Descriptions'!B20","v":13},{"$f":"'Measure Summary'!E20","v":""},{"$f":"'Measure Summary'!C20","v":""},{"$f":"'Measure Summary'!F20","v":0},{"$f":"'Measure Summary'!AA20","v":""},{"$f":"'Measure Summary'!W20","v":0},{"$f":"'Measure Summary'!X20","v":""},{"$f":"IF('Measure Summary'!N20=\"\",\"\",'Measure Summary'!N20)","v":""},{"$f":"SUM('Measure Summary'!G20:H20)","v":0},{"$f":"SUM('Measure Summary'!I20:J20)","v":0},{"$f":"'Measure Summary'!K20","v":0},{"$f":"'Measure Summary'!L20","v":0},{"$f":"'Measure Summary'!M20","v":0},{"$f":"'Measure Summary'!O20","v":""},{"$f":"'Measure Summary'!Q20","v":""},{"$f":"'Measure Summary'!R20","v":""},{"$f":"IF('Measure Summary'!T20=\"N/A\",\"\",'Measure Summary'!T20)","v":0},{"$f":"'Measure Summary'!AD20","v":""},"",{"$f":"IF('Measure Summary'!AC20=\"\",\"\",'Measure Summary'!AC20)","v":""},"no",null,{"$f":"'TRC Test'!E18","v":""},null,{"$f":"IF(OR(X18=\"ER\",X18=\"SC\"),'TRC Test'!M18,\"\")","v":""},{"$f":"IF(X18=\"\",\"\",'TRC Test'!F18)","v":""},{"$f":"IF(X18=\"\",\"\",'TRC Test'!G18)","v":""},{"$f":"IF(OR(X18=\"ER\",X18=\"SC\"),'TRC Test'!N18,\"\")","v":""},null,"","",null,{"$f":"IF('Measure Summary'!Y20=\"\",\"\",'Measure Summary'!Y20)","v":""}]
[null,{"$f":"'Measure Descriptions'!B21","v":14},{"$f":"'Measure Summary'!E21","v":""},{"$f":"'Measure Summary'!C21","v":""},{"$f":"'Measure Summary'!F21","v":0},{"$f":"'Measure Summary'!AA21","v":""},{"$f":"'Measure Summary'!W21","v":0},{"$f":"'Measure Summary'!X21","v":""},{"$f":"IF('Measure Summary'!N21=\"\",\"\",'Measure Summary'!N21)","v":""},{"$f":"SUM('Measure Summary'!G21:H21)","v":0},{"$f":"SUM('Measure Summary'!I21:J21)","v":0},{"$f":"'Measure Summary'!K21","v":0},{"$f":"'Measure Summary'!L21","v":0},{"$f":"'Measure Summary'!M21","v":0},{"$f":"'Measure Summary'!O21","v":""},{"$f":"'Measure Summary'!Q21","v":""},{"$f":"'Measure Summary'!R21","v":""},{"$f":"IF('Measure Summary'!T21=\"N/A\",\"\",'Measure Summary'!T21)","v":0},{"$f":"'Measure Summary'!AD21","v":""},"",{"$f":"IF('Measure Summary'!AC21=\"\",\"\",'Measure Summary'!AC21)","v":""},"no",null,{"$f":"'TRC Test'!E19","v":""},null,{"$f":"IF(OR(X19=\"ER\",X19=\"SC\"),'TRC Test'!M19,\"\")","v":""},{"$f":"IF(X19=\"\",\"\",'TRC Test'!F19)","v":""},{"$f":"IF(X19=\"\",\"\",'TRC Test'!G19)","v":""},{"$f":"IF(OR(X19=\"ER\",X19=\"SC\"),'TRC Test'!N19,\"\")","v":""},null,"","",null,{"$f":"IF('Measure Summary'!Y21=\"\",\"\",'Measure Summary'!Y21)","v":""}]
[null,{"$f":"'Measure Descriptions'!B22","v":15},{"$f":"'Measure Summary'!E22","v":""},{"$f":"'Measure Summary'!C22","v":""},{"$f":"'Measure Summary'!F22","v":0},{"$f":"'Measure Summary'!AA22","v":""},{"$f":"'Measure Summary'!W22","v":0},{"$f":"'Measure Summary'!X22","v":""},{"$f":"IF('Measure Summary'!N22=\"\",\"\",'Measure Summary'!N22)","v":""},{"$f":"SUM('Measure Summary'!G22:H22)","v":0},{"$f":"SUM('Measure Summary'!I22:J22)","v":0},{"$f":"'Measure Summary'!K22","v":0},{"$f":"'Measure Summary'!L22","v":0},{"$f":"'Measure Summary'!M22","v":0},{"$f":"'Measure Summary'!O22","v":""},{"$f":"'Measure Summary'!Q22","v":""},{"$f":"'Measure Summary'!R22","v":""},{"$f":"IF('Measure Summary'!T22=\"N/A\",\"\",'Measure Summary'!T22)","v":0},{"$f":"'Measure Summary'!AD22","v":""},"",{"$f":"IF('Measure Summary'!AC22=\"\",\"\",'Measure Summary'!AC22)","v":""},"no",null,{"$f":"'TRC Test'!E20","v":""},null,{"$f":"IF(OR(X20=\"ER\",X20=\"SC\"),'TRC Test'!M20,\"\")","v":""},{"$f":"IF(X20=\"\",\"\",'TRC Test'!F20)","v":""},{"$f":"IF(X20=\"\",\"\",'TRC Test'!G20)","v":""},{"$f":"IF(OR(X20=\"ER\",X20=\"SC\"),'TRC Test'!N20,\"\")","v":""},null,"","",null,{"$f":"IF('Measure Summary'!Y22=\"\",\"\",'Measure Summary'!Y22)","v":""}]
[]
[null,{"$f":"'Measure Descriptions'!B24","v":16},{"$f":"'Measure Summary'!E24","v":""},{"$f":"'Measure Summary'!C24","v":""},{"$f":"'Measure Summary'!F24","v":0},{"$f":"'Measure Summary'!AA24","v":""},{"$f":"'Measure Summary'!W24","v":0},{"$f":"'Measure Summary'!X24","v":""},{"$f":"IF('Measure Summary'!N24=\"\",\"\",'Measure Summary'!N24)","v":""},{"$f":"SUM('Measure Summary'!G24:H24)","v":0},{"$f":"SUM('Measure Summary'!I24:J24)","v":0},{"$f":"'Measure Summary'!K24","v":0},{"$f":"'Measure Summary'!L24","v":0},{"$f":"'Measure Summary'!M24","v":0},{"$f":"'Measure Summary'!O24","v":""},{"$f":"'Measure Summary'!Q24","v":""},{"$f":"'Measure Summary'!R24","v":""},{"$f":"IF('Measure Summary'!T24=\"N/A\",\"\",'Measure Summary'!T24)","v":0},{"$f":"'Measure Summary'!AD24","v":""},"",{"$f":"IF('Measure Summary'!AC24=\"\",\"\",'Measure Summary'!AC24)","v":""},{"$f":"IF(C22<>0,\"yes\",\"\")","v":"yes"},null,{"$f":"'TRC Test'!E22","v":""},null,{"$f":"IF(OR(X22=\"ER\",X22=\"SC\"),'TRC Test'!M22,\"\")","v":""},{"$f":"IF(X22=\"\",\"\",'TRC Test'!F22)","v":""},{"$f":"IF(X22=\"\",\"\",'TRC Test'!G22)","v":""},{"$f":"IF(OR(X22=\"ER\",X22=\"SC\"),'TRC Test'!N22,\"\")","v":""},null,{"$f":"IF($X22=\"NR\",J22*$AA22,\"\")","v":""},{"$f":"IF($X22=\"NR\",K22*$AA22,\"\")","v":""},null,{"$f":"IF('Measure Summary'!Y24=\"\",\"\",'Measure Summary'!Y24)","v":""}]
[null,{"$f":"'Measure Descriptions'!B25","v":17},{"$f":"'Measure Summary'!E25","v":""},{"$f":"'Measure Summary'!C25","v":""},{"$f":"'Measure Summary'!F25","v":0},{"$f":"'Measure Summary'!AA25","v":""},{"$f":"'Measure Summary'!W25","v":0},{"$f":"'Measure Summary'!X25","v":""},{"$f":"IF('Measure Summary'!N25=\"\",\"\",'Measure Summary'!N25)","v":""},{"$f":"SUM('Measure Summary'!G25:H25)","v":0},{"$f":"SUM('Measure Summary'!I25:J25)","v":0},{"$f":"'Measure Summary'!K25","v":0},{"$f":"'Measure Summary'!L25","v":0},{"$f":"'Measure Summary'!M25","v":0},{"$f":"'Measure Summary'!O25","v":""},{"$f":"'Measure Summary'!Q25","v":""},{"$f":"'Measure Summary'!R25","v":""},{"$f":"IF('Measure Summary'!T25=\"N/A\",\"\",'Measure Summary'!T25)","v":0},{"$f":"'Measure Summary'!AD25","v":""},"",{"$f":"IF('Measure Summary'!AC25=\"\",\"\",'Measure Summary'!AC25)","v":""},{"$f":"IF(C23<>0,\"yes\",\"\")","v":"yes"},null,{"$f":"'TRC Test'!E23","v":""},null,{"$f":"IF(OR(X23=\"ER\",X23=\"SC\"),'TRC Test'!M23,\"\")","v":""},{"$f":"IF(X23=\"\",\"\",'TRC Test'!F23)","v":""},{"$f":"IF(X23=\"\",\"\",'TRC Test'!G23)","v":""},{"$f":"IF(OR(X23=\"ER\",X23=\"SC\"),'TRC Test'!N23,\"\")","v":""},null,"","",null,{"$f":"IF('Measure Summary'!Y25=\"\",\"\",'Measure Summary'!Y25)","v":""}]
[null,{"$f":"'Measure Descriptions'!B26","v":18},{"$f":"'Measure Summary'!E26","v":""},{"$f":"'Measure Summary'!C26","v":""},{"$f":"'Measure Summary'!F26","v":0},{"$f":"'Measure Summary'!AA26","v":""},{"$f":"'Measure Summary'!W26","v":0},{"$f":"'Measure Summary'!X26","v":""},{"$f":"IF('Measure Summary'!N26=\"\",\"\",'Measure Summary'!N26)","v":""},{"$f":"SUM('Measure Summary'!G26:H26)","v":0},{"$f":"SUM('Measure Summary'!I26:J26)","v":0},{"$f":"'Measure Summary'!K26","v":0},{"$f":"'Measure Summary'!L26","v":0},{"$f":"'Measure Summary'!M26","v":0},{"$f":"'Measure Summary'!O26","v":""},{"$f":"'Measure Summary'!Q26","v":""},{"$f":"'Measure Summary'!R26","v":""},{"$f":"IF('Measure Summary'!T26=\"N/A\",\"\",'Measure Summary'!T26)","v":0},{"$f":"'Measure Summary'!AD26","v":""},"",{"$f":"IF('Measure Summary'!AC26=\"\",\"\",'Measure Summary'!AC26)","v":""},{"$f":"IF(C24<>0,\"yes\",\"\")","v":"yes"},null,{"$f":"'TRC Test'!E24","v":""},null,{"$f":"IF(OR(X24=\"ER\",X24=\"SC\"),'TRC Test'!M24,\"\")","v":""},{"$f":"IF(X24=\"\",\"\",'TRC Test'!F24)","v":""},{"$f":"IF(X24=\"\",\"\",'TRC Test'!G24)","v":""},{"$f":"IF(OR(X24=\"ER\",X24=\"SC\"),'TRC Test'!N24,\"\")","v":""},null,"","",null,{"$f":"IF('Measure Summary'!Y26=\"\",\"\",'Measure Summary'!Y26)","v":""}]
[null,{"$f":"'Measure Descriptions'!B27","v":19},{"$f":"'Measure Summary'!E27","v":""},{"$f":"'Measure Summary'!C27","v":""},{"$f":"'Measure Summary'!F27","v":0},{"$f":"'Measure Summary'!AA27","v":""},{"$f":"'Measure Summary'!W27","v":0},{"$f":"'Measure Summary'!X27","v":""},{"$f":"IF('Measure Summary'!N27=\"\",\"\",'Measure Summary'!N27)","v":""},{"$f":"SUM('Measure Summary'!G27:H27)","v":0},{"$f":"SUM('Measure Summary'!I27:J27)","v":0},{"$f":"'Measure Summary'!K27","v":0},{"$f":"'Measure Summary'!L27","v":0},{"$f":"'Measure Summary'!M27","v":0},{"$f":"'Measure Summary'!O27","v":""},{"$f":"'Measure Summary'!Q27","v":""},{"$f":"'Measure Summary'!R27","v":""},{"$f":"IF('Measure Summary'!T27=\"N/A\",\"\",'Measure Summary'!T27)","v":0},{"$f":"'Measure Summary'!AD27","v":""},"",{"$f":"IF('Measure Summary'!AC27=\"\",\"\",'Measure Summary'!AC27)","v":""},{"$f":"IF(C25<>0,\"yes\",\"\")","v":"yes"},null,{"$f":"'TRC Test'!E25","v":""},null,{"$f":"IF(OR(X25=\"ER\",X25=\"SC\"),'TRC Test'!M25,\"\")","v":""},{"$f":"IF(X25=\"\",\"\",'TRC Test'!F25)","v":""},{"$f":"IF(X25=\"\",\"\",'TRC Test'!G25)","v":""},{"$f":"IF(OR(X25=\"ER\",X25=\"SC\"),'TRC Test'!N25,\"\")","v":""},null,"","",null,{"$f":"IF('Measure Summary'!Y27=\"\",\"\",'Measure Summary'!Y27)","v":""}]
[null,{"$f":"'Measure Descriptions'!B28","v":20},{"$f":"'Measure Summary'!E28","v":""},{"$f":"'Measure Summary'!C28","v":""},{"$f":"'Measure Summary'!F28","v":0},{"$f":"'Measure Summary'!AA28","v":""},{"$f":"'Measure Summary'!W28","v":0},{"$f":"'Measure Summary'!X28","v":""},{"$f":"IF('Measure Summary'!N28=\"\",\"\",'Measure Summary'!N28)","v":""},{"$f":"SUM('Measure Summary'!G28:H28)","v":0},{"$f":"SUM('Measure Summary'!I28:J28)","v":0},{"$f":"'Measure Summary'!K28","v":0},{"$f":"'Measure Summary'!L28","v":0},{"$f":"'Measure Summary'!M28","v":0},{"$f":"'Measure Summary'!O28","v":""},{"$f":"'Measure Summary'!Q28","v":""},{"$f":"'Measure Summary'!R28","v":""},{"$f":"IF('Measure Summary'!T28=\"N/A\",\"\",'Measure Summary'!T28)","v":0},{"$f":"'Measure Summary'!AD28","v":""},"",{"$f":"IF('Measure Summary'!AC28=\"\",\"\",'Measure Summary'!AC28)","v":""},{"$f":"IF(C26<>0,\"yes\",\"\")","v":"yes"},null,{"$f":"'TRC Test'!E26","v":""},null,{"$f":"IF(OR(X26=\"ER\",X26=\"SC\"),'TRC Test'!M26,\"\")","v":""},{"$f":"IF(X26=\"\",\"\",'TRC Test'!F26)","v":""},{"$f":"IF(X26=\"\",\"\",'TRC Test'!G26)","v":""},{"$f":"IF(OR(X26=\"ER\",X26=\"SC\"),'TRC Test'!N26,\"\")","v":""},null,"","",null,{"$f":"IF('Measure Summary'!Y28=\"\",\"\",'Measure Summary'!Y28)","v":""}]
[null,{"$f":"'Measure Descriptions'!B29","v":21},{"$f":"'Measure Summary'!E29","v":""},{"$f":"'Measure Summary'!C29","v":""},{"$f":"'Measure Summary'!F29","v":0},{"$f":"'Measure Summary'!AA29","v":""},{"$f":"'Measure Summary'!W29","v":0},{"$f":"'Measure Summary'!X29","v":""},{"$f":"IF('Measure Summary'!N29=\"\",\"\",'Measure Summary'!N29)","v":""},{"$f":"SUM('Measure Summary'!G29:H29)","v":0},{"$f":"SUM('Measure Summary'!I29:J29)","v":0},{"$f":"'Measure Summary'!K29","v":0},{"$f":"'Measure Summary'!L29","v":0},{"$f":"'Measure Summary'!M29","v":0},{"$f":"'Measure Summary'!O29","v":""},{"$f":"'Measure Summary'!Q29","v":""},{"$f":"'Measure Summary'!R29","v":""},{"$f":"IF('Measure Summary'!T29=\"N/A\",\"\",'Measure Summary'!T29)","v":0},{"$f":"'Measure Summary'!AD29","v":""},"",{"$f":"IF('Measure Summary'!AC29=\"\",\"\",'Measure Summary'!AC29)","v":""},"yes",null,{"$f":"'TRC Test'!E27","v":""},null,{"$f":"IF(OR(X27=\"ER\",X27=\"SC\"),'TRC Test'!M27,\"\")","v":""},{"$f":"IF(X27=\"\",\"\",'TRC Test'!F27)","v":""},{"$f":"IF(X27=\"\",\"\",'TRC Test'!G27)","v":""},{"$f":"IF(OR(X27=\"ER\",X27=\"SC\"),'TRC Test'!N27,\"\")","v":""},null,"","",null,{"$f":"IF('Measure Summary'!Y29=\"\",\"\",'Measure Summary'!Y29)","v":""}]
[null,{"$f":"'Measure Descriptions'!B30","v":22},{"$f":"'Measure Summary'!E30","v":""},{"$f":"'Measure Summary'!C30","v":""},{"$f":"'Measure Summary'!F30","v":0},{"$f":"'Measure Summary'!AA30","v":""},{"$f":"'Measure Summary'!W30","v":0},{"$f":"'Measure Summary'!X30","v":""},{"$f":"IF('Measure Summary'!N30=\"\",\"\",'Measure Summary'!N30)","v":""},{"$f":"SUM('Measure Summary'!G30:H30)","v":0},{"$f":"SUM('Measure Summary'!I30:J30)","v":0},{"$f":"'Measure Summary'!K30","v":0},{"$f":"'Measure Summary'!L30","v":0},{"$f":"'Measure Summary'!M30","v":0},{"$f":"'Measure Summary'!O30","v":""},{"$f":"'Measure Summary'!Q30","v":""},{"$f":"'Measure Summary'!R30","v":""},{"$f":"IF('Measure Summary'!T30=\"N/A\",\"\",'Measure Summary'!T30)","v":0},{"$f":"'Measure Summary'!AD30","v":""},"",{"$f":"IF('Measure Summary'!AC30=\"\",\"\",'Measure Summary'!AC30)","v":""},"yes",null,{"$f":"'TRC Test'!E28","v":""},null,{"$f":"IF(OR(X28=\"ER\",X28=\"SC\"),'TRC Test'!M28,\"\")","v":""},{"$f":"IF(X28=\"\",\"\",'TRC Test'!F28)","v":""},{"$f":"IF(X28=\"\",\"\",'TRC Test'!G28)","v":""},{"$f":"IF(OR(X28=\"ER\",X28=\"SC\"),'TRC Test'!N28,\"\")","v":""},null,"","",null,{"$f":"IF('Measure Summary'!Y30=\"\",\"\",'Measure Summary'!Y30)","v":""}]
[null,{"$f":"'Measure Descriptions'!B31","v":23},{"$f":"'Measure Summary'!E31","v":""},{"$f":"'Measure Summary'!C31","v":""},{"$f":"'Measure Summary'!F31","v":0},{"$f":"'Measure Summary'!AA31","v":""},{"$f":"'Measure Summary'!W31","v":0},{"$f":"'Measure Summary'!X31","v":""},{"$f":"IF('Measure Summary'!N31=\"\",\"\",'Measure Summary'!N31)","v":""},{"$f":"SUM('Measure Summary'!G31:H31)","v":0},{"$f":"SUM('Measure Summary'!I31:J31)","v":0},{"$f":"'Measure Summary'!K31","v":0},{"$f":"'Measure Summary'!L31","v":0},{"$f":"'Measure Summary'!M31","v":0},{"$f":"'Measure Summary'!O31","v":""},{"$f":"'Measure Summary'!Q31","v":""},{"$f":"'Measure Summary'!R31","v":""},{"$f":"IF('Measure Summary'!T31=\"N/A\",\"\",'Measure Summary'!T31)","v":0},{"$f":"'Measure Summary'!AD31","v":""},"",{"$f":"IF('Measure Summary'!AC31=\"\",\"\",'Measure Summary'!AC31)","v":""},"yes",null,{"$f":"'TRC Test'!E29","v":""},null,{"$f":"IF(OR(X29=\"ER\",X29=\"SC\"),'TRC Test'!M29,\"\")","v":""},{"$f":"IF(X29=\"\",\"\",'TRC Test'!F29)","v":""},{"$f":"IF(X29=\"\",\"\",'TRC Test'!G29)","v":""},{"$f":"IF(OR(X29=\"ER\",X29=\"SC\"),'TRC Test'!N29,\"\")","v":""},null,"","",null,{"$f":"IF('Measure Summary'!Y31=\"\",\"\",'Measure Summary'!Y31)","v":""}]
[null,{"$f":"'Measure Descriptions'!B32","v":24},{"$f":"'Measure Summary'!E32","v":""},{"$f":"'Measure Summary'!C32","v":""},{"$f":"'Measure Summary'!F32","v":0},{"$f":"'Measure Summary'!AA32","v":""},{"$f":"'Measure Summary'!W32","v":0},{"$f":"'Measure Summary'!X32","v":""},{"$f":"IF('Measure Summary'!N32=\"\",\"\",'Measure Summary'!N32)","v":""},{"$f":"SUM('Measure Summary'!G32:H32)","v":0},{"$f":"SUM('Measure Summary'!I32:J32)","v":0},{"$f":"'Measure Summary'!K32","v":0},{"$f":"'Measure Summary'!L32","v":0},{"$f":"'Measure Summary'!M32","v":0},{"$f":"'Measure Summary'!O32","v":""},{"$f":"'Measure Summary'!Q32","v":""},{"$f":"'Measure Summary'!R32","v":""},{"$f":"IF('Measure Summary'!T32=\"N/A\",\"\",'Measure Summary'!T32)","v":0},{"$f":"'Measure Summary'!AD32","v":""},"",{"$f":"IF('Measure Summary'!AC32=\"\",\"\",'Measure Summary'!AC32)","v":""},"yes",null,{"$f":"'TRC Test'!E30","v":""},null,{"$f":"IF(OR(X30=\"ER\",X30=\"SC\"),'TRC Test'!M30,\"\")","v":""},{"$f":"IF(X30=\"\",\"\",'TRC Test'!F30)","v":""},{"$f":"IF(X30=\"\",\"\",'TRC Test'!G30)","v":""},{"$f":"IF(OR(X30=\"ER\",X30=\"SC\"),'TRC Test'!N30,\"\")","v":""},null,"","",null,{"$f":"IF('Measure Summary'!Y32=\"\",\"\",'Measure Summary'!Y32)","v":""}]
[null,{"$f":"'Measure Descriptions'!B33","v":25},{"$f":"'Measure Summary'!E33","v":""},{"$f":"'Measure Summary'!C33","v":""},{"$f":"'Measure Summary'!F33","v":0},{"$f":"'Measure Summary'!AA33","v":""},{"$f":"'Measure Summary'!W33","v":0},{"$f":"'Measure Summary'!X33","v":""},{"$f":"IF('Measure Summary'!N33=\"\",\"\",'Measure Summary'!N33)","v":""},{"$f":"SUM('Measure Summary'!G33:H33)","v":0},{"$f":"SUM('Measure Summary'!I33:J33)","v":0},{"$f":"'Measure Summary'!K33","v":0},{"$f":"'Measure Summary'!L33","v":0},{"$f":"'Measure Summary'!M33","v":0},{"$f":"'Measure Summary'!O33","v":""},{"$f":"'Measure Summary'!Q33","v":""},{"$f":"'Measure Summary'!R33","v":""},{"$f":"IF('Measure Summary'!T33=\"N/A\",\"\",'Measure Summary'!T33)","v":0},{"$f":"'Measure Summary'!AD33","v":""},"",{"$f":"IF('Measure Summary'!AC33=\"\",\"\",'Measure Summary'!AC33)","v":""},"yes",null,{"$f":"'TRC Test'!E31","v":""},null,{"$f":"IF(OR(X31=\"ER\",X31=\"SC\"),'TRC Test'!M31,\"\")","v":""},{"$f":"IF(X31=\"\",\"\",'TRC Test'!F31)","v":""},{"$f":"IF(X31=\"\",\"\",'TRC Test'!G31)","v":""},{"$f":"IF(OR(X31=\"ER\",X31=\"SC\"),'TRC Test'!N31,\"\")","v":""},null,"","",null,{"$f":"IF('Measure Summary'!Y33=\"\",\"\",'Measure Summary'!Y33)","v":""}]

{"sheet":"Avoided Costs","index":16,"n_rows":33,"n_cols":52,"rows_kept":33,"cut":false,"hidden":true,"merged":[]}
[null,"Present Value Factor Calculations"]
[null,null,"Discount rate:",5.5E-2]
[null,"Avoided Cost Forecast"]
[null,"Year",2012,2013,2014,2015,2016,2017,2018,2019,2020,2021,2022,2023,2024,2025,2026,2027,2028,2029,2030,2031,2032,2033,2034,2035,2036,2037,2038,2039,2040,2041,2042,2043,2044,2045,2046,2047,2048,2049,2050,2051,2052,2053,2054,2055,2056,2057,2058,2059,2060,2061]
[null,"Avoided energy per kWh with line loss -Upstate(2008$)",6.5588502098988644E-2,6.5435445711828133E-2,6.5282747024346111E-2,6.5130405199274086E-2,6.5290245871708744E-2,6.5450478819310237E-2,6.5611105004785966E-2,6.5772125393206066E-2,6.5933540952009068E-2,6.6095352651007758E-2,6.6257561462395004E-2,6.6420168360749557E-2,6.6583174323042019E-2,6.6583174323042019E-2,6.6583174323042019E-2,6.6583174323042019E-2,6.6583174323042005E-2,6.6583174323042005E-2,6.6583174323042005E-2,6.6583174323042005E-2,6.6583174323042005E-2,6.6583174323042005E-2,6.6583174323042005E-2,6.6583174323042005E-2,6.6583174323042005E-2,6.6583174323042005E-2,6.6583174323042005E-2,6.6583174323042005E-2,6.6583174323042005E-2,6.6583174323042005E-2,6.6583174323042005E-2,6.6583174323042005E-2,6.6583174323042005E-2,6.6583174323042005E-2,6.6583174323042005E-2,6.6583174323042005E-2,6.6583174323042005E-2,6.6583174323042005E-2,6.6583174323042005E-2,6.6583174323042005E-2,6.6583174323042005E-2,6.6583174323042005E-2,6.6583174323042005E-2,6.6583174323042005E-2,6.6583174323042005E-2,6.6583174323042005E-2,6.6583174323042005E-2,6.6586025539465465E-2,6.6586025539465465E-2,6.6586025539465465E-2]
[null,"Avoided energy per kWh with line loss -Lower Hudson(2008$)",8.2733317921206181E-2,8.2091437401162343E-2,8.1454536865148627E-2,8.0822577676315802E-2,8.102092950790904E-2,8.1219768127355679E-2,8.141909472931283E-2,8.1618910511369408E-2,8.1819216674053424E-2,8.2020014420839171E-2,8.2221304958154509E-2,8.2423089495388027E-2,8.2625369244896343E-2,8.2625369244896343E-2,8.2625369244896343E-2,8.2625369244896357E-2,8.2625369244896343E-2,8.2625369244896343E-2,8.2625369244896343E-2,8.2625369244896343E-2,8.2625369244896343E-2,8.2625369244896343E-2,8.2625369244896343E-2,8.2625369244896343E-2,8.2625369244896343E-2,8.2625369244896343E-2,8.2625369244896343E-2,8.2625369244896343E-2,8.2625369244896343E-2,8.2625369244896343E-2,8.2625369244896343E-2,8.2625369244896343E-2,8.2625369244896343E-2,8.2625369244896343E-2,8.2625369244896343E-2,8.2625369244896343E-2,8.2625369244896343E-2,8.2625369244896343E-2,8.2625369244896343E-2,8.2625369244896343E-2,8.2625369244896343E-2,8.2625369244896343E-2,8.2625369244896343E-2,8.2625369244896343E-2,8.2625369244896343E-2,8.2625369244896343E-2,8.2625369244896343E-2,8.2629310344827595E-2,8.2629310344827595E-2,8.2629310344827595E-2]
[null,"Avoided energy per kWh with line loss -NYC(2008$)",8.4651579508867661E-2,8.4336349386247261E-2,8.4022293134578652E-2,8.3709406382537752E-2,8.3914842964182709E-2,8.4120783720817119E-2,8.4327229889768873E-2,8.4534182711402506E-2,8.4741643429126642E-2,8.4949613289401385E-2,8.5158093541745861E-2,8.5367085438745716E-2,8.5576590236060679E-2,8.5576590236060679E-2,8.5576590236060679E-2,8.5576590236060679E-2,8.5576590236060679E-2,8.5576590236060679E-2,8.5576590236060679E-2,8.5576590236060679E-2,8.5576590236060679E-2,8.5576590236060679E-2,8.5576590236060679E-2,8.5576590236060679E-2,8.5576590236060679E-2,8.5576590236060679E-2,8.5576590236060679E-2,8.5576590236060679E-2,8.5576590236060679E-2,8.5576590236060679E-2,8.5576590236060679E-2,8.5576590236060679E-2,8.5576590236060679E-2,8.5576590236060679E-2,8.5576590236060679E-2,8.5576590236060679E-2,8.5576590236060679E-2,8.5576590236060679E-2,8.5576590236060679E-2,8.5576590236060679E-2,8.5576590236060679E-2,8.5576590236060679E-2,8.5576590236060679E-2,8.5576590236060679E-2,8.5576590236060679E-2,8.5576590236060679E-2,8.5576590236060679E-2,8.5580000000000003E-2,8.5580000000000003E-2,8.5580000000000003E-2]
[null,"Avoided Capacity per KW with reserve margin, line loss and avoided distribution -Upstate(2008$)",99.234913793103445,105.54956896551722,111.48706896551724,117.06896551724135,122.32758620689656,127.26293103448275,131.90732758620689,136.27155172413794,140.3663793103448,144.21336206896549,144.21336206896549,144.21336206896549,144.21336206896549,144.21336206896549,144.21336206896549,144.21336206896549,144.21336206896549,144.21336206896549,144.21336206896549,144.21336206896549,144.21336206896549,144.21336206896549,144.21336206896549,144.21336206896549,144.21336206896549,144.21336206896549,144.21336206896549,144.21336206896549,144.21336206896549,144.21336206896549,144.21336206896549,144.21336206896549,144.21336206896549,144.21336206896549,144.21336206896549,144.21336206896549,144.21336206896549,144.21336206896549,144.21336206896549,144.21336206896549,144.21336206896549,144.21336206896549,144.21336206896549,144.21336206896549,144.21336206896549,144.21336206896549,144.21336206896549,144.21336206896501,144.21336206896501,144.21336206896501]
[null,"Avoided Capacity per KW with reserve margin, line loss and avoided distribution -NYC(2008$)",236.22844827586206,242.54310344827584,238.18965517241381,229.91379310344828,239.53663793103451,254.39655172413794,255.54956896551724,256.58405172413791,257.52155172413791,258.36206896551721,258.36206896551721,258.36206896551721,258.36206896551721,258.36206896551721,258.36206896551721,258.36206896551721,258.36206896551721,258.36206896551721,258.36206896551721,258.36206896551721,258.36206896551721,258.36206896551721,258.36206896551721,258.36206896551721,258.36206896551721,258.36206896551721,258.36206896551721,258.36206896551721,258.36206896551721,258.36206896551721,258.36206896551721,258.36206896551721,258.36206896551721,258.36206896551721,258.36206896551721,258.36206896551721,258.36206896551721,258.36206896551721,258.36206896551721,258.36206896551721,258.36206896551721,258.36206896551721,258.36206896551721,258.36206896551721,258.36206896551721,258.36206896551721,258.36206896551721,258.36200000000002,258.36200000000002,258.36200000000002]
[null,"Avoided gas $/MMBtu (Heating) -Downstate 2008$",13.190951389656604,13.190951389656604,13.190951389656604,13.190951389656604,13.266769846394517,13.34258830313243,13.418406759870344,13.418406759870344,13.418406759870344,13.418406759870344,13.418406759870344,13.418406759870344,13.418406759870344,13.418406759870344,13.42,13.42,13.42,13.42,13.42,13.42,13.42,13.42,13.42,13.42,13.42,13.42,13.42,13.42,13.42,13.42,13.42,13.42,13.42,13.42,13.42,13.42,13.42,13.42,13.42,13.42,13.42,13.42,13.42,13.42,13.42,13.42,13.42,13.42,13.42,13.42]
[null,"Avoided gas $/MMBtu (Heating) -Upstate2008$",9.7918893785465375,9.7918893785465375,9.7918893785465375,9.7918893785465375,9.8677078352844525,9.9435262920223639,10.019344748760279,10.019344748760279,10.019344748760279,10.019344748760279,10.019344748760279,10.019344748760279,10.019344748760279,10.019344748760279,10.02,10.02,10.02,10.02,10.02,10.02,10.02,10.02,10.02,10.02,10.02,10.02,10.02,10.02,10.02,10.02,10.02,10.02,10.02,10.02,10.02,10.02,10.02,10.02,10.02,10.02,10.02,10.02,10.02,10.02,10.02,10.02,10.02,10.02,10.02,10.02]
[null,"Natural gas $ per MMBtu (Hot Water) - Downstate",11.586722846755794,11.586722846755794,11.586722846755794,11.586722846755794,11.659522846755793,11.732322846755793,11.805122846755793,11.805122846755793,11.805122846755793,11.805122846755793,11.805122846755793,11.805122846755793,11.805122846755793,11.805122846755793,11.804166666666667,11.804166666666667,11.804166666666667,11.804166666666667,11.804166666666667,11.804166666666667,11.804166666666667,11.804166666666667,11.804166666666667,11.804166666666667,11.804166666666667,11.804166666666667,11.804166666666667,11.804166666666667,11.804166666666667,11.804166666666667,11.804166666666667,11.804166666666667,11.804166666666667,11.804166666666667,11.804166666666667,11.804166666666667,11.804166666666667,11.804166666666667,11.804166666666667,11.804166666666667,11.804166666666667,11.804166666666667,11.804166666666667,11.804166666666667,11.804166666666667,11.804166666666699,11.804166666666699,11.804166666666667,11.804166666666699,11.804166666666699]
[null,"Natural gas $ per MMBtu (Hot Water) - Upstate",9.0231722420115865,9.0231722420115865,9.0231722420115865,9.0231722420115865,9.0959722420115874,9.1687722420115847,9.2415722420115856,9.2415722420115856,9.2415722420115856,9.2415722420115856,9.2415722420115856,9.2415722420115856,9.2415722420115856,9.2415722420115856,9.2441666666666666,9.2441666666666666,9.2441666666666666,9.2441666666666666,9.2441666666666666,9.2441666666666666,9.2441666666666666,9.2441666666666666,9.2441666666666666,9.2441666666666666,9.2441666666666666,9.2441666666666666,9.2441666666666666,9.2441666666666666,9.2441666666666666,9.2441666666666666,9.2441666666666666,9.2441666666666666,9.2441666666666666,9.2441666666666666,9.2441666666666666,9.2441666666666666,9.2441666666666666,9.2441666666666666,9.2441666666666666,9.2441666666666666,9.2441666666666666,9.2441666666666666,9.2441666666666666,9.2441666666666666,9.2441666666666666,9.2441666666666702,9.2441666666666702,9.2441666666666666,9.2441666666666702,9.2441666666666702]
[null,"Residual Oil",7.2607266726146298,7.9112857970161548,8.1995068031839171,8.4073776927334265,8.5736326363918245,8.7208261649062617,8.8285181377174773,8.8829506598476691,9.0100552678251411,9.0500408716374903,9.1558646250250764,9.244954159045637,9.2425044625563437,9.3135366023628183,9.3834258849192018,9.4457625151136106,9.4294343454096037,9.4065940080935402,9.3718934835830296,9.3718934835830296,9.3718934835830296,9.3718934835830296,9.3718934835830296,9.3718934835830296,9.3718934835830296,9.3718934835830296,9.3718934835830296,9.3718934835830296,9.3718934835830296,9.3718934835830296,9.3718934835830296,9.3718934835830296,9.3718934835830296,9.3718934835830296,9.3718934835830296,9.3718934835830296,9.3718934835830296,9.3718934835830296,9.3718934835830296,9.3718934835830296,9.3718934835830296,9.3718934835830296,9.3718934835830296,9.3718934835830296,9.3718934835830296,9.3718934835830296,9.3718934835830296,9.3718934835830296,9.3718934835830296,9.3718934835830296]
[null,"Co2 Adder per KWh",6.1196529523205416E-3,5.9978268477040445E-3,5.8815987968481786E-3,5.7707817871553947E-3,5.7665380026881916E-3,5.762283803279443E-3,5.7580191633691807E-3,5.7537440573347037E-3,5.7494584594904299E-3,5.7451623440877425E-3,5.7408556853148322E-3,5.736538457296542E-3,5.7322106340942152E-3,5.7322106340942152E-3,5.7322106340942152E-3,5.7322106340942152E-3,5.7322106340942152E-3,5.7322106340942152E-3,5.7322106340942152E-3,5.7322106340942152E-3,5.7322106340942152E-3,5.7322106340942152E-3,5.7300000000000007E-3,5.7300000000000007E-3,5.7300000000000007E-3,5.7300000000000007E-3,5.7300000000000007E-3,5.7300000000000007E-3,5.7300000000000007E-3,5.7300000000000007E-3,5.7300000000000007E-3,5.7300000000000007E-3,5.7300000000000007E-3,5.7300000000000007E-3,5.7300000000000007E-3,5.7300000000000007E-3,5.7300000000000007E-3,5.7300000000000007E-3,5.7300000000000007E-3,5.7300000000000007E-3,5.7300000000000007E-3,5.7300000000000007E-3,5.7300000000000007E-3,5.7300000000000007E-3,5.7300000000000007E-3,5.7300000000000007E-3,5.7300000000000007E-3,5.7300000000000007E-3,5.7300000000000007E-3,5.7300000000000007E-3]
[null,"Co2 Adder per MMBtu Nat Gas",0.87750000000000006,0.87750000000000006,0.87750000000000006,0.87750000000000006,0.87750000000000006,0.87750000000000006,0.87750000000000006,0.87750000000000006,0.87750000000000006,0.87750000000000006,0.87750000000000006,0.87750000000000006,0.87750000000000006,0.87750000000000006,0.87750000000000006,0.87750000000000006,0.87750000000000006,0.87750000000000006,0.87750000000000006,0.87750000000000006,0.87750000000000006,0.87750000000000006,0.87750000000000006,0.87750000000000006,0.87750000000000006,0.87750000000000006,0.87750000000000006,0.87750000000000006,0.87750000000000006,0.87750000000000006,0.87750000000000006,0.87750000000000006,0.87750000000000006,0.87750000000000006,0.87750000000000006,0.87750000000000006,0.87750000000000006,0.87750000000000006,0.87750000000000006,0.87750000000000006,0.87750000000000006,0.87750000000000006,0.87750000000000006,0.87750000000000006,0.87750000000000006,0.87750000000000006,0.87750000000000006,{"$f":"(58.5/1000)*15","v":0.87750000000000006},0.87750000000000006,0.87750000000000006]
[null,"Co2 Adder per MMBtu Oil (place holder values)",0.87750000000000006,0.87750000000000006,0.87750000000000006,0.87750000000000006,0.87750000000000006,0.87750000000000006,0.87750000000000006,0.87750000000000006,0.87750000000000006,0.87750000000000006,0.87750000000000006,0.87750000000000006,0.87750000000000006,0.87750000000000006,0.87750000000000006,0.87750000000000006,0.87750000000000006,0.87750000000000006,0.87750000000000006,0.87750000000000006,0.87750000000000006,0.87750000000000006,0.87750000000000006,0.87750000000000006,0.87750000000000006,0.87750000000000006,0.87750000000000006,0.87750000000000006,0.87750000000000006,0.87750000000000006,0.87750000000000006,0.87750000000000006,0.87750000000000006,0.87750000000000006,0.87750000000000006,0.87750000000000006,0.87750000000000006,0.87750000000000006,0.87750000000000006,0.87750000000000006,0.87750000000000006,0.87750000000000006,0.87750000000000006,0.87750000000000006,0.87750000000000006,0.87750000000000006,0.87750000000000006,0.87750000000000006,0.87750000000000006,0.87750000000000006]
[]
[null,"Avoided Cost Present Value Forecast"]
[1,"Year",1,2,3,4,5,6,7,8,9,10,11,12,13,14,15,16,17,18,19,20,21,22,23,24,25,26,27,28,29,30,{"$f":"AF20+1","v":31},32,33,34,35,36,37,38,39,40,41,42,43,44,45,46,47,48,49,50]
[2,"Avoided energy per kWh with line loss -Upstate (Zones A-F, 2012$)",{"$f":"NPV($D$2,$C5:C5)*1.061*1.055","v":6.9589400727026948E-2},{"$f":"NPV($D$2,$C5:D5)*1.061*1.055","v":0.13539699115380388},{"$f":"NPV($D$2,$C5:E5)*1.061*1.055","v":0.19762829287014558},{"$f":"NPV($D$2,$C5:F5)*1.061*1.055","v":0.25647765841598985},{"$f":"NPV($D$2,$C5:G5)*1.061*1.055","v":0.31239594421611022},{"$f":"NPV($D$2,$C5:H5)*1.061*1.055","v":0.36552913703512346},{"$f":"NPV($D$2,$C5:I5)*1.061*1.055","v":0.41601595255078028},{"$f":"NPV($D$2,$C5:J5)*1.061*1.055","v":0.46398819750120701},{"$f":"NPV($D$2,$C5:K5)*1.061*1.055","v":0.50957111379486908},{"$f":"NPV($D$2,$C5:L5)*1.061*1.055","v":0.5528837054816278},{"$f":"NPV($D$2,$C5:M5)*1.061*1.055","v":0.59403904943851982},{"$f":"NPV($D$2,$C5:N5)*1.061*1.055","v":0.63314459058137174},{"$f":"NPV($D$2,$C5:O5)*1.061*1.055","v":0.67030242237296311},{"$f":"NPV($D$2,$C5:P5)*1.061*1.055","v":0.70552311601428208},{"$f":"NPV($D$2,$C5:Q5)*1.061*1.055","v":0.73890765975012929},{"$f":"NPV($D$2,$C5:R5)*1.061*1.055","v":0.77055177703529254},{"$f":"NPV($D$2,$C5:S5)*1.061*1.055","v":0.80054620100227181},{"$f":"NPV($D$2,$C5:T5)*1.061*1.055","v":0.8289769346202619},{"$f":"NPV($D$2,$C5:U5)*1.061*1.055","v":0.85592549729134237},{"$f":"NPV($D$2,$C5:V5)*1.061*1.055","v":0.88146915859094477},{"$f":"NPV($D$2,$C5:W5)*1.061*1.055","v":0.90568115982279529},{"$f":"NPV($D$2,$C5:X5)*1.061*1.055","v":0.92863092402360159},{"$f":"NPV($D$2,$C5:Y5)*1.061*1.055","v":0.95038425501962642},{"$f":"NPV($D$2,$C5:Z5)*1.061*1.055","v":0.97100352610590612},{"$f":"NPV($D$2,$C5:AA5)*1.061*1.055","v":0.99054785888910934},{"$f":"NPV($D$2,$C5:AB5)*1.061*1.055","v":1.0090732928068378},{"$f":"NPV($D$2,$C5:AC5)*1.061*1.055","v":1.0266329458094237},{"$f":"NPV($D$2,$C5:AD5)*1.061*1.055","v":1.0432771666649554},{"$f":"NPV($D$2,$C5:AE5)*1.061*1.055","v":1.0590536793242273},{"$f":"NPV($D$2,$C5:AF5)*1.061*1.055","v":1.0740077197595563},{"$f":"NPV($D$2,$C5:AG5)*1.061*1.055","v":1.0881821656698203},{"$f":"NPV($D$2,$C5:AH5)*1.061*1.055","v":1.1016176594236253},{"$f":"NPV($D$2,$C5:AI5)*1.061*1.055","v":1.1143527245931086},{"$f":"NPV($D$2,$C5:AJ5)*1.061*1.055","v":1.1264238764125243},{"$f":"NPV($D$2,$C5:AK5)*1.061*1.055","v":1.137865726478321},{"$f":"NPV($D$2,$C5:AL5)*1.061*1.055","v":1.1487110819909245},{"$f":"NPV($D$2,$C5:AM5)*1.061*1.055","v":1.1589910398227761},{"$f":"NPV($D$2,$C5:AN5)*1.061*1.055","v":1.1687350756823511},{"$f":"NPV($D$2,$C5:AO5)*1.061*1.055","v":1.1779711286298153},{"$f":"NPV($D$2,$C5:AP5)*1.061*1.055","v":1.186725681186654},{"$f":"NPV($D$2,$C5:AQ5)*1.061*1.055","v":1.1950238352689653},{"$f":"NPV($D$2,$C5:AR5)*1.061*1.055","v":1.2028893841621513},{"$f":"NPV($D$2,$C5:AS5)*1.061*1.055","v":1.2103448807433701},{"$f":"NPV($D$2,$C5:AT5)*1.061*1.055","v":1.2174117021473694},{"$f":"NPV($D$2,$C5:AU5)*1.061*1.055","v":1.2241101110611123},{"$f":"NPV($D$2,$C5:AV5)*1.061*1.055","v":1.2304593138229545},{"$f":"NPV($D$2,$C5:AW5)*1.061*1.055","v":1.2364775154929466},{"$f":"NPV($D$2,$C5:AX5)*1.061*1.055","v":1.2421822163277119},{"$f":"NPV($D$2,$C5:AY5)*1.061*1.055","v":1.247589515697157},{"$f":"NPV($D$2,$C5:AZ5)*1.061*1.055","v":1.2527149179430772}]
[3,"Avoided energy per kWh with line loss -Lower Hudson (Zones G-I, 2012$)",{"$f":"NPV($D$2,$C6:C6)*1.061*1.055","v":8.7780050314399755E-2},{"$f":"NPV($D$2,$C6:D6)*1.061*1.055","v":0.17033835844959713},{"$f":"NPV($D$2,$C6:E6)*1.061*1.055","v":0.247985548417408},{"$f":"NPV($D$2,$C6:F6)*1.061*1.055","v":0.32101376624406319},{"$f":"NPV($D$2,$C6:G6)*1.061*1.055","v":0.39040470560301294},{"$f":"NPV($D$2,$C6:H6)*1.061*1.055","v":0.45633952653136833},{"$f":"NPV($D$2,$C6:I6)*1.061*1.055","v":0.5189903661224825},{"$f":"NPV($D$2,$C6:J6)*1.061*1.055","v":0.57852078792701822},{"$f":"NPV($D$2,$C6:K6)*1.061*1.055","v":0.6350862089709296},{"$f":"NPV($D$2,$C6:L6)*1.061*1.055","v":0.68883430550518288},{"$f":"NPV($D$2,$C6:M6)*1.061*1.055","v":0.73990539854650894},{"$f":"NPV($D$2,$C6:N6)*1.061*1.055","v":0.78843282021573169},{"$f":"NPV($D$2,$C6:O6)*1.061*1.055","v":0.83454326183007077},{"$f":"NPV($D$2,$C6:P6)*1.061*1.055","v":0.87824984155930208},{"$f":"NPV($D$2,$C6:Q6)*1.061*1.055","v":0.91967787921734123},{"$f":"NPV($D$2,$C6:R6)*1.061*1.055","v":0.95894616135766264},{"$f":"NPV($D$2,$C6:S6)*1.061*1.055","v":0.99616728186981562},{"$f":"NPV($D$2,$C6:T6)*1.061*1.055","v":1.0314479648197237},{"$f":"NPV($D$2,$C6:U6)*1.061*1.055","v":1.0648893704594471},{"$f":"NPV($D$2,$C6:V6)*1.061*1.055","v":1.0965873852838293},{"$f":"NPV($D$2,$C6:W6)*1.061*1.055","v":1.1266328969657085},{"$f":"NPV($D$2,$C6:X6)*1.061*1.055","v":1.1551120549580107},{"$f":"NPV($D$2,$C6:Y6)*1.061*1.055","v":1.1821065175099561},{"$f":"NPV($D$2,$C6:Z6)*1.061*1.055","v":1.2076936858056389},{"$f":"NPV($D$2,$C6:AA6)*1.061*1.055","v":1.2319469258963336},{"$f":"NPV($D$2,$C6:AB6)*1.061*1.055","v":1.2549357790628684},{"$f":"NPV($D$2,$C6:AC6)*1.061*1.055","v":1.2767261612112433},{"$f":"NPV($D$2,$C6:AD6)*1.061*1.055","v":1.2973805518732093},{"$f":"NPV($D$2,$C6:AE6)*1.061*1.055","v":1.3169581733537461},{"$f":"NPV($D$2,$C6:AF6)*1.061*1.055","v":1.3355151605390891},{"$f":"NPV($D$2,$C6:AG6)*1.061*1.055","v":1.3531047218522108},{"$f":"NPV($D$2,$C6:AH6)*1.061*1.055","v":1.3697772918172546},{"$f":"NPV($D$2,$C6:AI6)*1.061*1.055","v":1.385580675670377},{"$f":"NPV($D$2,$C6:AJ6)*1.061*1.055","v":1.4005601864316302},{"$f":"NPV($D$2,$C6:AK6)*1.061*1.055","v":1.4147587748309225},{"$f":"NPV($D$2,$C6:AL6)*1.061*1.055","v":1.4282171524605833},{"$f":"NPV($D$2,$C6:AM6)*1.061*1.055","v":1.4409739085076554},{"$f":"NPV($D$2,$C6:AN6)*1.061*1.055","v":1.4530656204006147},{"$f":"NPV($D$2,$C6:AO6)*1.061*1.055","v":1.4645269586877798},{"$f":"NPV($D$2,$C6:AP6)*1.061*1.055","v":1.4753907864481257},{"$f":"NPV($D$2,$C6:AQ6)*1.061*1.055","v":1.4856882535195437},{"$f":"NPV($D$2,$C6:AR6)*1.061*1.055","v":1.4954488858147266},{"$f":"NPV($D$2,$C6:AS6)*1.061*1.055","v":1.504700669980777},{"$f":"NPV($D$2,$C6:AT6)*1.061*1.055","v":1.5134701336452794},{"$f":"NPV($D$2,$C6:AU6)*1.061*1.055","v":1.5217824214789313},{"$f":"NPV($D$2,$C6:AV6)*1.061*1.055","v":1.529661367292819},{"$f":"NPV($D$2,$C6:AW6)*1.061*1.055","v":1.5371295623770731},{"$f":"NPV($D$2,$C6:AX6)*1.061*1.055","v":1.5442087579272086},{"$f":"NPV($D$2,$C6:AY6)*1.061*1.055","v":1.5509188958894222},{"$f":"NPV($D$2,$C6:AZ6)*1.061*1.055","v":1.5572792162327527}]
[4,"Avoided energy per kWh with line loss -NYC (Zone J, 2012$)",{"$f":"NPV($D$2,$C7:C7)*1.061*1.055","v":8.9815325858908585E-2},{"$f":"NPV($D$2,$C7:D7)*1.061*1.055","v":0.17463131325114395},{"$f":"NPV($D$2,$C7:E7)*1.061*1.055","v":0.25472623745840611},{"$f":"NPV($D$2,$C7:F7)*1.061*1.055","v":0.33036288428655297},{"$f":"NPV($D$2,$C7:G7)*1.061*1.055","v":0.40223233598020425},{"$f":"NPV($D$2,$C7:H7)*1.061*1.055","v":0.47052222326833198},{"$f":"NPV($D$2,$C7:I7)*1.061*1.055","v":0.53541083165376591},{"$f":"NPV($D$2,$C7:J7)*1.061*1.055","v":0.59706756686601159},{"$f":"NPV($D$2,$C7:K7)*1.061*1.055","v":0.65565339713150317},{"$f":"NPV($D$2,$C7:L7)*1.061*1.055","v":0.71132127341593054},{"$f":"NPV($D$2,$C7:M7)*1.061*1.055","v":0.76421652873577595},{"$f":"NPV($D$2,$C7:N7)*1.061*1.055","v":0.81447725758154887},{"$f":"NPV($D$2,$C7:O7)*1.061*1.055","v":0.86223467644328455},{"$f":"NPV($D$2,$C7:P7)*1.061*1.055","v":0.9075023720468256},{"$f":"NPV($D$2,$C7:Q7)*1.061*1.055","v":0.95041014039141425},{"$f":"NPV($D$2,$C7:R7)*1.061*1.055","v":0.9910810108602186},{"$f":"NPV($D$2,$C7:S7)*1.061*1.055","v":1.0296315989823082},{"$f":"NPV($D$2,$C7:T7)*1.061*1.055","v":1.0661724408041937},{"$f":"NPV($D$2,$C7:U7)*1.061*1.055","v":1.1008083098296779},{"$f":"NPV($D$2,$C7:V7)*1.061*1.055","v":1.1336385174367718},{"$f":"NPV($D$2,$C7:W7)*1.061*1.055","v":1.1647571976330697},{"$f":"NPV($D$2,$C7:X7)*1.061*1.055","v":1.1942535769660529},{"$f":"NPV($D$2,$C7:Y7)*1.061*1.055","v":1.2222122303622458},{"$f":"NPV($D$2,$C7:Z7)*1.061*1.055","v":1.2487133236287795},{"$f":"NPV($D$2,$C7:AA7)*1.061*1.055","v":1.2738328433126973},{"$f":"NPV($D$2,$C7:AB7)*1.061*1.055","v":1.2976428145770746},{"$f":"NPV($D$2,$C7:AC7)*1.061*1.055","v":1.3202115077186642},{"$f":"NPV($D$2,$C7:AD7)*1.061*1.055","v":1.3416036339192237},{"$f":"NPV($D$2,$C7:AE7)*1.061*1.055","v":1.3618805307917916},{"$f":"NPV($D$2,$C7:AF7)*1.061*1.055","v":1.3811003382539413},{"$f":"NPV($D$2,$C7:AG7)*1.061*1.055","v":1.3993181652322821},{"$f":"NPV($D$2,$C7:AH7)*1.061*1.055","v":1.4165862476762072},{"$f":"NPV($D$2,$C7:AI7)*1.061*1.055","v":1.4329540983339561},{"$f":"NPV($D$2,$C7:AJ7)*1.061*1.055","v":1.4484686487204479},{"$f":"NPV($D$2,$C7:AK7)*1.061*1.055","v":1.4631743836839473},{"$f":"NPV($D$2,$C7:AL7)*1.061*1.055","v":1.4771134689574064},{"$f":"NPV($D$2,$C7:AM7)*1.061*1.055","v":1.4903258720602111},{"$f":"NPV($D$2,$C7:AN7)*1.061*1.055","v":1.5028494768969929},{"$f":"NPV($D$2,$C7:AO7)*1.061*1.055","v":1.5147201923820939},{"$f":"NPV($D$2,$C7:AP7)*1.061*1.055","v":1.5259720554011471},{"$f":"NPV($D$2,$C7:AQ7)*1.061*1.055","v":1.5366373284049892},{"$f":"NPV($D$2,$C7:AR7)*1.061*1.055","v":1.5467465919157399},{"$f":"NPV($D$2,$C7:AS7)*1.061*1.055","v":1.5563288322102902},{"$f":"NPV($D$2,$C7:AT7)*1.061*1.055","v":1.5654115244326132},{"$f":"NPV($D$2,$C7:AU7)*1.061*1.055","v":1.5740207113732032},{"$f":"NPV($D$2,$C7:AV7)*1.061*1.055","v":1.5821810781415355},{"$f":"NPV($D$2,$C7:AW7)*1.061*1.055","v":1.5899160229456415},{"$f":"NPV($D$2,$C7:AX7)*1.061*1.055","v":1.5972480163103728},{"$f":"NPV($D$2,$C7:AY7)*1.061*1.055","v":1.6041977730541936},{"$f":"NPV($D$2,$C7:AZ7)*1.061*1.055","v":1.610785220204735}]
[5,"Avoided Capacity per KW with reserve margin, line loss and avoided distribution -Upstate (Zones A-F & G-I, 2012$)",{"$f":"NPV($D$2,$C8:C8)*1.061*1.055","v":105.28824353448275},{"$f":"NPV($D$2,$C8:D8)*1.061*1.055","v":211.43809440880861},{"$f":"NPV($D$2,$C8:E8)*1.061*1.055","v":317.71403625415246},{"$f":"NPV($D$2,$C8:F8)*1.061*1.055","v":423.49311631236714},{"$f":"NPV($D$2,$C8:G8)*1.061*1.055","v":528.26142948730842},{"$f":"NPV($D$2,$C8:H8)*1.061*1.055","v":631.57443766308609},{"$f":"NPV($D$2,$C8:I8)*1.061*1.055","v":733.07525696070888},{"$f":"NPV($D$2,$C8:J8)*1.061*1.055","v":832.46770049211943},{"$f":"NPV($D$2,$C8:K8)*1.061*1.055","v":929.50949175894959},{"$f":"NPV($D$2,$C8:L8)*1.061*1.055","v":1024.0131779719404},{"$f":"NPV($D$2,$C8:M8)*1.061*1.055","v":1113.5901317283297},{"$f":"NPV($D$2,$C8:N8)*1.061*1.055","v":1198.4971969002625},{"$f":"NPV($D$2,$C8:O8)*1.061*1.055","v":1278.9778273949858},{"$f":"NPV($D$2,$C8:P8)*1.061*1.055","v":1355.2627852098894},{"$f":"NPV($D$2,$C8:Q8)*1.061*1.055","v":1427.5708020960535},{"$f":"NPV($D$2,$C8:R8)*1.061*1.055","v":1496.1092067274892},{"$f":"NPV($D$2,$C8:S8)*1.061*1.055","v":1561.0745191743474},{"$f":"NPV($D$2,$C8:T8)*1.061*1.055","v":1622.6530143846394},{"$f":"NPV($D$2,$C8:U8)*1.061*1.055","v":1681.0212562901299},{"$f":"NPV($D$2,$C8:V8)*1.061*1.055","v":1736.3466040678456},{"$f":"NPV($D$2,$C8:W8)*1.061*1.055","v":1788.7876920088088},{"$f":"NPV($D$2,$C8:X8)*1.061*1.055","v":1838.494884369911},{"$f":"NPV($D$2,$C8:Y8)*1.061*1.055","v":1885.6107065131359},{"$f":"NPV($D$2,$C8:Z8)*1.061*1.055","v":1930.2702535683256},{"$f":"NPV($D$2,$C8:AA8)*1.061*1.055","v":1972.6015777912537},{"$f":"NPV($D$2,$C8:AB8)*1.061*1.055","v":2012.7260557276786},{"$f":"NPV($D$2,$C8:AC8)*1.061*1.055","v":2050.7587362361387},{"$f":"NPV($D$2,$C8:AD8)*1.061*1.055","v":2086.8086703673803},{"$f":"NPV($D$2,$C8:AE8)*1.061*1.055","v":2120.9792240462821},{"$f":"NPV($D$2,$C8:AF8)*1.061*1.055","v":2153.3683744528244},{"$f":"NPV($D$2,$C8:AG8)*1.061*1.055","v":2184.0689909519165},{"$f":"NPV($D$2,$C8:AH8)*1.061*1.055","v":2213.1691013775958},{"$f":"NPV($D$2,$C8:AI8)*1.061*1.055","v":2240.7521444351123},{"$f":"NPV($D$2,$C8:AJ8)*1.061*1.055","v":2266.8972089446065},{"$f":"NPV($D$2,$C8:AK8)*1.061*1.055","v":2291.6792606123731},{"$f":"NPV($D$2,$C8:AL8)*1.061*1.055","v":2315.1693569799245},{"$f":"NPV($D$2,$C8:AM8)*1.061*1.055","v":2337.4348511671774},{"$f":"NPV($D$2,$C8:AN8)*1.061*1.055","v":2358.5395849939569},{"$f":"NPV($D$2,$C8:AO8)*1.061*1.055","v":2378.5440720335587},{"$f":"NPV($D$2,$C8:AP8)*1.061*1.055","v":2397.5056711232287},{"$f":"NPV($D$2,$C8:AQ8)*1.061*1.055","v":2415.4787508290765},{"$f":"NPV($D$2,$C8:AR8)*1.061*1.055","v":2432.5148453369898},{"$f":"NPV($D$2,$C8:AS8)*1.061*1.055","v":2448.6628022165287},{"$f":"NPV($D$2,$C8:AT8)*1.061*1.055","v":2463.9689224814933},{"$f":"NPV($D$2,$C8:AU8)*1.061*1.055","v":2478.4770933487598},{"$f":"NPV($D$2,$C8:AV8)*1.061*1.055","v":2492.2289140760249},{"$f":"NPV($D$2,$C8:AW8)*1.061*1.055","v":2505.263815239311},{"$f":"NPV($D$2,$C8:AX8)*1.061*1.055","v":2517.6191717921884},{"$f":"NPV($D$2,$C8:AY8)*1.061*1.055","v":2529.3304102309339},{"$f":"NPV($D$2,$C8:AZ8)*1.061*1.055","v":2540.4311101728736}]
[6,"Avoided Capacity per KW with reserve margin, line loss and avoided distribution -NYC (Zone J, 2012$)",{"$f":"NPV($D$2,$C9:C9)*1.061*1.055","v":250.63838362068964},{"$f":"NPV($D$2,$C9:D9)*1.061*1.055","v":494.56087912649122},{"$f":"NPV($D$2,$C9:E9)*1.061*1.055","v":721.61707655056614},{"$f":"NPV($D$2,$C9:F9)*1.061*1.055","v":929.3584657370601},{"$f":"NPV($D$2,$C9:G9)*1.061*1.055","v":1134.5112875804152},{"$f":"NPV($D$2,$C9:H9)*1.061*1.055","v":1341.0323288178211},{"$f":"NPV($D$2,$C9:I9)*1.061*1.055","v":1537.6741007027263},{"$f":"NPV($D$2,$C9:J9)*1.061*1.055","v":1724.8189269660834},{"$f":"NPV($D$2,$C9:K9)*1.061*1.055","v":1902.8555251308851},{"$f":"NPV($D$2,$C9:L9)*1.061*1.055","v":2072.1613893349249},{"$f":"NPV($D$2,$C9:M9)*1.061*1.055","v":2232.6408814714555},{"$f":"NPV($D$2,$C9:N9)*1.061*1.055","v":2384.7541441601106},{"$f":"NPV($D$2,$C9:O9)*1.061*1.055","v":2528.937331542721},{"$f":"NPV($D$2,$C9:P9)*1.061*1.055","v":2665.6038598674713},{"$f":"NPV($D$2,$C9:Q9)*1.061*1.055","v":2795.1455928767127},{"$f":"NPV($D$2,$C9:R9)*1.061*1.055","v":2917.9339653973211},{"$f":"NPV($D$2,$C9:S9)*1.061*1.055","v":3034.3210483552434},{"$f":"NPV($D$2,$C9:T9)*1.061*1.055","v":3144.6405582679658},{"$f":"NPV($D$2,$C9:U9)*1.061*1.055","v":3249.2088141094091},{"$f":"NPV($D$2,$C9:V9)*1.061*1.055","v":3348.3256442908719},{"$f":"NPV($D$2,$C9:W9)*1.061*1.055","v":3442.2752463586089},{"$f":"NPV($D$2,$C9:X9)*1.061*1.055","v":3531.3270018730523},{"$f":"NPV($D$2,$C9:Y9)*1.061*1.055","v":3615.7362488061735},{"$f":"NPV($D$2,$C9:Z9)*1.061*1.055","v":3695.7450136716907},{"$f":"NPV($D$2,$C9:AA9)*1.061*1.055","v":3771.5827054873475},{"$f":"NPV($D$2,$C9:AB9)*1.061*1.055","v":3843.4667735590597},{"$f":"NPV($D$2,$C9:AC9)*1.061*1.055","v":3911.6033309730055},{"$f":"NPV($D$2,$C9:AD9)*1.061*1.055","v":3976.1877455833801},{"$f":"NPV($D$2,$C9:AE9)*1.061*1.055","v":4037.4052001903706},{"$f":"NPV($D$2,$C9:AF9)*1.061*1.055","v":4095.4312235145321},{"$f":"NPV($D$2,$C9:AG9)*1.061*1.055","v":4150.4321934900408},{"$f":"NPV($D$2,$C9:AH9)*1.061*1.055","v":4202.5658143199062},{"$f":"NPV($D$2,$C9:AI9)*1.061*1.055","v":4251.9815686610118},{"$f":"NPV($D$2,$C9:AJ9)*1.061*1.055","v":4298.8211462355184},{"$f":"NPV($D$2,$C9:AK9)*1.061*1.055","v":4343.2188500976108},{"$f":"NPV($D$2,$C9:AL9)*1.061*1.055","v":4385.3019817204477},{"$f":"NPV($D$2,$C9:AM9)*1.061*1.055","v":4425.1912060074956},{"$f":"NPV($D$2,$C9:AN9)*1.061*1.055","v":4463.0008972748401},{"$f":"NPV($D$2,$C9:AO9)*1.061*1.055","v":4498.8394671964934},{"$f":"NPV($D$2,$C9:AP9)*1.061*1.055","v":4532.8096756530376},{"$f":"NPV($D$2,$C9:AQ9)*1.061*1.055","v":4565.0089253748802},{"$f":"NPV($D$2,$C9:AR9)*1.061*1.055","v":4595.5295412249679},{"$f":"NPV($D$2,$C9:AS9)*1.061*1.055","v":4624.4590349217333},{"$f":"NPV($D$2,$C9:AT9)*1.061*1.055","v":4651.8803559613216},{"$f":"NPV($D$2,$C9:AU9)*1.061*1.055","v":4677.8721294585612},{"$f":"NPV($D$2,$C9:AV9)*1.061*1.055","v":4702.5088815886475},{"$f":"NPV($D$2,$C9:AW9)*1.061*1.055","v":4725.8612532759316},{"$f":"NPV($D$2,$C9:AX9)*1.061*1.055","v":4747.9961968339903},{"$f":"NPV($D$2,$C9:AY9)*1.061*1.055","v":4768.9771859885495},{"$f":"NPV($D$2,$C9:AZ9)*1.061*1.055","v":4788.8643794999789}]
[7,"Avoided gas $/MMBtu (Heating) -Downstate 2012$",{"$f":"NPV($D$2,$C10:C10)*1.061*1.055","v":13.995599424425656},{"$f":"NPV($D$2,$C10:D10)*1.061*1.055","v":27.261570442838604},{"$f":"NPV($D$2,$C10:E10)*1.061*1.055","v":39.835950555078362},{"$f":"NPV($D$2,$C10:F10)*1.061*1.055","v":51.754794263362484},{"$f":"NPV($D$2,$C10:G10)*1.061*1.055","v":63.117211696631252},{"$f":"NPV($D$2,$C10:H10)*1.061*1.055","v":73.948825609987182},{"$f":"NPV($D$2,$C10:I10)*1.061*1.055","v":84.274099457306136},{"$f":"NPV($D$2,$C10:J10)*1.061*1.055","v":94.061088886044502},{"$f":"NPV($D$2,$C10:K10)*1.061*1.055","v":103.3378561170761},{"$f":"NPV($D$2,$C10:L10)*1.061*1.055","v":112.13100041189284},{"$f":"NPV($D$2,$C10:M10)*1.061*1.055","v":120.46573434062903},{"$f":"NPV($D$2,$C10:N10)*1.061*1.055","v":128.3659560740283},{"$f":"NPV($D$2,$C10:O10)*1.061*1.055","v":135.85431790663424},{"$f":"NPV($D$2,$C10:P10)*1.061*1.055","v":142.95229120768252},{"$f":"NPV($D$2,$C10:Q10)*1.061*1.055","v":149.68102683031003},{"$f":"NPV($D$2,$C10:R10)*1.061*1.055","v":156.05897528777686},{"$f":"NPV($D$2,$C10:S10)*1.061*1.055","v":162.10442406262692},{"$f":"NPV($D$2,$C10:T10)*1.061*1.055","v":167.83470726153695},{"$f":"NPV($D$2,$C10:U10)*1.061*1.055","v":173.26625531737582},{"$f":"NPV($D$2,$C10:V10)*1.061*1.055","v":178.4146421001615},{"$f":"NPV($D$2,$C10:W10)*1.061*1.055","v":183.2946295719963},{"$f":"NPV($D$2,$C10:X10)*1.061*1.055","v":187.92021011401977},{"$f":"NPV($D$2,$C10:Y10)*1.061*1.055","v":192.30464664674344},{"$f":"NPV($D$2,$C10:Z10)*1.061*1.055","v":196.4605106588038},{"$f":"NPV($D$2,$C10:AA10)*1.061*1.055","v":200.39971825317383},{"$f":"NPV($D$2,$C10:AB10)*1.061*1.055","v":204.13356431418805},{"$f":"NPV($D$2,$C10:AC10)*1.061*1.055","v":207.67275489334844},{"$f":"NPV($D$2,$C10:AD10)*1.061*1.055","v":211.02743790677061},{"$f":"NPV($D$2,$C10:AE10)*1.061*1.055","v":214.20723223228924},{"$f":"NPV($D$2,$C10:AF10)*1.061*1.055","v":217.2212552896529},{"$f":"NPV($D$2,$C10:AG10)*1.061*1.055","v":220.07814918288858},{"$f":"NPV($D$2,$C10:AH10)*1.061*1.055","v":222.78610547979446},{"$f":"NPV($D$2,$C10:AI10)*1.061*1.055","v":225.35288869961045},{"$f":"NPV($D$2,$C10:AJ10)*1.061*1.055","v":227.78585857621331},{"$f":"NPV($D$2,$C10:AK10)*1.061*1.055","v":230.09199116067097},{"$f":"NPV($D$2,$C10:AL10)*1.061*1.055","v":232.27789882366406},{"$f":"NPV($D$2,$C10:AM10)*1.061*1.055","v":234.34984921512662},{"$f":"NPV($D$2,$C10:AN10)*1.061*1.055","v":236.31378323547031},{"$f":"NPV($D$2,$C10:AO10)*1.061*1.055","v":238.17533206991934},{"$f":"NPV($D$2,$C10:AP10)*1.061*1.055","v":239.93983333479986},{"$f":"NPV($D$2,$C10:AQ10)*1.061*1.055","v":241.61234638208006},{"$f":"NPV($D$2,$C10:AR10)*1.061*1.055","v":243.19766680604226},{"$f":"NPV($D$2,$C10:AS10)*1.061*1.055","v":244.70034019368421},{"$f":"NPV($D$2,$C10:AT10)*1.061*1.055","v":246.12467515827373},{"$f":"NPV($D$2,$C10:AU10)*1.061*1.055","v":247.47475569342967},{"$f":"NPV($D$2,$C10:AV10)*1.061*1.055","v":248.75445288315095},{"$f":"NPV($D$2,$C10:AW10)*1.061*1.055","v":249.96743600137015},{"$f":"NPV($D$2,$C10:AX10)*1.061*1.055","v":251.11718303285753},{"$f":"NPV($D$2,$C10:AY10)*1.061*1.055","v":252.20699064564181},{"$f":"NPV($D$2,$C10:AZ10)*1.061*1.055","v":253.23998364354159}]
[8,"Avoided gas $/MMBtu (Heating) -Upstate 2012$",{"$f":"NPV($D$2,$C11:C11)*1.061*1.055","v":10.389194630637876},{"$f":"NPV($D$2,$C11:D11)*1.061*1.055","v":20.236772479583731},{"$f":"NPV($D$2,$C11:E11)*1.061*1.055","v":29.570969492802554},{"$f":"NPV($D$2,$C11:F11)*1.061*1.055","v":38.418549600118972},{"$f":"NPV($D$2,$C11:G11)*1.061*1.055","v":46.869816700716925},{"$f":"NPV($D$2,$C11:H11)*1.061*1.055","v":54.942046412489105},{"$f":"NPV($D$2,$C11:I11)*1.061*1.055","v":62.65179021091356},{"$f":"NPV($D$2,$C11:J11)*1.061*1.055","v":69.959604237856169},{"$f":"NPV($D$2,$C11:K11)*1.061*1.055","v":76.886442178086156},{"$f":"NPV($D$2,$C11:L11)*1.061*1.055","v":83.452165344180898},{"$f":"NPV($D$2,$C11:M11)*1.061*1.055","v":89.675599624839421},{"$f":"NPV($D$2,$C11:N11)*1.061*1.055","v":95.574589464326181},{"$f":"NPV($D$2,$C11:O11)*1.061*1.055","v":101.16604902782073},{"$f":"NPV($D$2,$C11:P11)*1.061*1.055","v":106.46601069937955},{"$f":"NPV($D$2,$C11:Q11)*1.061*1.055","v":111.48999959198223},{"$f":"NPV($D$2,$C11:R11)*1.061*1.055","v":116.25207437170039},{"$f":"NPV($D$2,$C11:S11)*1.061*1.055","v":120.76588932877922},{"$f":"NPV($D$2,$C11:T11)*1.061*1.055","v":125.04438691842738},{"$f":"NPV($D$2,$C11:U11)*1.061*1.055","v":129.09983487070053},{"$f":"NPV($D$2,$C11:V11)*1.061*1.055","v":132.94386136574616},{"$f":"NPV($D$2,$C11:W11)*1.061*1.055","v":136.58748837526807},{"$f":"NPV($D$2,$C11:X11)*1.061*1.055","v":140.04116326581018},{"$f":"NPV($D$2,$C11:Y11)*1.061*1.055","v":143.3147887544757},{"$f":"NPV($D$2,$C11:Z11)*1.061*1.055","v":146.41775130297384},{"$f":"NPV($D$2,$C11:AA11)*1.061*1.055","v":149.35894803140806},{"$f":"NPV($D$2,$C11:AB11)*1.061*1.055","v":152.14681222897607},{"$f":"NPV($D$2,$C11:AC11)*1.061*1.055","v":154.78933753472768},{"$f":"NPV($D$2,$C11:AD11)*1.061*1.055","v":157.29410085771505},{"$f":"NPV($D$2,$C11:AE11)*1.061*1.055","v":159.66828410225281},{"$f":"NPV($D$2,$C11:AF11)*1.061*1.055","v":161.91869476058244},{"$f":"NPV($D$2,$C11:AG11)*1.061*1.055","v":164.05178543198497},{"$f":"NPV($D$2,$C11:AH11)*1.061*1.055","v":166.07367232430963},{"$f":"NPV($D$2,$C11:AI11)*1.061*1.055","v":167.99015279096807},{"$f":"NPV($D$2,$C11:AJ11)*1.061*1.055","v":169.80672195367748},{"$f":"NPV($D$2,$C11:AK11)*1.061*1.055","v":171.52858845861533},{"$f":"NPV($D$2,$C11:AL11)*1.061*1.055","v":173.16068941116302},{"$f":"NPV($D$2,$C11:AM11)*1.061*1.055","v":174.70770453206131},{"$f":"NPV($D$2,$C11:AN11)*1.061*1.055","v":176.17406957556685},{"$f":"NPV($D$2,$C11:AO11)*1.061*1.055","v":177.56398904808387},{"$f":"NPV($D$2,$C11:AP11)*1.061*1.055","v":178.88144826373991},{"$f":"NPV($D$2,$C11:AQ11)*1.061*1.055","v":180.13022477147067},{"$f":"NPV($D$2,$C11:AR11)*1.061*1.055","v":181.31389918638138},{"$f":"NPV($D$2,$C11:AS11)*1.061*1.055","v":182.4358654564389},{"$f":"NPV($D$2,$C11:AT11)*1.061*1.055","v":183.49934059393422},{"$f":"NPV($D$2,$C11:AU11)*1.061*1.055","v":184.50737389961697},{"$f":"NPV($D$2,$C11:AV11)*1.061*1.055","v":185.46285570595131},{"$f":"NPV($D$2,$C11:AW11)*1.061*1.055","v":186.3685256645621},{"$f":"NPV($D$2,$C11:AX11)*1.061*1.055","v":187.22698060163393},{"$f":"NPV($D$2,$C11:AY11)*1.061*1.055","v":188.04068196378734},{"$f":"NPV($D$2,$C11:AZ11)*1.061*1.055","v":188.81196287578103}]
[9,"Natural gas $ per MMBtu (Hot Water) - Downstate (2012$)",{"$f":"NPV($D$2,$C12:C12)*1.061*1.055","v":12.293512940407895},{"$f":"NPV($D$2,$C12:D12)*1.061*1.055","v":23.946131841268464},{"$f":"NPV($D$2,$C12:E12)*1.061*1.055","v":34.991268240188425},{"$f":"NPV($D$2,$C12:F12)*1.061*1.055","v":45.460591841060427},{"$f":"NPV($D$2,$C12:G12)*1.061*1.055","v":55.44647138758603},{"$f":"NPV($D$2,$C12:H12)*1.061*1.055","v":64.97085964687669},{"$f":"NPV($D$2,$C12:I12)*1.061*1.055","v":74.054734385159932},{"$f":"NPV($D$2,$C12:J12)*1.061*1.055","v":82.665042193959195},{"$f":"NPV($D$2,$C12:K12)*1.061*1.055","v":90.826471396612561},{"$f":"NPV($D$2,$C12:L12)*1.061*1.055","v":98.562423247468814},{"$f":"NPV($D$2,$C12:M12)*1.061*1.055","v":105.89507903027095},{"$f":"NPV($D$2,$C12:N12)*1.061*1.055","v":112.84546365851941},{"$f":"NPV($D$2,$C12:O12)*1.061*1.055","v":119.43350596017673},{"$f":"NPV($D$2,$C12:P12)*1.061*1.055","v":125.67809581956756},{"$f":"NPV($D$2,$C12:Q12)*1.061*1.055","v":131.59665891535238},{"$f":"NPV($D$2,$C12:R12)*1.061*1.055","v":137.20667132841854},{"$f":"NPV($D$2,$C12:S12)*1.061*1.055","v":142.52421863938173},{"$f":"NPV($D$2,$C12:T12)*1.061*1.055","v":147.56454784408615},{"$f":"NPV($D$2,$C12:U12)*1.061*1.055","v":152.3421110712942},{"$f":"NPV($D$2,$C12:V12)*1.061*1.055","v":156.87060702125439},{"$f":"NPV($D$2,$C12:W12)*1.061*1.055","v":161.16302024396549},{"$f":"NPV($D$2,$C12:X12)*1.061*1.055","v":165.23165836975798},{"$f":"NPV($D$2,$C12:Y12)*1.061*1.055","v":169.08818739894519},{"$f":"NPV($D$2,$C12:Z12)*1.061*1.055","v":172.74366515172929},{"$f":"NPV($D$2,$C12:AA12)*1.061*1.055","v":176.20857297427344},{"$f":"NPV($D$2,$C12:AB12)*1.061*1.055","v":179.49284579185081},{"$f":"NPV($D$2,$C12:AC12)*1.061*1.055","v":182.60590059524171},{"$f":"NPV($D$2,$C12:AD12)*1.061*1.055","v":185.55666344205775},{"$f":"NPV($D$2,$C12:AE12)*1.061*1.055","v":188.35359505041413},{"$f":"NPV($D$2,$C12:AF12)*1.061*1.055","v":191.00471505833491},{"$f":"NPV($D$2,$C12:AG12)*1.061*1.055","v":193.51762501844945},{"$f":"NPV($D$2,$C12:AH12)*1.061*1.055","v":195.89953019391339},{"$f":"NPV($D$2,$C12:AI12)*1.061*1.055","v":198.15726021804983},{"$f":"NPV($D$2,$C12:AJ12)*1.061*1.055","v":200.29728867694695},{"$f":"NPV($D$2,$C12:AK12)*1.061*1.055","v":202.32575167116221},{"$f":"NPV($D$2,$C12:AL12)*1.061*1.055","v":204.24846540975486},{"$f":"NPV($D$2,$C12:AM12)*1.061*1.055","v":206.07094288709388},{"$f":"NPV($D$2,$C12:AN12)*1.061*1.055","v":207.79840969025886},{"$f":"NPV($D$2,$C12:AO12)*1.061*1.055","v":209.43581898235837},{"$f":"NPV($D$2,$C12:AP12)*1.061*1.055","v":210.98786570472751},{"$f":"NPV($D$2,$C12:AQ12)*1.061*1.055","v":212.45900003872677},{"$f":"NPV($D$2,$C12:AR12)*1.061*1.055","v":213.85344016574021},{"$f":"NPV($D$2,$C12:AS12)*1.061*1.055","v":215.17518436196153},{"$f":"NPV($D$2,$C12:AT12)*1.061*1.055","v":216.42802246264523},{"$f":"NPV($D$2,$C12:AU12)*1.061*1.055","v":217.61554672869616},{"$f":"NPV($D$2,$C12:AV12)*1.061*1.055","v":218.74116214675388},{"$f":"NPV($D$2,$C12:AW12)*1.061*1.055","v":219.80809619230624},{"$f":"NPV($D$2,$C12:AX12)*1.061*1.055","v":220.81940808382507},{"$f":"NPV($D$2,$C12:AY12)*1.061*1.055","v":221.77799755445903},{"$f":"NPV($D$2,$C12:AZ12)*1.061*1.055","v":222.68661316643431}]
[10,"Natural gas $ per MMBtu (Hot Water) - Upstate (2012$)",{"$f":"NPV($D$2,$C13:C13)*1.061*1.055","v":9.5735857487742937},{"$f":"NPV($D$2,$C13:D13)*1.061*1.055","v":18.648074610171726},{"$f":"NPV($D$2,$C13:E13)*1.061*1.055","v":27.249485853202472},{"$f":"NPV($D$2,$C13:F13)*1.061*1.055","v":35.402482292094177},{"$f":"NPV($D$2,$C13:G13)*1.061*1.055","v":43.192791068970195},{"$f":"NPV($D$2,$C13:H13)*1.061*1.055","v":50.636069593995842},{"$f":"NPV($D$2,$C13:I13)*1.061*1.055","v":57.74732847041652},{"$f":"NPV($D$2,$C13:J13)*1.061*1.055","v":64.487858211099621},{"$f":"NPV($D$2,$C13:K13)*1.061*1.055","v":70.87698592738694},{"$f":"NPV($D$2,$C13:L13)*1.061*1.055","v":76.933031156095268},{"$f":"NPV($D$2,$C13:M13)*1.061*1.055","v":82.673358387098446},{"$f":"NPV($D$2,$C13:N13)*1.061*1.055","v":88.114426852504295},{"$f":"NPV($D$2,$C13:O13)*1.061*1.055","v":93.271837720187563},{"$f":"NPV($D$2,$C13:P13)*1.061*1.055","v":98.160378826996336},{"$f":"NPV($D$2,$C13:Q13)*1.061*1.055","v":102.79536791429186},{"$f":"NPV($D$2,$C13:R13)*1.061*1.055","v":107.18872249940608},{"$f":"NPV($D$2,$C13:S13)*1.061*1.055","v":111.35303964169447},{"$f":"NPV($D$2,$C13:T13)*1.061*1.055","v":115.30025968177821},{"$f":"NPV($D$2,$C13:U13)*1.061*1.055","v":119.04170047806613},{"$f":"NPV($D$2,$C13:V13)*1.061*1.055","v":122.58808985843385},{"$f":"NPV($D$2,$C13:W13)*1.061*1.055","v":125.94959638010938},{"$f":"NPV($D$2,$C13:X13)*1.061*1.055","v":129.13585848596298},{"$f":"NPV($D$2,$C13:Y13)*1.061*1.055","v":132.15601214080053},{"$f":"NPV($D$2,$C13:Z13)*1.061*1.055","v":135.01871702690246},{"$f":"NPV($D$2,$C13:AA13)*1.061*1.055","v":137.73218137391854},{"$f":"NPV($D$2,$C13:AB13)*1.061*1.055","v":140.30418549431286},{"$f":"NPV($D$2,$C13:AC13)*1.061*1.055","v":142.74210409184306},{"$f":"NPV($D$2,$C13:AD13)*1.061*1.055","v":145.05292740703757},{"$f":"NPV($D$2,$C13:AE13)*1.061*1.055","v":147.2432812603025},{"$f":"NPV($D$2,$C13:AF13)*1.061*1.055","v":149.31944605012706},{"$f":"NPV($D$2,$C13:AG13)*1.061*1.055","v":151.28737476086127},{"$f":"NPV($D$2,$C13:AH13)*1.061*1.055","v":153.15271003169934},{"$f":"NPV($D$2,$C13:AI13)*1.061*1.055","v":154.92080033581132},{"$f":"NPV($D$2,$C13:AJ13)*1.061*1.055","v":156.59671531601219},{"$f":"NPV($D$2,$C13:AK13)*1.061*1.055","v":158.18526032094195},{"$f":"NPV($D$2,$C13:AL13)*1.061*1.055","v":159.69099018343465},{"$f":"NPV($D$2,$C13:AM13)*1.061*1.055","v":161.11822228058406},{"$f":"NPV($D$2,$C13:AN13)*1.061*1.055","v":162.47104891295319},{"$f":"NPV($D$2,$C13:AO13)*1.061*1.055","v":163.75334903842159},{"$f":"NPV($D$2,$C13:AP13)*1.061*1.055","v":164.96879939431577},{"$f":"NPV($D$2,$C13:AQ13)*1.061*1.055","v":166.12088503971313},{"$f":"NPV($D$2,$C13:AR13)*1.061*1.055","v":167.21290934814667},{"$f":"NPV($D$2,$C13:AS13)*1.061*1.055","v":168.24800347936321},{"$f":"NPV($D$2,$C13:AT13)*1.061*1.055","v":169.22913535729364},{"$f":"NPV($D$2,$C13:AU13)*1.061*1.055","v":170.1591181799765},{"$f":"NPV($D$2,$C13:AV13)*1.061*1.055","v":171.04061848583703},{"$f":"NPV($D$2,$C13:AW13)*1.061*1.055","v":171.8761637994489},{"$f":"NPV($D$2,$C13:AX13)*1.061*1.055","v":172.66814987870185},{"$f":"NPV($D$2,$C13:AY13)*1.061*1.055","v":173.41884758415495},{"$f":"NPV($D$2,$C13:AZ13)*1.061*1.055","v":174.13040939027158}]
[11,"Residual Oil",{"$f":"NPV($D$2,$C14:C14)*1.061*1.055","v":7.7036309996441217},{"$f":"NPV($D$2,$C14:D14)*1.061*1.055","v":15.659909891240462},{"$f":"NPV($D$2,$C14:E14)*1.061*1.055","v":23.476155454617867},{"$f":"NPV($D$2,$C14:F14)*1.061*1.055","v":31.072743278812162},{"$f":"NPV($D$2,$C14:G14)*1.061*1.055","v":38.415690662545913},{"$f":"NPV($D$2,$C14:H14)*1.061*1.055","v":45.495323180442043},{"$f":"NPV($D$2,$C14:I14)*1.061*1.055","v":52.28874277706457},{"$f":"NPV($D$2,$C14:J14)*1.061*1.055","v":58.767704531595086},{"$f":"NPV($D$2,$C14:K14)*1.061*1.055","v":64.996773820828039},{"$f":"NPV($D$2,$C14:L14)*1.061*1.055","v":70.927307652630446},{"$f":"NPV($D$2,$C14:M14)*1.061*1.055","v":76.614398296307556},{"$f":"NPV($D$2,$C14:N14)*1.061*1.055","v":82.057457899329876},{"$f":"NPV($D$2,$C14:O14)*1.061*1.055","v":87.215389007968113},{"$f":"NPV($D$2,$C14:P14)*1.061*1.055","v":92.141997309902308},{"$f":"NPV($D$2,$C14:Q14)*1.061*1.055","v":96.846810425710132},{"$f":"NPV($D$2,$C14:R14)*1.061*1.055","v":101.33597484172108},{"$f":"NPV($D$2,$C14:S14)*1.061*1.055","v":105.58375146698084},{"$f":"NPV($D$2,$C14:T14)*1.061*1.055","v":109.60032729436878},{"$f":"NPV($D$2,$C14:U14)*1.061*1.055","v":113.39346364535868},{"$f":"NPV($D$2,$C14:V14)*1.061*1.055","v":116.98885355151026},{"$f":"NPV($D$2,$C14:W14)*1.061*1.055","v":120.39680606918947},{"$f":"NPV($D$2,$C14:X14)*1.061*1.055","v":123.62709281580484},{"$f":"NPV($D$2,$C14:Y14)*1.061*1.055","v":126.68897598795212},{"$f":"NPV($D$2,$C14:Z14)*1.061*1.055","v":129.59123491889738},{"$f":"NPV($D$2,$C14:AA14)*1.061*1.055","v":132.34219125154695},{"$f":"NPV($D$2,$C14:AB14)*1.061*1.055","v":134.94973279908206},{"$f":"NPV($D$2,$C14:AC14)*1.061*1.055","v":137.42133616167459},{"$f":"NPV($D$2,$C14:AD14)*1.061*1.055","v":139.76408816413198},{"$f":"NPV($D$2,$C14:AE14)*1.061*1.055","v":141.98470617593992},{"$f":"NPV($D$2,$C14:AF14)*1.061*1.055","v":144.08955737196641},{"$f":"NPV($D$2,$C14:AG14)*1.061*1.055","v":146.08467698905312},{"$f":"NPV($D$2,$C14:AH14)*1.061*1.055","v":147.97578563084144},{"$f":"NPV($D$2,$C14:AI14)*1.061*1.055","v":149.7683056704513},{"$f":"NPV($D$2,$C14:AJ14)*1.061*1.055","v":151.46737679804355},{"$f":"NPV($D$2,$C14:AK14)*1.061*1.055","v":153.07787075784663},{"$f":"NPV($D$2,$C14:AL14)*1.061*1.055","v":154.60440531690165},{"$f":"NPV($D$2,$C14:AM14)*1.061*1.055","v":156.05135750557946},{"$f":"NPV($D$2,$C14:AN14)*1.061*1.055","v":157.42287616783327},{"$f":"NPV($D$2,$C14:AO14)*1.061*1.055","v":158.72289385717337},{"$f":"NPV($D$2,$C14:AP14)*1.061*1.055","v":159.95513811247204},{"$f":"NPV($D$2,$C14:AQ14)*1.061*1.055","v":161.1231421459305},{"$f":"NPV($D$2,$C14:AR14)*1.061*1.055","v":162.23025497385319},{"$f":"NPV($D$2,$C14:AS14)*1.061*1.055","v":163.27965101927759},{"$f":"NPV($D$2,$C14:AT14)*1.061*1.055","v":164.27433921399259},{"$f":"NPV($D$2,$C14:AU14)*1.061*1.055","v":165.21717162604477},{"$f":"NPV($D$2,$C14:AV14)*1.061*1.055","v":166.11085163746864},{"$f":"NPV($D$2,$C14:AW14)*1.061*1.055","v":166.95794169569035},{"$f":"NPV($D$2,$C14:AX14)*1.061*1.055","v":167.76087066082934},{"$f":"NPV($D$2,$C14:AY14)*1.061*1.055","v":168.52194076996582},{"$f":"NPV($D$2,$C14:AZ14)*1.061*1.055","v":169.24333423834167}]
[12,"Co2 Adder per kWh ($2012) with line loss",{"$f":"NPV($D$2,$C15:C15)*1.061*1.055/0.928","v":6.996715282771653E-3},{"$f":"NPV($D$2,$C15:D15)*1.061*1.055/0.928","v":1.3496648161320016E-2},{"$f":"NPV($D$2,$C15:E15)*1.061*1.055/0.928","v":1.9538330470342646E-2},{"$f":"NPV($D$2,$C15:F15)*1.061*1.055/0.928","v":2.5157144798969279E-2},{"$f":"NPV($D$2,$C15:G15)*1.061*1.055/0.928","v":3.0479118542810338E-2},{"$f":"NPV($D$2,$C15:H15)*1.061*1.055/0.928","v":3.5519921876251158E-2},{"$f":"NPV($D$2,$C15:I15)*1.061*1.055/0.928","v":4.0294398329264666E-2},{"$f":"NPV($D$2,$C15:J15)*1.061*1.055/0.928","v":4.4816608366532014E-2},{"$f":"NPV($D$2,$C15:K15)*1.061*1.055/0.928","v":4.9099870670563803E-2},{"$f":"NPV($D$2,$C15:L15)*1.061*1.055/0.928","v":5.3156801249719152E-2},{"$f":"NPV($D$2,$C15:M15)*1.061*1.055/0.928","v":5.6999350485656901E-2},{"$f":"NPV($D$2,$C15:N15)*1.061*1.055/0.928","v":6.0638838228726295E-2},{"$f":"NPV($D$2,$C15:O15)*1.061*1.055/0.928","v":6.4085987044092491E-2},{"$f":"NPV($D$2,$C15:P15)*1.061*1.055/0.928","v":6.7353426679510719E-2},{"$f":"NPV($D$2,$C15:Q15)*1.061*1.055/0.928","v":7.0450525860001903E-2},{"$f":"NPV($D$2,$C15:R15)*1.061*1.055/0.928","v":7.3386164893642844E-2},{"$f":"NPV($D$2,$C15:S15)*1.061*1.055/0.928","v":7.6168761134060806E-2},{"$f":"NPV($D$2,$C15:T15)*1.061*1.055/0.928","v":7.8806293115499609E-2},{"$f":"NPV($D$2,$C15:U15)*1.061*1.055/0.928","v":8.1306323429659641E-2},{"$f":"NPV($D$2,$C15:V15)*1.061*1.055/0.928","v":8.3676020409906085E-2},{"$f":"NPV($D$2,$C15:W15)*1.061*1.055/0.928","v":8.5922178685021222E-2},{"$f":"NPV($D$2,$C15:X15)*1.061*1.055/0.928","v":8.8051238661433676E-2},{"$f":"NPV($D$2,$C15:Y15)*1.061*1.055/0.928","v":9.0068526720020539E-2},{"$f":"NPV($D$2,$C15:Z15)*1.061*1.055/0.928","v":9.19806481025673E-2},{"$f":"NPV($D$2,$C15:AA15)*1.061*1.055/0.928","v":9.3793085431995535E-2},{"$f":"NPV($D$2,$C15:AB15)*1.061*1.055/0.928","v":9.551103550728296E-2},{"$f":"NPV($D$2,$C15:AC15)*1.061*1.055/0.928","v":9.7139424204237851E-2},{"$f":"NPV($D$2,$C15:AD15)*1.061*1.055/0.928","v":9.8682920599455756E-2},{"$f":"NPV($D$2,$C15:AE15)*1.061*1.055/0.928","v":0.10014595035795616},{"$f":"NPV($D$2,$C15:AF15)*1.061*1.055/0.928","v":0.10153270842288545},{"$f":"NPV($D$2,$C15:AG15)*1.061*1.055/0.928","v":0.1028471710436715},{"$f":"NPV($D$2,$C15:AH15)*1.061*1.055/0.928","v":0.104093107177118},{"$f":"NPV($D$2,$C15:AI15)*1.061*1.055/0.928","v":0.10527408929412888},{"$f":"NPV($D$2,$C15:AJ15)*1.061*1.055/0.928","v":0.10639350362304915},{"$f":"NPV($D$2,$C15:AK15)*1.061*1.055/0.928","v":0.10745455985899258},{"$f":"NPV($D$2,$C15:AL15)*1.061*1.055/0.928","v":0.10846030036699579},{"$f":"NPV($D$2,$C15:AM15)*1.061*1.055/0.928","v":0.10941360890538744},{"$f":"NPV($D$2,$C15:AN15)*1.061*1.055/0.928","v":0.1103172188943843},{"$f":"NPV($D$2,$C15:AO15)*1.061*1.055/0.928","v":0.11117372125362301},{"$f":"NPV($D$2,$C15:AP15)*1.061*1.055/0.928","v":0.11198557183110047},{"$f":"NPV($D$2,$C15:AQ15)*1.061*1.055/0.928","v":0.11275509844482319},{"$f":"NPV($D$2,$C15:AR15)*1.061*1.055/0.928","v":0.11348450755735656},{"$f":"NPV($D$2,$C15:AS15)*1.061*1.055/0.928","v":0.1141758906024119},{"$f":"NPV($D$2,$C15:AT15)*1.061*1.055/0.928","v":0.11483122998161126},{"$f":"NPV($D$2,$C15:AU15)*1.061*1.055/0.928","v":0.11545240474862488},{"$f":"NPV($D$2,$C15:AV15)*1.061*1.055/0.928","v":0.116041195996979},{"$f":"NPV($D$2,$C15:AW15)*1.061*1.055/0.928","v":0.11659929196698295},{"$f":"NPV($D$2,$C15:AX15)*1.061*1.055/0.928","v":0.11712829288641798},{"$f":"NPV($D$2,$C15:AY15)*1.061*1.055/0.928","v":0.11762971555886818},{"$f":"NPV($D$2,$C15:AZ15)*1.061*1.055/0.928","v":0.11810499771284945}]
[13,"Co2 Adder per MMBtu (2012$)",{"$f":"NPV($D$2,$C16:C16)*1.061*1.055","v":0.9310274999999999},{"$f":"NPV($D$2,$C16:D16)*1.061*1.055","v":1.8135180213270139},{"$f":"NPV($D$2,$C16:E16)*1.061*1.055","v":2.6500019277981179},{"$f":"NPV($D$2,$C16:F16)*1.061*1.055","v":3.4428776685290212},{"$f":"NPV($D$2,$C16:G16)*1.061*1.055","v":4.1944186550038118},{"$f":"NPV($D$2,$C16:H16)*1.061*1.055","v":4.9067797796244665},{"$f":"NPV($D$2,$C16:I16)*1.061*1.055","v":5.5820035944307742},{"$f":"NPV($D$2,$C16:J16)*1.061*1.055","v":6.2220261677068942},{"$f":"NPV($D$2,$C16:K16)*1.061*1.055","v":6.8286826352671994},{"$f":"NPV($D$2,$C16:L16)*1.061*1.055","v":7.4037124623385786},{"$f":"NPV($D$2,$C16:M16)*1.061*1.055","v":7.9487644311266141},{"$f":"NPV($D$2,$C16:N16)*1.061*1.055","v":8.4654013683664591},{"$f":"NPV($D$2,$C16:O16)*1.061*1.055","v":8.9551046264137053},{"$f":"NPV($D$2,$C16:P16)*1.061*1.055","v":9.4192783307238912},{"$f":"NPV($D$2,$C16:Q16)*1.061*1.055","v":9.8592534058994232},{"$f":"NPV($D$2,$C16:R16)*1.061*1.055","v":10.276291391847796},{"$f":"NPV($D$2,$C16:S16)*1.061*1.055","v":10.671588060993169},{"$f":"NPV($D$2,$C16:T16)*1.061*1.055","v":11.046276846912958},{"$f":"NPV($D$2,$C16:U16)*1.061*1.055","v":11.401432094230293},{"$f":"NPV($D$2,$C16:V16)*1.061*1.055","v":11.738072139080845},{"$f":"NPV($D$2,$C16:W16)*1.061*1.055","v":12.057162228986583},{"$f":"NPV($D$2,$C16:X16)*1.061*1.055","v":12.359617290508609},{"$f":"NPV($D$2,$C16:Y16)*1.061*1.055","v":12.646304552614797},{"$f":"NPV($D$2,$C16:Z16)*1.061*1.055","v":12.918046033284169},{"$f":"NPV($D$2,$C16:AA16)*1.061*1.055","v":13.175620896477886},{"$f":"NPV($D$2,$C16:AB16)*1.061*1.055","v":13.419767686234962},{"$f":"NPV($D$2,$C16:AC16)*1.061*1.055","v":13.651186444298542},{"$f":"NPV($D$2,$C16:AD16)*1.061*1.055","v":13.870540717344591},{"$f":"NPV($D$2,$C16:AE16)*1.061*1.055","v":14.078459459568332},{"$f":"NPV($D$2,$C16:AF16)*1.061*1.055","v":14.275538836083728},{"$f":"NPV($D$2,$C16:AG16)*1.061*1.055","v":14.462343932306851},{"$f":"NPV($D$2,$C16:AH16)*1.061*1.055","v":14.639410374224505},{"$f":"NPV($D$2,$C16:AI16)*1.061*1.055","v":14.807245864193845},{"$f":"NPV($D$2,$C16:AJ16)*1.061*1.055","v":14.96633163667663},{"$f":"NPV($D$2,$C16:AK16)*1.061*1.055","v":15.117123838082113},{"$f":"NPV($D$2,$C16:AL16)*1.061*1.055","v":15.260054834674989},{"$f":"NPV($D$2,$C16:AM16)*1.061*1.055","v":15.395534452298568},{"$f":"NPV($D$2,$C16:AN16)*1.061*1.055","v":15.523951151467836},{"$f":"NPV($D$2,$C16:AO16)*1.061*1.055","v":15.645673141201742},{"$f":"NPV($D$2,$C16:AP16)*1.061*1.055","v":15.761049434788381},{"$f":"NPV($D$2,$C16:AQ16)*1.061*1.055","v":15.870410850510314},{"$f":"NPV($D$2,$C16:AR16)*1.061*1.055","v":15.97407096019935},{"$f":"NPV($D$2,$C16:AS16)*1.061*1.055","v":16.07232698834062},{"$f":"NPV($D$2,$C16:AT16)*1.061*1.055","v":16.165460664303904},{"$f":"NPV($D$2,$C16:AU16)*1.061*1.055","v":16.25373903014588},{"$f":"NPV($D$2,$C16:AV16)*1.061*1.055","v":16.337415206299415},{"$f":"NPV($D$2,$C16:AW16)*1.061*1.055","v":16.416729117345419},{"$f":"NPV($D$2,$C16:AX16)*1.061*1.055","v":16.491908179948265},{"$f":"NPV($D$2,$C16:AY16)*1.061*1.055","v":16.563167954927266},{"$f":"NPV($D$2,$C16:AZ16)*1.061*1.055","v":16.6307127653339}]
[14,"Co2 Adder per MMBtu Oil (2012$)",{"$f":"NPV($D$2,$C17:C17)*1.061*1.055","v":0.9310274999999999},{"$f":"NPV($D$2,$C17:D17)*1.061*1.055","v":1.8135180213270139},{"$f":"NPV($D$2,$C17:E17)*1.061*1.055","v":2.6500019277981179},{"$f":"NPV($D$2,$C17:F17)*1.061*1.055","v":3.4428776685290212},{"$f":"NPV($D$2,$C17:G17)*1.061*1.055","v":4.1944186550038118},{"$f":"NPV($D$2,$C17:H17)*1.061*1.055","v":4.9067797796244665},{"$f":"NPV($D$2,$C17:I17)*1.061*1.055","v":5.5820035944307742},{"$f":"NPV($D$2,$C17:J17)*1.061*1.055","v":6.2220261677068942},{"$f":"NPV($D$2,$C17:K17)*1.061*1.055","v":6.8286826352671994},{"$f":"NPV($D$2,$C17:L17)*1.061*1.055","v":7.4037124623385786},{"$f":"NPV($D$2,$C17:M17)*1.061*1.055","v":7.9487644311266141},{"$f":"NPV($D$2,$C17:N17)*1.061*1.055","v":8.4654013683664591},{"$f":"NPV($D$2,$C17:O17)*1.061*1.055","v":8.9551046264137053},{"$f":"NPV($D$2,$C17:P17)*1.061*1.055","v":9.4192783307238912},{"$f":"NPV($D$2,$C17:Q17)*1.061*1.055","v":9.8592534058994232},{"$f":"NPV($D$2,$C17:R17)*1.061*1.055","v":10.276291391847796},{"$f":"NPV($D$2,$C17:S17)*1.061*1.055","v":10.671588060993169},{"$f":"NPV($D$2,$C17:T17)*1.061*1.055","v":11.046276846912958},{"$f":"NPV($D$2,$C17:U17)*1.061*1.055","v":11.401432094230293},{"$f":"NPV($D$2,$C17:V17)*1.061*1.055","v":11.738072139080845},{"$f":"NPV($D$2,$C17:W17)*1.061*1.055","v":12.057162228986583},{"$f":"NPV($D$2,$C17:X17)*1.061*1.055","v":12.359617290508609},{"$f":"NPV($D$2,$C17:Y17)*1.061*1.055","v":12.646304552614797},{"$f":"NPV($D$2,$C17:Z17)*1.061*1.055","v":12.918046033284169},{"$f":"NPV($D$2,$C17:AA17)*1.061*1.055","v":13.175620896477886},{"$f":"NPV($D$2,$C17:AB17)*1.061*1.055","v":13.419767686234962},{"$f":"NPV($D$2,$C17:AC17)*1.061*1.055","v":13.651186444298542},{"$f":"NPV($D$2,$C17:AD17)*1.061*1.055","v":13.870540717344591},{"$f":"NPV($D$2,$C17:AE17)*1.061*1.055","v":14.078459459568332},{"$f":"NPV($D$2,$C17:AF17)*1.061*1.055","v":14.275538836083728},{"$f":"NPV($D$2,$C17:AG17)*1.061*1.055","v":14.462343932306851},{"$f":"NPV($D$2,$C17:AH17)*1.061*1.055","v":14.639410374224505},{"$f":"NPV($D$2,$C17:AI17)*1.061*1.055","v":14.807245864193845},{"$f":"NPV($D$2,$C17:AJ17)*1.061*1.055","v":14.96633163667663},{"$f":"NPV($D$2,$C17:AK17)*1.061*1.055","v":15.117123838082113},{"$f":"NPV($D$2,$C17:AL17)*1.061*1.055","v":15.260054834674989},{"$f":"NPV($D$2,$C17:AM17)*1.061*1.055","v":15.395534452298568},{"$f":"NPV($D$2,$C17:AN17)*1.061*1.055","v":15.523951151467836},{"$f":"NPV($D$2,$C17:AO17)*1.061*1.055","v":15.645673141201742},{"$f":"NPV($D$2,$C17:AP17)*1.061*1.055","v":15.761049434788381},{"$f":"NPV($D$2,$C17:AQ17)*1.061*1.055","v":15.870410850510314},{"$f":"NPV($D$2,$C17:AR17)*1.061*1.055","v":15.97407096019935},{"$f":"NPV($D$2,$C17:AS17)*1.061*1.055","v":16.07232698834062},{"$f":"NPV($D$2,$C17:AT17)*1.061*1.055","v":16.165460664303904},{"$f":"NPV($D$2,$C17:AU17)*1.061*1.055","v":16.25373903014588},{"$f":"NPV($D$2,$C17:AV17)*1.061*1.055","v":16.337415206299415},{"$f":"NPV($D$2,$C17:AW17)*1.061*1.055","v":16.416729117345419},{"$f":"NPV($D$2,$C17:AX17)*1.061*1.055","v":16.491908179948265},{"$f":"NPV($D$2,$C17:AY17)*1.061*1.055","v":16.563167954927266},{"$f":"NPV($D$2,$C17:AZ17)*1.061*1.055","v":16.6307127653339}]

{"sheet":"ZipCode Map","index":17,"n_rows":912,"n_cols":16,"rows_kept":912,"cut":false,"hidden":true,"merged":[[0,9,0,12],[0,13,0,15],[911,1,911,4],[911,9,911,12],[911,13,911,15]]}
[null,"actual","actual",null,"actual",null,null,null,null,"climate mapped",null,null,null,"weather normalization mapped"]
[null,"zip_code","zip_state",null,"zip_city",null,null,null,null,"city state","state","CDD","HDD","city","state","file name"]
[]
[]
["User Data:",{"$f":"LEFT(DT_GeneralProjectInfo_ProjectInfo_Zip,3)","v":""},{"$f":"LOOKUP($B$5,$B$8:$B$908,C$8:C$908)","v":{"$error":"#N/A"}},{"$f":"LOOKUP($B$5,$B$8:$B$908,D$8:D$908)","v":{"$error":"#N/A"}},{"$f":"LOOKUP($B$5,$B$8:$B$908,E$8:E$908)","v":{"$error":"#N/A"}},{"$f":"LOOKUP($B$5,$B$8:$B$908,F$8:F$908)","v":{"$error":"#N/A"}},null,{"$f":"LOOKUP($B$5,$B$8:$B$908,H$8:H$908)","v":{"$error":"#N/A"}},{"$f":"CONCATENATE(H5,\",\",\" \",D5)","v":{"$error":"#N/A"}},{"$f":"LOOKUP($B$5,$B$8:$B$908,J$8:J$908)","v":{"$error":"#N/A"}},{"$error":"#N/A"},{"$f":"LOOKUP($B$5,$B$8:$B$908,L$8:L$908)","v":{"$error":"#N/A"}},{"$error":"#N/A"},{"$error":"#N/A"},{"$error":"#N/A"},{"$error":"#N/A"}]
[]
[]
[null,"009","\"Puerto_Rico\"","PR","\"San Juan\"",null,{"$f":"LEN(E8)","v":10},{"$f":"MID(E8,2,G8-2)","v":"San Juan"},null,"SAN JUAN    PR","PR",5558,0,"San Juan Puerto Rico","PR","XXSANJUA.txt"]
[null,"010","\"Massachusetts\"","MA","\"Springfield\"",null,{"$f":"LEN(E9)","v":13},{"$f":"MID(E9,2,G9-2)","v":"Springfield"},null,"WORCESTER    MA","MA",333,6979,"Hartford-Springfield","CT","CTHARTFO.txt"]
[null,"011","\"Massachusetts\"","MA","\"Springfield\"",null,{"$f":"LEN(E10)","v":13},{"$f":"MID(E10,2,G10-2)","v":"Springfield"},null,"HARTFORD    CT","CT",677,6151,"Hartford-Springfield","CT","CTHARTFO.txt"]
[null,"012","\"Massachusetts\"","MA","\"Pittsfield\"",null,12,"Pittsfield",null,"ALBANY    NY","NY",507,6894,"Albany","NY","NYALBANY.txt"]
[null,"013","\"Massachusetts\"","MA","\"Greenfield\"",null,12,"Greenfield",null,"WORCESTER    MA","MA",333,6979,"Boston","MA","MABOSTON.txt"]
[null,"014","\"Massachusetts\"","MA","\"Worcester\"",null,11,"Worcester",null,"WORCESTER    MA","MA",333,6979,"Boston","MA","MABOSTON.txt"]
[null,"015","\"Massachusetts\"","MA","\"Worcester\"",null,11,"Worcester",null,"WORCESTER    MA","MA",333,6979,"Boston","MA","MABOSTON.txt"]
[null,"016","\"Massachusetts\"","MA","\"Worcester\"",null,11,"Worcester",null,"WORCESTER    MA","MA",333,6979,"Boston","MA","MABOSTON.txt"]
[null,"017","\"Massachusetts\"","MA","\"Framingham\"",null,12,"Framingham",null,"WORCESTER    MA","MA",333,6979,"Boston","MA","MABOSTON.txt"]
[null,"018","\"Massachusetts\"","MA","\"Woburn\"",null,8,"Woburn",null,"WORCESTER    MA","MA",333,6979,"Boston","MA","MABOSTON.txt"]
[null,"019","\"Massachusetts\"","MA","\"Lynn\"",null,6,"Lynn",null,"BOSTON    MA","MA",678,5641,"Boston","MA","MABOSTON.txt"]
[null,"020","\"Massachusetts\"","MA","\"Boston\"",null,8,"Boston",null,"WORCESTER    MA","MA",333,6979,"Boston","MA","MABOSTON.txt"]
[null,"021","\"Massachusetts\"","MA","\"Boston\"",null,8,"Boston",null,"BOSTON    MA","MA",678,5641,"Boston","MA","MABOSTON.txt"]
[null,"022","\"Massachusetts\"","MA","\"Boston\"",null,8,"Boston",null,"BOSTON    MA","MA",678,5641,"Boston","MA","MABOSTON.txt"]
[null,"023","\"Massachusetts\"","MA","\"Brockton\"",null,10,"Brockton",null,"PROVIDENCE    RI","RI",606,5884,"Rhode Island","RI","RIPROVID.txt"]
[null,"024","\"Massachusetts\"","MA","\"Brockton\"",null,10,"Brockton",null,"BOSTON    MA","MA",678,5641,"Boston","MA","MABOSTON.txt"]
[null,"025","\"Massachusetts\"","MA","\"Buzzards Bay\"",null,14,"Buzzards Bay",null,"PROVIDENCE    RI","RI",606,5884,"Rhode Island","RI","RIPROVID.txt"]
[null,"026","\"Massachusetts\"","MA","\"Hyannis\"",null,9,"Hyannis",null,"PROVIDENCE    RI","RI",606,5884,"Rhode Island","RI","RIPROVID.txt"]
[null,"027","\"Massachusetts\"","MA","\"New Bedford\"",null,13,"New Bedford",null,"PROVIDENCE    RI","RI",606,5884,"Rhode Island","RI","RIPROVID.txt"]
[null,"028","\"Rhode_Island\"","RI","\"Providence\"",null,12,"Providence",null,"WORCESTER    MA","MA",333,6979,"Rhode Island","RI","RIPROVID.txt"]
[null,"029","\"Rhode_Island\"","RI","\"Providence\"",null,12,"Providence",null,"PROVIDENCE    RI","RI",606,5884,"Rhode Island","RI","RIPROVID.txt"]
[null,"030","\"New_Hampshire\"","NH","\"Manchester\"",null,12,"Manchester",null,"WORCESTER    MA","MA",333,6979,"Concord","NH","NHCONCOR.txt"]
[null,"031","\"New_Hampshire\"","NH","\"Manchester\"",null,12,"Manchester",null,"CONCORD    NH","NH",328,7554,"Concord","NH","NHCONCOR.txt"]
[null,"032","\"New_Hampshire\"","NH","\"Pittsfield\"",null,12,"Pittsfield",null,"CONCORD    NH","NH",328,7554,"Concord","NH","NHCONCOR.txt"]
[null,"033","\"New_Hampshire\"","NH","\"Concord\"",null,9,"Concord",null,"CONCORD    NH","NH",328,7554,"Concord","NH","NHCONCOR.txt"]
[null,"034","\"New_Hampshire\"","NH","\"Keene\"",null,7,"Keene",null,"WORCESTER    MA","MA",333,6979,"Concord","NH","NHCONCOR.txt"]
[null,"035","\"New_Hampshire\"","NH","\"Littleton\"",null,11,"Littleton",null,"BURLINGTON    VT","VT",388,7771,"Burlington","VT","VTBURLIN.txt"]
[null,"036","\"New_Hampshire\"","NH","\"Acworth\"",null,9,"Acworth",null,"CONCORD    NH","NH",328,7554,"Concord","NH","NHCONCOR.txt"]
[null,"037","\"New_Hampshire\"","NH","\"Claremont\"",null,11,"Claremont",null,"BURLINGTON    VT","VT",388,7771,"Burlington","VT","VTBURLIN.txt"]
[null,"038","\"New_Hampshire\"","NH","\"Portsmouth\"",null,12,"Portsmouth",null,"PORTLAND    ME","ME",268,7378,"Portland","ME","MEPORTLA.txt"]
[null,"039","\"Maine\"","ME","\"Kittery\"",null,9,"Kittery",null,"PORTLAND    ME","ME",268,7378,"Portland","ME","MEPORTLA.txt"]
[null,"040","\"Maine\"","ME","\"Portland\"",null,10,"Portland",null,"PORTLAND    ME","ME",268,7378,"Portland","ME","MEPORTLA.txt"]
[null,"041","\"Maine\"","ME","\"Portland\"",null,10,"Portland",null,"PORTLAND    ME","ME",268,7378,"Portland","ME","MEPORTLA.txt"]
[null,"042","\"Maine\"","ME","\"Auburn\"",null,8,"Auburn",null,"PORTLAND    ME","ME",268,7378,"Portland","ME","MEPORTLA.txt"]
[null,"043","\"Maine\"","ME","\"Augusta\"",null,9,"Augusta",null,"PORTLAND    ME","ME",268,7378,"Portland","ME","MEPORTLA.txt"]
[null,"044","\"Maine\"","ME","\"Bangor\"",null,8,"Bangor",null,"PORTLAND    ME","ME",268,7378,"Portland","ME","MEPORTLA.txt"]
[null,"045","\"Maine\"","ME","\"Bath\"",null,6,"Bath",null,"PORTLAND    ME","ME",268,7378,"Portland","ME","MEPORTLA.txt"]
[null,"046","\"Maine\"","ME","\"Ellsworth\"",null,11,"Ellsworth",null,"PORTLAND    ME","ME",268,7378,"Portland","ME","MEPORTLA.txt"]
[null,"047","\"Maine\"","ME","\"Caribou\"",null,9,"Caribou",null,"CARIBOU    ME","ME",131,9651,"Caribou","ME","MECARIBO.txt"]
[null,"048","\"Maine\"","ME","\"Rockland\"",null,10,"Rockland",null,"PORTLAND    ME","ME",268,7378,"Portland","ME","MEPORTLA.txt"]
[null,"049","\"Maine\"","ME","\"Waterville\"",null,12,"Waterville",null,"PORTLAND    ME","ME",268,7378,"Portland","ME","MEPORTLA.txt"]
[null,"050","\"Vermont\"","VT","\"White River Junction\"",null,22,"White River Junction",null,"BURLINGTON    VT","VT",388,7771,"Burlington","VT","VTBURLIN.txt"]
[null,"051","\"Vermont\"","VT","\"Bellows Falls\"",null,15,"Bellows Falls",null,"CONCORD    NH","NH",328,7554,"Concord","NH","NHCONCOR.txt"]
[null,"052","\"Vermont\"","VT","\"Bennington\"",null,12,"Bennington",null,"ALBANY    NY","NY",507,6894,"Albany","NY","NYALBANY.txt"]
[null,"053","\"Vermont\"","VT","\"Brattleboro\"",null,13,"Brattleboro",null,"WORCESTER    MA","MA",333,6979,"Albany","NY","NYALBANY.txt"]
[null,"054","\"Vermont\"","VT","\"Burlington\"",null,12,"Burlington",null,"BURLINGTON    VT","VT",388,7771,"Burlington","VT","VTBURLIN.txt"]
[null,"056","\"Vermont\"","VT","\"Montpelier\"",null,12,"Montpelier",null,"BURLINGTON    VT","VT",388,7771,"Burlington","VT","VTBURLIN.txt"]
[null,"057","\"Vermont\"","VT","\"Rutland\"",null,9,"Rutland",null,"ALBANY    NY","NY",507,6894,"Albany","NY","NYALBANY.txt"]
[null,"058","\"Vermont\"","VT","\"St. Johnsbury\"",null,15,"St. Johnsbury",null,"BURLINGTON    VT","VT",388,7771,"Burlington","VT","VTBURLIN.txt"]
[null,"059","\"Vermont\"","VT","\"Canaan\"",null,8,"Canaan",null,"BURLINGTON    VT","VT",388,7771,"Burlington","VT","VTBURLIN.txt"]
[null,"060","\"Connecticut\"","CT","\"Hartford\"",null,10,"Hartford",null,"WORCESTER    MA","MA",333,6979,"Hartford-Springfield","CT","CTHARTFO.txt"]
[null,"061","\"Connecticut\"","CT","\"Hartford\"",null,10,"Hartford",null,"HARTFORD    CT","CT",677,6151,"Hartford-Springfield","CT","CTHARTFO.txt"]
[null,"062","\"Connecticut\"","CT","\"Willimantic\"",null,13,"Willimantic",null,"WORCESTER    MA","MA",333,6979,"Hartford-Springfield","CT","CTHARTFO.txt"]
[null,"063","\"Connecticut\"","CT","\"New London\"",null,12,"New London",null,"PROVIDENCE    RI","RI",606,5884,"Rhode Island","RI","RIPROVID.txt"]
[null,"064","\"Connecticut\"","CT","\"New Haven\"",null,11,"New Haven",null,"HARTFORD    CT","CT",677,6151,"Hartford-Springfield","CT","CTHARTFO.txt"]
[null,"065","\"Connecticut\"","CT","\"New Haven\"",null,11,"New Haven",null,"HARTFORD    CT","CT",677,6151,"Hartford-Springfield","CT","CTHARTFO.txt"]
[null,"066","\"Connecticut\"","CT","\"Bridgeport\"",null,12,"Bridgeport",null,"BRIDGEPORT    CT","CT",724,5537,"Bridgeport","CT","CTBRIDGE.txt"]
[null,"067","\"Connecticut\"","CT","\"Waterbury\"",null,11,"Waterbury",null,"HARTFORD    CT","CT",677,6151,"Hartford-Springfield","CT","CTHARTFO.txt"]
[null,"068","\"Connecticut\"","CT","\"Stamford\"",null,10,"Stamford",null,"BRIDGEPORT    CT","CT",724,5537,"Bridgeport","CT","CTBRIDGE.txt"]
[null,"069","\"Connecticut\"","CT","\"Stamford\"",null,10,"Stamford",null,"BRIDGEPORT    CT","CT",724,5537,"Bridgeport","CT","CTBRIDGE.txt"]
[null,"070","\"New_Jersey\"","NJ","\"Newark\"",null,8,"Newark",null,"NEW YORK (LAGUARDIA AP)    NY","NY",1052,4910,"Newark","NJ","NJNEWARK.txt"]
[null,"071","\"New_Jersey\"","NJ","\"Newark\"",null,8,"Newark",null,"NEWARK    NJ","NJ",1201,4888,"Newark","NJ","NJNEWARK.txt"]
[null,"072","\"New_Jersey\"","NJ","\"Elizabeth\"",null,11,"Elizabeth",null,"NEWARK    NJ","NJ",1201,4888,"Newark","NJ","NJNEWARK.txt"]
[null,"073","\"New_Jersey\"","NJ","\"Jersey_City\"",null,13,"Jersey_City",null,"NEWARK    NJ","NJ",1201,4888,"Newark","NJ","NJNEWARK.txt"]
[null,"074","\"New_Jersey\"","NJ","\"Paterson\"",null,10,"Paterson",null,"NEWARK    NJ","NJ",1201,4888,"Newark","NJ","NJNEWARK.txt"]
[null,"075","\"New_Jersey\"","NJ","\"Paterson\"",null,10,"Paterson",null,"NEWARK    NJ","NJ",1201,4888,"Newark","NJ","NJNEWARK.txt"]
[null,"076","\"New_Jersey\"","NJ","\"Hackensack\"",null,{"$f":"LEN(E74)","v":12},{"$f":"MID(E74,2,G74-2)","v":"Hackensack"},null,"NEWARK    NJ","NJ",1201,4888,"Newark","NJ","NJNEWARK.txt"]
[null,"077","\"New_Jersey\"","NJ","\"Red Bank\"",null,10,"Red Bank",null,"NEWARK    NJ","NJ",1201,4888,"Newark","NJ","NJNEWARK.txt"]
[null,"078","\"New_Jersey\"","NJ","\"Dover\"",null,7,"Dover",null,"ALLENTOWN    PA","PA",773,5785,"Allentown","PA","PAALLENT.txt"]
[null,"079","\"New_Jersey\"","NJ","\"Summit\"",null,8,"Summit",null,"NEWARK    NJ","NJ",1201,4888,"Newark","NJ","NJNEWARK.txt"]
[null,"080","\"New_Jersey\"","NJ","\"Cherry Hill\"",null,13,"Cherry Hill",null,"PHILADELPHIA    PA","PA",1101,4954,"Philadelphia","PA","PAPHILAD.txt"]
[null,"081","\"New_Jersey\"","NJ","\"Camden\"",null,8,"Camden",null,"PHILADELPHIA    PA","PA",1101,4954,"Philadelphia","PA","PAPHILAD.txt"]
[null,"082","\"New_Jersey\"","NJ","\"South Jersey\"",null,14,"South Jersey",null,"ATLANTIC CITY AP    NJ","NJ",826,5169,"Atlantic City","NJ","NJATLCTY.txt"]
[null,"083","\"New_Jersey\"","NJ","\"South Jersey\"",null,14,"South Jersey",null,"WILMINGTON    DE","DE",1046,4937,"Wilmington","DE","DEWILMIN.txt"]
[null,"084","\"New_Jersey\"","NJ","\"Atlantic City\"",null,15,"Atlantic City",null,"ATLANTIC CITY AP    NJ","NJ",826,5169,"Atlantic City","NJ","NJATLCTY.txt"]
[null,"085","\"New_Jersey\"","NJ","\"Trenton\"",null,9,"Trenton",null,"NEWARK    NJ","NJ",1201,4888,"Newark","NJ","NJNEWARK.txt"]
[null,"086","\"New_Jersey\"","NJ","\"Trenton\"",null,9,"Trenton",null,"NEWARK    NJ","NJ",1201,4888,"Newark","NJ","NJNEWARK.txt"]
[null,"087","\"New_Jersey\"","NJ","\"Lakewood\"",null,10,"Lakewood",null,"ATLANTIC CITY AP    NJ","NJ",826,5169,"Atlantic City","NJ","NJATLCTY.txt"]
[null,"088","\"New_Jersey\"","NJ","\"New Brunswick\"",null,15,"New Brunswick",null,"NEWARK    NJ","NJ",1201,4888,"Newark","NJ","NJNEWARK.txt"]
[null,"089","\"New_Jersey\"","NJ","\"New Brunswick\"",null,15,"New Brunswick",null,"NEWARK    NJ","NJ",1201,4888,"Newark","NJ","NJNEWARK.txt"]
[null,"100","\"New_York\"","NY","\"New York\"","N",10,"New York",null,"NEW YORK C.PARK    NY","NY",1096,4805,"New York City","NY","NYNEWYOR.txt"]
[null,"101","\"New_York\"","NY","\"New York\"","N",10,"New York",null,"NEW YORK C.PARK    NY","NY",1096,4805,"New York City","NY","NYNEWYOR.txt"]
[null,"102","\"New_York\"","NY","\"New York\"","N",10,"New York",null,"NEW YORK C.PARK    NY","NY",1096,4805,"New York City","NY","NYNEWYOR.txt"]
[null,"103","\"New_York\"","NY","\"Staten Island\"","N",15,"Staten Island",null,"NEW YORK (LAGUARDIA AP)    NY","NY",1052,4910,"New York City","NY","NYNEWYOR.txt"]
[null,"104","\"New_York\"","NY","\"Bronx\"","N",7,"Bronx",null,"NEW YORK (LAGUARDIA AP)    NY","NY",1052,4910,"New York City","NY","NYNEWYOR.txt"]
[null,"105","\"New_York\"","NY","\"Westchester\"","D",13,"Westchester",null,"BRIDGEPORT    CT","CT",724,5537,"Bridgeport","CT","CTBRIDGE.txt"]
[null,"106","\"New_York\"","NY","\"White Plains\"","D",14,"White Plains",null,"BRIDGEPORT    CT","CT",724,5537,"Bridgeport","CT","CTBRIDGE.txt"]
[null,"107","\"New_York\"","NY","\"Yonkers\"","D",9,"Yonkers",null,"NEW YORK (LAGUARDIA AP)    NY","NY",1052,4910,"New York City","NY","NYNEWYOR.txt"]
[null,"108","\"New_York\"","NY","\"New Rochelle\"","D",14,"New Rochelle",null,"NEW YORK (LAGUARDIA AP)    NY","NY",1052,4910,"New York City","NY","NYNEWYOR.txt"]
[null,"109","\"New_York\"","NY","\"Suffern\"","D",9,"Suffern",null,"BRIDGEPORT    CT","CT",724,5537,"Bridgeport","CT","CTBRIDGE.txt"]
[null,"110","\"New_York\"","NY","\"Great Neck\"","N",12,"Great Neck",null,"NEW YORK (LAGUARDIA AP)    NY","NY",1052,4910,"New York City","NY","NYNEWYOR.txt"]
[null,"111","\"New_York\"","NY","\"Queens\"","N",8,"Queens",null,"NEW YORK (LAGUARDIA AP)    NY","NY",1052,4910,"New York City","NY","NYNEWYOR.txt"]
[null,"112","\"New_York\"","NY","\"Brooklyn\"","N",10,"Brooklyn",null,"NEW YORK (LAGUARDIA AP)    NY","NY",1052,4910,"New York City","NY","NYNEWYOR.txt"]
[null,"113","\"New_York\"","NY","\"Flushing\"","N",10,"Flushing",null,"NEW YORK (JFK AP)    NY","NY",921,5027,"New York City","NY","NYNEWYOR.txt"]
[null,"114","\"New_York\"","NY","\"Jamaica\"","N",9,"Jamaica",null,"NEW YORK (JFK AP)    NY","NY",921,5027,"New York City","NY","NYNEWYOR.txt"]
[null,"115","\"New_York\"","NY","\"Minneola\"","D",10,"Minneola",null,"NEW YORK (JFK AP)    NY","NY",921,5027,"New York City","NY","NYNEWYOR.txt"]
[null,"116","\"New_York\"","NY","\"Far Rockaway\"","N",14,"Far Rockaway",null,"ISLIP    NY","NY",706,5647,"Bridgeport","CT","CTBRIDGE.txt"]
[null,"117","\"New_York\"","NY","\"Hicksville\"","D",12,"Hicksville",null,"ISLIP    NY","NY",706,5647,"Bridgeport","CT","CTBRIDGE.txt"]
[null,"118","\"New_York\"","NY","\"Hicksville\"","D",12,"Hicksville",null,"ISLIP    NY","NY",706,5647,"Bridgeport","CT","CTBRIDGE.txt"]
[null,"119","\"New_York\"","NY","\"Riverhead\"","D",11,"Riverhead",null,"BRIDGEPORT    CT","CT",724,5537,"Bridgeport","CT","CTBRIDGE.txt"]
[null,"120","\"New_York\"","NY","\"Albany\"","U",8,"Albany",null,"ALBANY    NY","NY",507,6894,"Albany","NY","NYALBANY.txt"]
[null,"121","\"New_York\"","NY","\"Albany\"","U",8,"Albany",null,"ALBANY    NY","NY",507,6894,"Albany","NY","NYALBANY.txt"]
[null,"122","\"New_York\"","NY","\"Albany\"","U",8,"Albany",null,"ALBANY    NY","NY",507,6894,"Albany","NY","NYALBANY.txt"]
[null,"123","\"New_York\"","NY","\"Schenectady\"","U",13,"Schenectady",null,"ALBANY    NY","NY",507,6894,"Albany","NY","NYALBANY.txt"]
[null,"124","\"New_York\"","NY","\"Kingston\"","U",10,"Kingston",null,"ALBANY    NY","NY",507,6894,"Albany","NY","NYALBANY.txt"]
[null,"125","\"New_York\"","NY","\"Poughkeepsie\"","U",14,"Poughkeepsie",null,"HARTFORD    CT","CT",677,6151,"Hartford-Springfield","CT","CTHARTFO.txt"]
[null,"126","\"New_York\"","NY","\"Poughkeepsie\"","U",14,"Poughkeepsie",null,"BRIDGEPORT    CT","CT",724,5537,"Bridgeport","CT","CTBRIDGE.txt"]
[null,"127","\"New_York\"","NY","\"Monticello\"","U",12,"Monticello",null,"BINGHAMTON    NY","NY",337,7273,"Wilkes-Barre","PA","PAWILKES.txt"]
[null,"128","\"New_York\"","NY","\"Glens Falls\"","U",13,"Glens Falls",null,"BURLINGTON    VT","VT",388,7771,"Burlington","VT","VTBURLIN.txt"]
[null,"129","\"New_York\"","NY","\"Plattsburgh\"","U",13,"Plattsburgh",null,"BURLINGTON    VT","VT",388,7771,"Burlington","VT","VTBURLIN.txt"]
[null,"130","\"New_York\"","NY","\"Syracuse\"","U",10,"Syracuse",null,"SYRACUSE    NY","NY",438,6834,"Syracuse","NY","NYSYRACU.txt"]
[null,"131","\"New_York\"","NY","\"Syracuse\"","U",10,"Syracuse",null,"ROCHESTER    NY","NY",425,6734,"Syracuse","NY","NYSYRACU.txt"]
[null,"132","\"New_York\"","NY","\"Syracuse\"","U",10,"Syracuse",null,"SYRACUSE    NY","NY",438,6834,"Syracuse","NY","NYSYRACU.txt"]
[null,"133","\"New_York\"","NY","\"Utica\"","U",7,"Utica",null,"BINGHAMTON    NY","NY",337,7273,"Wilkes-Barre","PA","PAWILKES.txt"]
[null,"134","\"New_York\"","NY","\"Utica\"","U",7,"Utica",null,"BINGHAMTON    NY","NY",337,7273,"Wilkes-Barre","PA","PAWILKES.txt"]
[null,"135","\"New_York\"","NY","\"Utica\"","U",7,"Utica",null,"SYRACUSE    NY","NY",438,6834,"Syracuse","NY","NYSYRACU.txt"]
[null,"136","\"New_York\"","NY","\"Watertown\"","U",11,"Watertown",null,"SYRACUSE    NY","NY",438,6834,"Syracuse","NY","NYSYRACU.txt"]
[null,"137","\"New_York\"","NY","\"Binghamton\"","U",12,"Binghamton",null,"ALBANY    NY","NY",507,6894,"Albany","NY","NYALBANY.txt"]
[null,"138","\"New_York\"","NY","\"Binghamton\"","U",12,"Binghamton",null,"ALBANY    NY","NY",507,6894,"Albany","NY","NYALBANY.txt"]
[null,"139","\"New_York\"","NY","\"Binghamton\"","U",12,"Binghamton",null,"BINGHAMTON    NY","NY",337,7273,"Wilkes-Barre","PA","PAWILKES.txt"]
[null,"140","\"New_York\"","NY","\"Buffalo\"","U",9,"Buffalo",null,"ERIE    PA","PA",550,6279,"Erie","PA","PAERIE.txt"]
[null,"141","\"New_York\"","NY","\"Buffalo\"","U",9,"Buffalo",null,"ROCHESTER    NY","NY",425,6734,"Rochester","NY","NYROCHES.txt"]
[null,"142","\"New_York\"","NY","\"Buffalo\"","U",9,"Buffalo",null,"BUFFALO    NY","NY",477,6747,"Buffalo","NY","NTBUFFAL.txt"]
[null,"143","\"New_York\"","NY","\"Niagara Falls\"","U",15,"Niagara Falls",null,"BUFFALO    NY","NY",477,6747,"Buffalo","NY","NTBUFFAL.txt"]
[null,"144","\"New_York\"","NY","\"Rochester\"","U",11,"Rochester",null,"BUFFALO    NY","NY",477,6747,"Buffalo","NY","NTBUFFAL.txt"]
[null,"145","\"New_York\"","NY","\"Rochester\"","U",11,"Rochester",null,"BUFFALO    NY","NY",477,6747,"Buffalo","NY","NTBUFFAL.txt"]
[null,"146","\"New_York\"","NY","\"Rochester\"","U",11,"Rochester",null,"ROCHESTER    NY","NY",425,6734,"Rochester","NY","NYROCHES.txt"]
[null,"147","\"New_York\"","NY","\"Jamestown\"","U",11,"Jamestown",null,"ERIE    PA","PA",550,6279,"Erie","PA","PAERIE.txt"]
[null,"148","\"New_York\"","NY","\"Ithaca\"","U",8,"Ithaca",null,"SYRACUSE    NY","NY",438,6834,"Syracuse","NY","NYSYRACU.txt"]
[null,"149","\"New_York\"","NY","\"Elmira\"","U",8,"Elmira",null,"BINGHAMTON    NY","NY",337,7273,"Syracuse","NY","NYSYRACU.txt"]
[null,"150","\"Pennsylvania\"","PA","\"Pittsburgh\"",null,{"$f":"LEN(E138)","v":12},{"$f":"MID(E138,2,G138-2)","v":"Pittsburgh"},null,"PITTSBURGH    PA","PA",654,5968,"Pittsburgh","PA","PAPITTSB.txt"]
[null,"151","\"Pennsylvania\"","PA","\"Pittsburgh\"",null,12,"Pittsburgh",null,"PITTSBURGH    PA","PA",654,5968,"Pittsburgh","PA","PAPITTSB.txt"]
[null,"152","\"Pennsylvania\"","PA","\"Pittsburgh\"",null,12,"Pittsburgh",null,"PITTSBURGH    PA","PA",654,5968,"Pittsburgh","PA","PAPITTSB.txt"]
[null,"153","\"Pennsylvania\"","PA","\"Washington\"",null,12,"Washington",null,"PITTSBURGH    PA","PA",654,5968,"Pittsburgh","PA","PAPITTSB.txt"]
[null,"154","\"Pennsylvania\"","PA","\"Uniontown\"",null,11,"Uniontown",null,"PITTSBURGH    PA","PA",654,5968,"Pittsburgh","PA","PAPITTSB.txt"]
[null,"155","\"Pennsylvania\"","PA","\"Somerset\"",null,10,"Somerset",null,"PITTSBURGH    PA","PA",654,5968,"Pittsburgh","PA","PAPITTSB.txt"]
[null,"156","\"Pennsylvania\"","PA","\"Greensburg\"",null,12,"Greensburg",null,"PITTSBURGH    PA","PA",654,5968,"Pittsburgh","PA","PAPITTSB.txt"]
[null,"157","\"Pennsylvania\"","PA","\"Indiana\"",null,9,"Indiana",null,"PITTSBURGH    PA","PA",654,5968,"Pittsburgh","PA","PAPITTSB.txt"]
[null,"158","\"Pennsylvania\"","PA","\"Du Bois\"",null,9,"Du Bois",null,"WILLIAMSPORT    PA","PA",622,6087,"Pittsburgh","PA","PAPITTSB.txt"]
[null,"159","\"Pennsylvania\"","PA","\"Johnstown\"",null,11,"Johnstown",null,"PITTSBURGH    PA","PA",654,5968,"Pittsburgh","PA","PAPITTSB.txt"]
[null,"160","\"Pennsylvania\"","PA","\"Butler\"",null,8,"Butler",null,"YOUNGSTOWN    OH","OH",497,6544,"Youngstown","OH","OHYOUNGS.txt"]
[null,"161","\"Pennsylvania\"","PA","\"New Castle\"",null,12,"New Castle",null,"PITTSBURGH    PA","PA",654,5968,"Pittsburgh","PA","PAPITTSB.txt"]
[null,"162","\"Pennsylvania\"","PA","\"Kittanning\"",null,12,"Kittanning",null,"YOUNGSTOWN    OH","OH",497,6544,"Youngstown","OH","OHYOUNGS.txt"]
[null,"163","\"Pennsylvania\"","PA","\"Oil City\"",null,10,"Oil City",null,"YOUNGSTOWN    OH","OH",497,6544,"Youngstown","OH","OHYOUNGS.txt"]
[null,"164","\"Pennsylvania\"","PA","\"Erie\"",null,6,"Erie",null,"ERIE    PA","PA",550,6279,"Erie","PA","PAERIE.txt"]
[null,"165","\"Pennsylvania\"","PA","\"Erie\"",null,6,"Erie",null,"ERIE    PA","PA",550,6279,"Erie","PA","PAERIE.txt"]
[null,"166","\"Pennsylvania\"","PA","\"Altoona\"",null,9,"Altoona",null,"PITTSBURGH    PA","PA",654,5968,"Pittsburgh","PA","PAPITTSB.txt"]
[null,"167","\"Pennsylvania\"","PA","\"Bradford\"",null,10,"Bradford",null,"ERIE    PA","PA",550,6279,"Erie","PA","PAERIE.txt"]
[null,"168","\"Pennsylvania\"","PA","\"State College\"",null,15,"State College",null,"WILLIAMSPORT    PA","PA",622,6087,"Harrisburg","PA","PAHARRIS.txt "]
[null,"169","\"Pennsylvania\"","PA","\"Wellsboro\"",null,11,"Wellsboro",null,"BINGHAMTON    NY","NY",337,7273,"Wilkes-Barre","PA","PAWILKES.txt"]
[null,"170","\"Pennsylvania\"","PA","\"Harrisburg\"",null,12,"Harrisburg",null,"HARRISBURG    PA","PA",962,5347,"Harrisburg","PA","PAHARRIS.txt "]
[null,"171","\"Pennsylvania\"","PA","\"Harrisburg\"",null,12,"Harrisburg",null,"HARRISBURG    PA","PA",962,5347,"Harrisburg","PA","PAHARRIS.txt "]
[null,"172","\"Pennsylvania\"","PA","\"Chambersburg\"",null,14,"Chambersburg",null,"HARRISBURG    PA","PA",962,5347,"Harrisburg","PA","PAHARRIS.txt "]
[null,"173","\"Pennsylvania\"","PA","\"York\"",null,6,"York",null,"HARRISBURG    PA","PA",962,5347,"Harrisburg","PA","PAHARRIS.txt "]
[null,"174","\"Pennsylvania\"","PA","\"York\"",null,6,"York",null,"HARRISBURG    PA","PA",962,5347,"Harrisburg","PA","PAHARRIS.txt "]
[null,"175","\"Pennsylvania\"","PA","\"Lancaster\"",null,11,"Lancaster",null,"HARRISBURG    PA","PA",962,5347,"Harrisburg","PA","PAHARRIS.txt "]
[null,"176","\"Pennsylvania\"","PA","\"Lancaster\"",null,11,"Lancaster",null,"HARRISBURG    PA","PA",962,5347,"Harrisburg","PA","PAHARRIS.txt "]
[null,"177","\"Pennsylvania\"","PA","\"Williamsport\"",null,14,"Williamsport",null,"WILLIAMSPORT    PA","PA",622,6087,"Harrisburg","PA","PAHARRIS.txt "]
[null,"178","\"Pennsylvania\"","PA","\"Sunbury\"",null,9,"Sunbury",null,"WILLIAMSPORT    PA","PA",622,6087,"Harrisburg","PA","PAHARRIS.txt "]
[null,"179","\"Pennsylvania\"","PA","\"Pottsville\"",null,12,"Pottsville",null,"ALLENTOWN    PA","PA",773,5785,"Allentown","PA","PAALLENT.txt"]
[null,"180","\"Pennsylvania\"","PA","\"Lehigh_Valley\"",null,15,"Lehigh_Valley",null,"ALLENTOWN    PA","PA",773,5785,"Allentown","PA","PAALLENT.txt"]
[null,"181","\"Pennsylvania\"","PA","\"Allentown\"",null,11,"Allentown",null,"ALLENTOWN    PA","PA",773,5785,"Allentown","PA","PAALLENT.txt"]
[null,"182","\"Pennsylvania\"","PA","\"Hazleton\"",null,10,"Hazleton",null,"AVOCA    PA","PA",539,6291,"Wilkes-Barre","PA","PAWILKES.txt"]
[null,"183","\"Pennsylvania\"","PA","\"Stroudsburg\"",null,13,"Stroudsburg",null,"ALLENTOWN    PA","PA",773,5785,"Allentown","PA","PAALLENT.txt"]
[null,"184","\"Pennsylvania\"","PA","\"Scranton\"",null,10,"Scranton",null,"AVOCA    PA","PA",539,6291,"Wilkes-Barre","PA","PAWILKES.txt"]
[null,"185","\"Pennsylvania\"","PA","\"Scranton\"",null,10,"Scranton",null,"AVOCA    PA","PA",539,6291,"Wilkes-Barre","PA","PAWILKES.txt"]
[null,"186","\"Pennsylvania\"","PA","\"Wilkes-Barre\"",null,14,"Wilkes-Barre",null,"AVOCA    PA","PA",539,6291,"Wilkes-Barre","PA","PAWILKES.txt"]
[null,"187","\"Pennsylvania\"","PA","\"Wilkes-Barre\"",null,14,"Wilkes-Barre",null,"AVOCA    PA","PA",539,6291,"Wilkes-Barre","PA","PAWILKES.txt"]
[null,"188","\"Pennsylvania\"","PA","\"Montrose\"",null,10,"Montrose",null,"BINGHAMTON    NY","NY",337,7273,"Wilkes-Barre","PA","PAWILKES.txt"]
[null,"189","\"Pennsylvania\"","PA","\"Doylestown\"",null,12,"Doylestown",null,"PHILADELPHIA    PA","PA",1101,4954,"Philadelphia","PA","PAPHILAD.txt"]
[null,"190","\"Pennsylvania\"","PA","\"Philadelphia\"",null,14,"Philadelphia",null,"WILMINGTON    DE","DE",1046,4937,"Philadelphia","PA","PAPHILAD.txt"]
[null,"191","\"Pennsylvania\"","PA","\"Philadelphia\"",null,14,"Philadelphia",null,"PHILADELPHIA    PA","PA",1101,4954,"Philadelphia","PA","PAPHILAD.txt"]
[null,"193","\"Pennsylvania\"","PA","\"Southeastern\"",null,14,"Southeastern",null,"WILMINGTON    DE","DE",1046,4937,"Wilmington","DE","DEWILMIN.txt"]
[null,"194","\"Pennsylvania\"","PA","\"Southeastern\"",null,14,"Southeastern",null,"WILMINGTON    DE","DE",1046,4937,"Wilmington","DE","DEWILMIN.txt"]
[null,"195","\"Pennsylvania\"","PA","\"Reading\"",null,9,"Reading",null,"ALLENTOWN    PA","PA",773,5785,"Allentown","PA","PAALLENT.txt"]
[null,"196","\"Pennsylvania\"","PA","\"Reading\"",null,9,"Reading",null,"ALLENTOWN    PA","PA",773,5785,"Allentown","PA","PAALLENT.txt"]
[null,"197","\"Delaware\"","DE","\"Wilmington\"",null,12,"Wilmington",null,"WILMINGTON    DE","DE",1046,4937,"Wilmington","DE","DEWILMIN.txt"]
[null,"198","\"Delaware\"","DE","\"Wilmington\"",null,12,"Wilmington",null,"WILMINGTON    DE","DE",1046,4937,"Wilmington","DE","DEWILMIN.txt"]
[null,"199","\"Delaware\"","DE","\"Dover\"",null,7,"Dover",null,"BALTIMORE    MD","MD",1137,4707,"Baltimore","MD","MDBALTIM.txt"]
[null,"200","\"DC\"","DC","\"Washington\"",null,12,"Washington",null,"WASHINGTON NAT'L AP DC","DC",1549,4047,"Washington","MD","MDWASHDC.txt"]
[null,"201","\"DC\"","DC","\"Washington\"",null,12,"Washington",null,"WASHINGTON NAT'L AP DC","DC",1549,4047,"Washington","MD","MDWASHDC.txt"]
[null,"202","\"DC\"","DC","\"Washington\"",null,12,"Washington",null,"WASHINGTON NAT'L AP DC","DC",1549,4047,"Washington","MD","MDWASHDC.txt"]
[null,"203","\"DC\"","DC","\"Washington\"",null,12,"Washington",null,"WASHINGTON NAT'L AP DC","DC",1549,4047,"Washington","MD","MDWASHDC.txt"]
[null,"204","\"DC\"","DC","\"Washington\"",null,12,"Washington",null,"WASHINGTON NAT'L AP DC","DC",1549,4047,"Washington","MD","MDWASHDC.txt"]
[null,"205","\"DC\"","DC","\"Washington\"",null,12,"Washington",null,"WASHINGTON NAT'L AP DC","DC",1549,4047,"Washington","MD","MDWASHDC.txt"]
[null,"206","\"Maryland\"","MD","\"Waldorf\"",null,9,"Waldorf",null,"WASHINGTON NAT'L AP DC","DC",1549,4047,"Washington","MD","MDWASHDC.txt"]
[null,"207","\"Maryland\"","MD","\"Laurel\"",null,8,"Laurel",null,"BALTIMORE    MD","MD",1137,4707,"Baltimore","MD","MDBALTIM.txt"]
[null,"208","\"Maryland\"","MD","\"Rockville\"",null,11,"Rockville",null,"BALTIMORE    MD","MD",1137,4707,"Baltimore","MD","MDBALTIM.txt"]
[null,"209","\"Maryland\"","MD","\"Silver Spring\"",null,15,"Silver Spring",null,"WASHINGTON NAT'L AP DC","DC",1549,4047,"Washington","MD","MDWASHDC.txt"]
[null,"210","\"Maryland\"","MD","\"Baltimore\"",null,11,"Baltimore",null,"BALTIMORE    MD","MD",1137,4707,"Baltimore","MD","MDBALTIM.txt"]
[null,"211","\"Maryland\"","MD","\"Baltimore\"",null,11,"Baltimore",null,"BALTIMORE    MD","MD",1137,4707,"Baltimore","MD","MDBALTIM.txt"]
[null,"212","\"Maryland\"","MD","\"Baltimore\"",null,11,"Baltimore",null,"BALTIMORE    MD","MD",1137,4707,"Baltimore","MD","MDBALTIM.txt"]
[null,"213","\"Maryland\"","MD","\"Baltimore\"",null,11,"Baltimore",null,"BALTIMORE    MD","MD",1137,4707,"Baltimore","MD","MDBALTIM.txt"]
[null,"214","\"Maryland\"","MD","\"Annapolis\"",null,11,"Annapolis",null,"BALTIMORE    MD","MD",1137,4707,"Baltimore","MD","MDBALTIM.txt"]
[null,"215","\"Maryland\"","MD","\"Cumberland\"",null,{"$f":"LEN(E202)","v":12},{"$f":"MID(E202,2,G202-2)","v":"Cumberland"},null,"PITTSBURGH    PA","PA",654,5968,"Pittsburgh","PA","PAPITTSB.txt"]
[null,"216","\"Maryland\"","MD","\"Easton\"",null,8,"Easton",null,"WASHINGTON NAT'L AP DC","DC",1549,4047,"Washington","MD","MDWASHDC.txt"]
[null,"217","\"Maryland\"","MD","\"Frederick\"",null,11,"Frederick",null,"BALTIMORE    MD","MD",1137,4707,"Baltimore","MD","MDBALTIM.txt"]
[null,"218","\"Maryland\"","MD","\"Salisbury\"",null,11,"Salisbury",null,"WALLOPS ISLAND    VA","VA",1096,4261,"Richmond","VA","VARICHMO.txt"]
[null,"219","\"Maryland\"","MD","\"Elkton\"",null,8,"Elkton",null,"WILMINGTON    DE","DE",1046,4937,"Wilmington","DE","DEWILMIN.txt"]
[null,"220","\"Virginia\"","VA","\"Northern VA\"",null,13,"Northern VA",null,"WASHINGTON DULLES AP DC","DC",973,5006,"Washington","MD","MDWASHDC.txt"]
[null,"221","\"Virginia\"","VA","\"Northern VA\"",null,13,"Northern VA",null,"WASHINGTON DULLES AP DC","DC",973,5006,"Washington","MD","MDWASHDC.txt"]
[null,"222","\"Virginia\"","VA","\"Arlington\"",null,11,"Arlington",null,"WASHINGTON NAT'L AP DC","DC",1549,4047,"Washington","MD","MDWASHDC.txt"]
[null,"223","\"Virginia\"","VA","\"Alexandria\"",null,12,"Alexandria",null,"WASHINGTON NAT'L AP DC","DC",1549,4047,"Washington","MD","MDWASHDC.txt"]
[null,"224","\"Virginia\"","VA","\"Fredericksburg\"",null,16,"Fredericksburg",null,"RICHMOND    VA","VA",1348,3963,"Richmond","VA","VARICHMO.txt"]
[null,"225","\"Virginia\"","VA","\"Fredericksburg\"",null,16,"Fredericksburg",null,"RICHMOND    VA","VA",1348,3963,"Richmond","VA","VARICHMO.txt"]
[null,"226","\"Virginia\"","VA","\"Winchester\"",null,12,"Winchester",null,"WASHINGTON DULLES AP DC","DC",973,5006,"Washington","MD","MDWASHDC.txt"]
[null,"227","\"Virginia\"","VA","\"Culpeper\"",null,10,"Culpeper",null,"WASHINGTON DULLES AP DC","DC",973,5006,"Washington","MD","MDWASHDC.txt"]
[null,"228","\"Virginia\"","VA","\"Harrisonburg\"",null,14,"Harrisonburg",null,"WASHINGTON DULLES AP DC","DC",973,5006,"Washington","MD","MDWASHDC.txt"]
[null,"229","\"Virginia\"","VA","\"Charlottesville\"",null,17,"Charlottesville",null,"RICHMOND    VA","VA",1348,3963,"Richmond","VA","VARICHMO.txt"]
[null,"230","\"Virginia\"","VA","\"Richmond\"",null,10,"Richmond",null,"RICHMOND    VA","VA",1348,3963,"Richmond","VA","VARICHMO.txt"]
[null,"231","\"Virginia\"","VA","\"Richmond\"",null,10,"Richmond",null,"RICHMOND    VA","VA",1348,3963,"Richmond","VA","VARICHMO.txt"]
[null,"232","\"Virginia\"","VA","\"Richmond\"",null,10,"Richmond",null,"RICHMOND    VA","VA",1348,3963,"Richmond","VA","VARICHMO.txt"]
[null,"233","\"Virginia\"","VA","\"Norfolk\"",null,9,"Norfolk",null,"NORFOLK    VA","VA",1422,3495,"Norfolk","VA","VANORFOL.txt "]
[null,"234","\"Virginia\"","VA","\"Norfolk\"",null,9,"Norfolk",null,"NORFOLK    VA","VA",1422,3495,"Norfolk","VA","VANORFOL.txt "]
[null,"235","\"Virginia\"","VA","\"Norfolk\"",null,9,"Norfolk",null,"NORFOLK    VA","VA",1422,3495,"Norfolk","VA","VANORFOL.txt "]
[null,"236","\"Virginia\"","VA","\"Norfolk\"",null,9,"Norfolk",null,"NORFOLK    VA","VA",1422,3495,"Norfolk","VA","VANORFOL.txt "]
[null,"237","\"Virginia\"","VA","\"Portsmouth\"",null,12,"Portsmouth",null,"NORFOLK    VA","VA",1422,3495,"Norfolk","VA","VANORFOL.txt "]
[null,"238","\"Virginia\"","VA","\"Petersburg\"",null,12,"Petersburg",null,"NORFOLK    VA","VA",1422,3495,"Norfolk","VA","VANORFOL.txt "]
[null,"239","\"Virginia\"","VA","\"Farmville\"",null,11,"Farmville",null,"RICHMOND    VA","VA",1348,3963,"Richmond","VA","VARICHMO.txt"]
[null,"240","\"Virginia\"","VA","\"Roanoke\"",null,9,"Roanoke",null,"ROANOKE    VA","VA",1052,4360,"Roanoke","VA","VAROANOK.txt"]
[null,"241","\"Virginia\"","VA","\"Roanoke\"",null,9,"Roanoke",null,"ROANOKE    VA","VA",1052,4360,"Roanoke","VA","VAROANOK.txt"]
[null,"242","\"Virginia\"","VA","\"Bristol\"",null,9,"Bristol",null,"ROANOKE    VA","VA",1052,4360,"Roanoke","VA","VAROANOK.txt"]
[null,"243","\"Virginia\"","VA","\"Pulaski\"",null,9,"Pulaski",null,"ROANOKE    VA","VA",1052,4360,"Roanoke","VA","VAROANOK.txt"]
[null,"244","\"Virginia\"","VA","\"Staunton\"",null,10,"Staunton",null,"ROANOKE    VA","VA",1052,4360,"Roanoke","VA","VAROANOK.txt"]
[null,"245","\"Virginia\"","VA","\"Lynchburg\"",null,11,"Lynchburg",null,"LYNCHBURG    VA","VA",1048,4340,"Roanoke","VA","VAROANOK.txt"]
[null,"246","\"Virginia\"","VA","\"Tazewell\"",null,10,"Tazewell",null,"ROANOKE    VA","VA",1052,4360,"Roanoke","VA","VAROANOK.txt"]
[null,"247","\"West_Virginia\"","WV","\"Bluefield\"",null,11,"Bluefield",null,"ROANOKE    VA","VA",1052,4360,"Roanoke","VA","VAROANOK.txt"]
[null,"248","\"West_Virginia\"","WV","\"Welch\"",null,7,"Welch",null,"CHARLESTON    WV","WV",1031,4646,"Charleston","WV","WVCHARLE.txt"]
[null,"249","\"West_Virginia\"","WV","\"Lewisburg\"",null,11,"Lewisburg",null,"CHARLESTON    WV","WV",1031,4646,"Charleston","WV","WVCHARLE.txt"]
[null,"250","\"West_Virginia\"","WV","\"Charleston\"",null,12,"Charleston",null,"CHARLESTON    WV","WV",1031,4646,"Charleston","WV","WVCHARLE.txt"]
[null,"251","\"West_Virginia\"","WV","\"Charleston\"",null,12,"Charleston",null,"CHARLESTON    WV","WV",1031,4646,"Charleston","WV","WVCHARLE.txt"]
[null,"252","\"West_Virginia\"","WV","\"Charleston\"",null,12,"Charleston",null,"CHARLESTON    WV","WV",1031,4646,"Charleston","WV","WVCHARLE.txt"]
[null,"253","\"West_Virginia\"","WV","\"Charleston\"",null,12,"Charleston",null,"CHARLESTON    WV","WV",1031,4646,"Charleston","WV","WVCHARLE.txt"]
[null,"254","\"West_Virginia\"","WV","\"Martinsburg\"",null,13,"Martinsburg",null,"WASHINGTON DULLES AP DC","DC",973,5006,"Washington","MD","MDWASHDC.txt"]
[null,"255","\"West_Virginia\"","WV","\"Huntington\"",null,12,"Huntington",null,"CHARLESTON    WV","WV",1031,4646,"Charleston","WV","WVCHARLE.txt"]
[null,"256","\"West_Virginia\"","WV","\"Logan\"",null,7,"Logan",null,"CHARLESTON    WV","WV",1031,4646,"Charleston","WV","WVCHARLE.txt"]
[null,"257","\"West_Virginia\"","WV","\"Huntington\"",null,12,"Huntington",null,"HUNTINGTON    WV","WV",1005,4665,"Charleston","WV","WVCHARLE.txt"]
[null,"258","\"West_Virginia\"","WV","\"Beckley\"",null,9,"Beckley",null,"BECKLEY    WV","WV",463,5558,"Charleston","WV","WVCHARLE.txt"]
[null,"259","\"West_Virginia\"","WV","\"Beckley\"",null,9,"Beckley",null,"BECKLEY    WV","WV",463,5558,"Charleston","WV","WVCHARLE.txt"]
[null,"260","\"West_Virginia\"","WV","\"Wheeling\"",null,10,"Wheeling",null,"PITTSBURGH    PA","PA",654,5968,"Pittsburgh","PA","PAPITTSB.txt"]
[null,"261","\"West_Virginia\"","WV","\"Parkersburg\"",null,13,"Parkersburg",null,"CHARLESTON    WV","WV",1031,4646,"Charleston","WV","WVCHARLE.txt"]
[null,"262","\"West_Virginia\"","WV","\"Buckhannon\"",null,12,"Buckhannon",null,"CHARLESTON    WV","WV",1031,4646,"Charleston","WV","WVCHARLE.txt"]
[null,"263","\"West_Virginia\"","WV","\"Clarksburg\"",null,12,"Clarksburg",null,"ELKINS    WV","WV",346,6120,"Elkins","WV","WVELKINS.txt"]
[null,"264","\"West_Virginia\"","WV","\"Clarksburg\"",null,12,"Clarksburg",null,"ELKINS    WV","WV",346,6120,"Elkins","WV","WVELKINS.txt"]
[null,"265","\"West_Virginia\"","WV","\"Morgantown\"",null,12,"Morgantown",null,"PITTSBURGH    PA","PA",654,5968,"Pittsburgh","PA","PAPITTSB.txt"]
[null,"266","\"West_Virginia\"","WV","\"Gassaway\"",null,10,"Gassaway",null,"CHARLESTON    WV","WV",1031,4646,"Charleston","WV","WVCHARLE.txt"]
[null,"267","\"West_Virginia\"","WV","\"Keyser\"",null,8,"Keyser",null,"ELKINS    WV","WV",346,6120,"Elkins","WV","WVELKINS.txt"]
[null,"268","\"West_Virginia\"","WV","\"Petersburg\"",null,12,"Petersburg",null,"ELKINS    WV","WV",346,6120,"Elkins","WV","WVELKINS.txt"]
[null,"270","\"North_Carolina\"","NC","\"Winston-Salem\"",null,15,"Winston-Salem",null,"GREENSBORO-WNSTN-SALM-HGHPT NC","NC",1253,3865,"Greensboro","NC","NCGRNSBO.txt"]
[null,"271","\"North_Carolina\"","NC","\"Winston-Salem\"",null,15,"Winston-Salem",null,"GREENSBORO-WNSTN-SALM-HGHPT NC","NC",1253,3865,"Greensboro","NC","NCGRNSBO.txt"]
[null,"272","\"North_Carolina\"","NC","\"Greensboro\"",null,12,"Greensboro",null,"GREENSBORO-WNSTN-SALM-HGHPT NC","NC",1253,3865,"Greensboro","NC","NCGRNSBO.txt"]
[null,"273","\"North_Carolina\"","NC","\"Greensboro\"",null,12,"Greensboro",null,"GREENSBORO-WNSTN-SALM-HGHPT NC","NC",1253,3865,"Greensboro","NC","NCGRNSBO.txt"]
[null,"274","\"North_Carolina\"","NC","\"Greensboro\"",null,12,"Greensboro",null,"GREENSBORO-WNSTN-SALM-HGHPT NC","NC",1253,3865,"Greensboro","NC","NCGRNSBO.txt"]
[null,"275","\"North_Carolina\"","NC","\"Raleigh\"",null,9,"Raleigh",null,"RALEIGH    NC","NC",1417,3457,"Raleigh Durham","NC","NCRALEIG.txt"]
[null,"276","\"North_Carolina\"","NC","\"Raleigh\"",null,9,"Raleigh",null,"RALEIGH    NC","NC",1417,3457,"Raleigh Durham","NC","NCRALEIG.txt"]
[null,"277","\"North_Carolina\"","NC","\"Durham\"",null,8,"Durham",null,"RALEIGH    NC","NC",1417,3457,"Raleigh Durham","NC","NCRALEIG.txt"]
[null,"278","\"North_Carolina\"","NC","\"Rocky Mount\"",null,13,"Rocky Mount",null,"RALEIGH    NC","NC",1417,3457,"Raleigh Durham","NC","NCRALEIG.txt"]
[null,"279","\"North_Carolina\"","NC","\"Elizabeth City\"",null,16,"Elizabeth City",null,"NORFOLK    VA","VA",1422,3495,"Norfolk","VA","VANORFOL.txt "]
[null,"280","\"North_Carolina\"","NC","\"Charlotte\"",null,{"$f":"LEN(E266)","v":11},{"$f":"MID(E266,2,G266-2)","v":"Charlotte"},null,"GREENVILLE-SPARTANBURG AP    SC","SC",1473,3272,"Charlotte","NC","NCCHARLO.txt"]
[null,"281","\"North_Carolina\"","NC","\"Charlotte\"",null,11,"Charlotte",null,"GREENVILLE-SPARTANBURG AP    SC","SC",1473,3272,"Charlotte","NC","NCCHARLO.txt"]
[null,"282","\"North_Carolina\"","NC","\"Charlotte\"",null,11,"Charlotte",null,"CHARLOTTE   NC","NC",1582,3341,"Charlotte","NC","NCCHARLO.txt"]
[null,"283","\"North_Carolina\"","NC","\"Fayetteville\"",null,14,"Fayetteville",null,"CHARLOTTE   NC","NC",1582,3341,"Charlotte","NC","NCCHARLO.txt"]
[null,"284","\"North_Carolina\"","NC","\"Wilmington\"",null,12,"Wilmington",null,"WILMINGTON    NC","NC",1926,2470,"Charlotte","NC","NCCHARLO.txt"]
[null,"285","\"North_Carolina\"","NC","\"Kinston\"",null,9,"Kinston",null,"WILMINGTON    NC","NC",1926,2470,"Charlotte","NC","NCCHARLO.txt"]
[null,"286","\"North_Carolina\"","NC","\"Hickory\"",null,9,"Hickory",null,"GREENSBORO-WNSTN-SALM-HGHPT NC","NC",1253,3865,"Greensboro","NC","NCGRNSBO.txt"]
[null,"287","\"North_Carolina\"","NC","\"Asheville\"",null,11,"Asheville",null,"BRISTOL-JHNSN CTY-KNGSPRT    TN","TN",972,4406,"Asheville","NC","NCASHEVI.txt"]
[null,"288","\"North_Carolina\"","NC","\"Asheville\"",null,11,"Asheville",null,"ASHEVILLE    NC","NC",787,4308,"Asheville","NC","NCASHEVI.txt"]
[null,"289","\"North_Carolina\"","NC","\"Andrews\"",null,9,"Andrews",null,"KNOXVILLE    TN","TN",1266,3937,"Knoxville","TN","TNKNOXVI.txt"]
[null,"290","\"South_Carolina\"","SC","\"Columbia\"",null,10,"Columbia",null,"COLUMBIA    SC","SC",1966,2649,"Columbia","SC","SCCOLMBA.txt"]
[null,"291","\"South_Carolina\"","SC","\"Columbia\"",null,10,"Columbia",null,"COLUMBIA    SC","SC",1966,2649,"Columbia","SC","SCCOLMBA.txt"]
[null,"292","\"South_Carolina\"","SC","\"Columbia\"",null,10,"Columbia",null,"COLUMBIA    SC","SC",1966,2649,"Columbia","SC","SCCOLMBA.txt"]
[null,"293","\"South_Carolina\"","SC","\"Spartanburg\"",null,13,"Spartanburg",null,"GREENVILLE-SPARTANBURG AP    SC","SC",1473,3272,"Charlotte","NC","NCCHARLO.txt"]
[null,"294","\"South_Carolina\"","SC","\"Charleston\"",null,12,"Charleston",null,"CHARLESTON AP    SC","SC",2266,2013,"Charleston","SC","SCCHARLE.txt"]
[null,"295","\"South_Carolina\"","SC","\"Florence\"",null,10,"Florence",null,"WILMINGTON    NC","NC",1926,2470,"Columbia","SC","SCCOLMBA.txt"]
[null,"296","\"South_Carolina\"","SC","\"Greenville\"",null,12,"Greenville",null,"GREENVILLE-SPARTANBURG AP    SC","SC",1473,3272,"Charlotte","NC","NCCHARLO.txt"]
[null,"297","\"South_Carolina\"","SC","\"Rock_Hill\"",null,11,"Rock_Hill",null,"COLUMBIA    SC","SC",1966,2649,"Columbia","SC","SCCOLMBA.txt"]
[null,"298","\"South_Carolina\"","SC","\"Aiken\"",null,7,"Aiken",null,"COLUMBIA    SC","SC",1966,2649,"Columbia","SC","SCCOLMBA.txt"]
[null,"299","\"South_Carolina\"","SC","\"Beaufort\"",null,10,"Beaufort",null,"SAVANNAH    GA","GA",2365,1847,"Savannah","GA","GASAVANN.txt"]
[null,"300","\"Georgia\"","GA","\"Atlanta\"",null,9,"Atlanta",null,"ATLANTA    GA","GA",1667,2991,"Atlanta","GA","GAATLANT.txt"]
[null,"301","\"Georgia\"","GA","\"Atlanta\"",null,9,"Atlanta",null,"ATLANTA    GA","GA",1667,2991,"Atlanta","GA","GAATLANT.txt"]
[null,"302","\"Georgia\"","GA","\"Atlanta\"",null,9,"Atlanta",null,"ATLANTA    GA","GA",1667,2991,"Atlanta","GA","GAATLANT.txt"]
[null,"303","\"Georgia\"","GA","\"Atlanta\"",null,9,"Atlanta",null,"ATLANTA    GA","GA",1667,2991,"Atlanta","GA","GAATLANT.txt"]
[null,"304","\"Georgia\"","GA","\"Swainsboro\"",null,12,"Swainsboro",null,"SAVANNAH    GA","GA",2365,1847,"Savannah","GA","GASAVANN.txt"]
[null,"305","\"Georgia\"","GA","\"Gainesville\"",null,13,"Gainesville",null,"GREENVILLE-SPARTANBURG AP    SC","SC",1473,3272,"Atlanta","GA","GAATLANT.txt"]
[null,"306","\"Georgia\"","GA","\"Athens\"",null,8,"Athens",null,"ATHENS    GA","GA",1709,2893,"Atlanta","GA","GAATLANT.txt"]
[null,"307","\"Georgia\"","GA","\"Dalton\"",null,8,"Dalton",null,"CHATTANOOGA    TN","TN",1544,3587,"Chattanooga","TN","TNCHATTA.txt"]
[null,"308","\"Georgia\"","GA","\"Augusta\"",null,9,"Augusta",null,"ATHENS    GA","GA",1709,2893,"Columbia","SC","SCCOLMBA.txt"]
[null,"309","\"Georgia\"","GA","\"Augusta\"",null,9,"Augusta",null,"AUGUSTA    GA","GA",1948,2565,"Columbia","SC","SCCOLMBA.txt"]
[null,"310","\"Georgia\"","GA","\"Macon\"",null,7,"Macon",null,"COLUMBUS    GA","GA",2284,2261,"Macon","GA","GAMACON.txt"]
[null,"311","\"Georgia\"","GA","\"Macon\"",null,7,"Macon",null,"COLUMBUS    GA","GA",2284,2261,"Macon","GA","GAMACON.txt"]
[null,"312","\"Georgia\"","GA","\"Macon\"",null,7,"Macon",null,"MACON    GA","GA",2125,2334,"Macon","GA","GAMACON.txt"]
[null,"313","\"Georgia\"","GA","\"Savannah\"",null,10,"Savannah",null,"SAVANNAH    GA","GA",2365,1847,"Savannah","GA","GASAVANN.txt"]
[null,"314","\"Georgia\"","GA","\"Savannah\"",null,10,"Savannah",null,"SAVANNAH    GA","GA",2365,1847,"Savannah","GA","GASAVANN.txt"]
[null,"315","\"Georgia\"","GA","\"Waycross\"",null,10,"Waycross",null,"SAVANNAH    GA","GA",2365,1847,"Savannah","GA","GASAVANN.txt"]
[null,"316","\"Georgia\"","GA","\"Valdosta\"",null,10,"Valdosta",null,"TALLAHASSEE    FL","FL",2518,1705,"Tallahassee","FL","FLTALLAH.txt"]
[null,"317","\"Georgia\"","GA","\"Albany\"",null,8,"Albany",null,"COLUMBUS    GA","GA",2284,2261,"Columbus","GA","GACOLMBS.txt"]
[null,"318","\"Georgia\"","GA","\"Columbus\"",null,10,"Columbus",null,"MACON    GA","GA",2125,2334,"Columbus","GA","GACOLMBS.txt"]
[null,"319","\"Georgia\"","GA","\"Columbus\"",null,10,"Columbus",null,"COLUMBUS    GA","GA",2284,2261,"Columbus","GA","GACOLMBS.txt"]
[null,"320","\"Florida\"","FL","\"Jacksonville\"",null,14,"Jacksonville",null,"JACKSONVILLE    FL","FL",2551,1434,"Jacksonville","FL","FLJACKSV.txt"]
[null,"321","\"Florida\"","FL","\"Jacksonville\"",null,14,"Jacksonville",null,"JACKSONVILLE    FL","FL",2551,1434,"Jacksonville","FL","FLJACKSV.txt"]
[null,"322","\"Florida\"","FL","\"Jacksonville\"",null,14,"Jacksonville",null,"JACKSONVILLE    FL","FL",2551,1434,"Jacksonville","FL","FLJACKSV.txt"]
[null,"323","\"Florida\"","FL","\"Tallahassee\"",null,13,"Tallahassee",null,"TALLAHASSEE    FL","FL",2518,1705,"Tallahassee","FL","FLTALLAH.txt"]
[null,"324","\"Florida\"","FL","\"Panama City\"",null,13,"Panama City",null,"APALACHICOLA    FL","FL",2582,1429,"Tallahassee","FL","FLTALLAH.txt"]
[null,"325","\"Florida\"","FL","\"Pensacola\"",null,11,"Pensacola",null,"PENSACOLA    FL","FL",2636,1617,"Mobile","AL","ALMOBILE.txt"]
[null,"326","\"Florida\"","FL","\"Gainesville\"",null,13,"Gainesville",null,"GAINESVILLE    FL","FL",2609,1267,"Jacksonville","FL","FLJACKSV.txt"]
[null,"327","\"Florida\"","FL","\"Titusville\"",null,12,"Titusville",null,"DAYTONA BEACH    FL","FL",2919,909,"Daytona Beach","FL","FLDAYTNA.txt"]
[null,"328","\"Florida\"","FL","\"Orlando\"",null,9,"Orlando",null,"ORLANDO    FL","FL",3381,686,"Orlando","FL","FLORLAND.txt"]
[null,"329","\"Florida\"","FL","\"Melbourne\"",null,11,"Melbourne",null,"VERO BEACH    FL","FL",3278,548,"Orlando","FL","FLORLAND.txt"]
[null,"330","\"Florida\"","FL","\"Miami\"",null,7,"Miami",null,"KEY WEST    FL","FL",4798,100,"Miami Beach","FL","FLMIAMIB.txt"]
[null,"331","\"Florida\"","FL","\"Miami\"",null,7,"Miami",null,"MIAMI    FL","FL",4198,200,"Miami Beach","FL","FLMIAMIB.txt"]
[null,"332","\"Florida\"","FL","\"Miami\"",null,7,"Miami",null,"MIAMI    FL","FL",4198,200,"Miami Beach","FL","FLMIAMIB.txt"]
[null,"333","\"Florida\"","FL","\"Fort Lauderdale\"",null,17,"Fort Lauderdale",null,"MIAMI    FL","FL",4198,200,"Miami Beach","FL","FLMIAMIB.txt"]
[null,"334","\"Florida\"","FL","\"West Palm Beach\"",null,17,"West Palm Beach",null,"WEST PALM BEACH    FL","FL",3891,323,"West Palm Beach","FL","FLWPALMB.txt"]
[null,"335","\"Florida\"","FL","\"Tampa\"",null,7,"Tampa",null,"TAMPA    FL","FL",3427,725,"Tampa St. Petersburg","FL","FLTAMPA.txt"]
[null,"336","\"Florida\"","FL","\"Tampa\"",null,7,"Tampa",null,"TAMPA    FL","FL",3427,725,"Tampa St. Petersburg","FL","FLTAMPA.txt"]
[null,"337","\"Florida\"","FL","\"St. Petersburg\"",null,16,"St. Petersburg",null,"TAMPA    FL","FL",3427,725,"Tampa St. Petersburg","FL","FLTAMPA.txt"]
[null,"338","\"Florida\"","FL","\"Lakeland\"",null,10,"Lakeland",null,"TAMPA    FL","FL",3427,725,"Tampa St. Petersburg","FL","FLTAMPA.txt"]
[null,"339","\"Florida\"","FL","\"Fort Myers\"",null,12,"Fort Myers",null,"FORT MYERS    FL","FL",3855,418,"Tampa St. Petersburg","FL","FLTAMPA.txt"]
[null,"342","\"Florida\"","FL","\"Bradenton\"",null,11,"Bradenton",null,"TAMPA    FL","FL",3427,725,"Tampa St. Petersburg","FL","FLTAMPA.txt"]
[null,"344","\"Florida\"","FL","\"Ocala\"",null,7,"Ocala",null,"DAYTONA BEACH    FL","FL",2919,909,"Daytona Beach","FL","FLDAYTNA.txt"]
[null,"346","\"Florida\"","FL","\"Clearwater\"",null,12,"Clearwater",null,"TAMPA    FL","FL",3427,725,"Tampa St. Petersburg","FL","FLTAMPA.txt"]
[null,"347","\"Florida\"","FL","\"Orlando\"",null,9,"Orlando",null,"ORLANDO    FL","FL",3381,686,"Orlando","FL","FLORLAND.txt"]
[null,"349","\"Florida\"","FL","\"Fort Pierce\"",null,{"$f":"LEN(E330)","v":13},{"$f":"MID(E330,2,G330-2)","v":"Fort Pierce"},null,"TAMPA    FL","FL",3427,725,"Tampa St. Petersburg","FL","FLTAMPA.txt"]
[null,"350","\"Alabama\"","AL","\"Birmingham\"",null,12,"Birmingham",null,"BIRMINGHAM AP    AL","AL",1797,2918,"Birmingham","AL","ALBIRMIN.txt "]
[null,"351","\"Alabama\"","AL","\"Birmingham\"",null,12,"Birmingham",null,"BIRMINGHAM AP    AL","AL",1797,2918,"Birmingham","AL","ALBIRMIN.txt "]
[null,"352","\"Alabama\"","AL","\"Birmingham\"",null,12,"Birmingham",null,"BIRMINGHAM AP    AL","AL",1797,2918,"Birmingham","AL","ALBIRMIN.txt "]
[null,"354","\"Alabama\"","AL","\"Tuscaloosa\"",null,12,"Tuscaloosa",null,"MERIDIAN    MS","MS",2138,2444,"Birmingham","AL","ALBIRMIN.txt "]
[null,"355","\"Alabama\"","AL","\"Jasper\"",null,8,"Jasper",null,"HUNTSVILLE    AL","AL",1651,3323,"Huntsville","AL","ALHUNTSV.txt"]
[null,"356","\"Alabama\"","AL","\"Decatur/Florence\"",null,18,"Decatur/Florence",null,"HUNTSVILLE    AL","AL",1651,3323,"Huntsville","AL","ALHUNTSV.txt"]
[null,"357","\"Alabama\"","AL","\"Huntsville\"",null,12,"Huntsville",null,"CHATTANOOGA    TN","TN",1544,3587,"Chattanooga","TN","TNCHATTA.txt"]
[null,"358","\"Alabama\"","AL","\"Huntsville\"",null,12,"Huntsville",null,"HUNTSVILLE    AL","AL",1651,3323,"Huntsville","AL","ALHUNTSV.txt"]
[null,"359","\"Alabama\"","AL","\"Gadsden\"",null,9,"Gadsden",null,"ATLANTA    GA","GA",1667,2991,"Atlanta","GA","GAATLANT.txt"]
[null,"360","\"Alabama\"","AL","\"Montgomery\"",null,12,"Montgomery",null,"COLUMBUS    GA","GA",2284,2261,"Montgomery","AL","ALMONTGO.txt "]
[null,"361","\"Alabama\"","AL","\"Montgomery\"",null,12,"Montgomery",null,"MONTGOMERY    AL","AL",2212,2224,"Montgomery","AL","ALMONTGO.txt "]
[null,"362","\"Alabama\"","AL","\"Anniston\"",null,10,"Anniston",null,"BIRMINGHAM AP    AL","AL",1797,2918,"Birmingham","AL","ALBIRMIN.txt "]
[null,"363","\"Alabama\"","AL","\"Dothan\"",null,8,"Dothan",null,"MONTGOMERY    AL","AL",2212,2224,"Montgomery","AL","ALMONTGO.txt "]
[null,"364","\"Alabama\"","AL","\"Evergreen\"",null,11,"Evergreen",null,"MONTGOMERY    AL","AL",2212,2224,"Montgomery","AL","ALMONTGO.txt "]
[null,"365","\"Alabama\"","AL","\"Mobile\"",null,8,"Mobile",null,"MOBILE    AL","AL",2627,1702,"Mobile","AL","ALMOBILE.txt"]
[null,"366","\"Alabama\"","AL","\"Mobile\"",null,8,"Mobile",null,"MOBILE    AL","AL",2627,1702,"Mobile","AL","ALMOBILE.txt"]
[null,"367","\"Alabama\"","AL","\"Selma\"",null,7,"Selma",null,"MONTGOMERY    AL","AL",2212,2224,"Montgomery","AL","ALMONTGO.txt "]
[null,"368","\"Alabama\"","AL","\"Opelika\"",null,9,"Opelika",null,"COLUMBUS    GA","GA",2284,2261,"Columbus","GA","GACOLMBS.txt"]
[null,"369","\"Alabama\"","AL","\"Butler\"",null,8,"Butler",null,"MERIDIAN    MS","MS",2138,2444,"Jackson","MS","MSJACKSO.txt"]
[null,"370","\"Tennessee\"","TN","\"Nashville\"",null,11,"Nashville",null,"NASHVILLE    TN","TN",1616,3729,"Nashville","TN","TNNASHVI.txt"]
[null,"371","\"Tennessee\"","TN","\"Nashville\"",null,11,"Nashville",null,"NASHVILLE    TN","TN",1616,3729,"Nashville","TN","TNNASHVI.txt"]
[null,"372","\"Tennessee\"","TN","\"Nashville\"",null,11,"Nashville",null,"NASHVILLE    TN","TN",1616,3729,"Nashville","TN","TNNASHVI.txt"]
[null,"373","\"Tennessee\"","TN","\"Chattanooga\"",null,13,"Chattanooga",null,"HUNTSVILLE    AL","AL",1651,3323,"Chattanooga","TN","TNCHATTA.txt"]
[null,"374","\"Tennessee\"","TN","\"Chattanooga\"",null,13,"Chattanooga",null,"CHATTANOOGA    TN","TN",1544,3587,"Chattanooga","TN","TNCHATTA.txt"]
[null,"376","\"Tennessee\"","TN","\"Johnson City\"",null,14,"Johnson City",null,"BRISTOL-JHNSN CTY-KNGSPRT    TN","TN",972,4406,"Knoxville","TN","TNKNOXVI.txt"]
[null,"377","\"Tennessee\"","TN","\"Knoxville\"",null,11,"Knoxville",null,"KNOXVILLE    TN","TN",1266,3937,"Knoxville","TN","TNKNOXVI.txt"]
[null,"378","\"Tennessee\"","TN","\"Knoxville\"",null,11,"Knoxville",null,"KNOXVILLE    TN","TN",1266,3937,"Knoxville","TN","TNKNOXVI.txt"]
[null,"379","\"Tennessee\"","TN","\"Knoxville\"",null,11,"Knoxville",null,"KNOXVILLE    TN","TN",1266,3937,"Knoxville","TN","TNKNOXVI.txt"]
[null,"380","\"Tennessee\"","TN","\"Memphis\"",null,9,"Memphis",null,"MEMPHIS    TN","TN",2118,3082,"Memphis","TN","TNMEMPHI.txt"]
[null,"381","\"Tennessee\"","TN","\"Memphis\"",null,9,"Memphis",null,"MEMPHIS    TN","TN",2118,3082,"Memphis","TN","TNMEMPHI.txt"]
[null,"382","\"Tennessee\"","TN","\"Mc_Kenzie\"",null,11,"Mc_Kenzie",null,"NASHVILLE    TN","TN",1616,3729,"Nashville","TN","TNNASHVI.txt"]
[null,"383","\"Tennessee\"","TN","\"Jackson\"",null,9,"Jackson",null,"HUNTSVILLE    AL","AL",1651,3323,"Huntsville","AL","ALHUNTSV.txt"]
[null,"384","\"Tennessee\"","TN","\"Columbia\"",null,10,"Columbia",null,"NASHVILLE    TN","TN",1616,3729,"Nashville","TN","TNNASHVI.txt"]
[null,"385","\"Tennessee\"","TN","\"Cookeville\"",null,12,"Cookeville",null,"NASHVILLE    TN","TN",1616,3729,"Nashville","TN","TNNASHVI.txt"]
[null,"386","\"Mississippi\"","MS","\"Oxford\"",null,8,"Oxford",null,"MEMPHIS    TN","TN",2118,3082,"Memphis","TN","TNMEMPHI.txt"]
[null,"387","\"Mississippi\"","MS","\"Greenville\"",null,12,"Greenville",null,"JACKSON    MS","MS",2215,2467,"Jackson","MS","MSJACKSO.txt"]
[null,"388","\"Mississippi\"","MS","\"Tupelo\"",null,8,"Tupelo",null,"TUPELO    MS","MS",1908,3079,"Tupelo","MS","MSTUPELO.txt"]
[null,"389","\"Mississippi\"","MS","\"Grenada\"",null,9,"Grenada",null,"MERIDIAN    MS","MS",2138,2444,"Tupelo","MS","MSTUPELO.txt"]
[null,"390","\"Mississippi\"","MS","\"Jackson\"",null,9,"Jackson",null,"JACKSON    MS","MS",2215,2467,"Jackson","MS","MSJACKSO.txt"]
[null,"391","\"Mississippi\"","MS","\"Jackson\"",null,9,"Jackson",null,"JACKSON    MS","MS",2215,2467,"Jackson","MS","MSJACKSO.txt"]
[null,"392","\"Mississippi\"","MS","\"Jackson\"",null,9,"Jackson",null,"JACKSON    MS","MS",2215,2467,"Jackson","MS","MSJACKSO.txt"]
[null,"393","\"Mississippi\"","MS","\"Meridian\"",null,10,"Meridian",null,"MERIDIAN    MS","MS",2138,2444,"Jackson","MS","MSJACKSO.txt"]
[null,"394","\"Mississippi\"","MS","\"Hattiesburg\"",null,13,"Hattiesburg",null,"MOBILE    AL","AL",2627,1702,"Mobile","AL","ALMOBILE.txt"]
[null,"395","\"Mississippi\"","MS","\"Gulfport\"",null,10,"Gulfport",null,"NEW ORLEANS    LA","LA",2655,1513,"New Orleans","LA","LANEWORL.txt"]
[null,"396","\"Mississippi\"","MS","\"McComb\"",null,8,"McComb",null,"JACKSON    MS","MS",2215,2467,"Jackson","MS","MSJACKSO.txt"]
[null,"397","\"Mississippi\"","MS","\"Columbus\"",null,10,"Columbus",null,"BIRMINGHAM AP    AL","AL",1797,2918,"Birmingham","AL","ALBIRMIN.txt "]
[null,"400","\"Kentucky\"","KY","\"Louisville\"",null,12,"Louisville",null,"LOUISVILLE    KY","KY",1288,4514,"Louisville","KY","KYLOUISV.txt"]
[null,"401","\"Kentucky\"","KY","\"Louisville\"",null,12,"Louisville",null,"LOUISVILLE    KY","KY",1288,4514,"Louisville","KY","KYLOUISV.txt"]
[null,"402","\"Kentucky\"","KY","\"Louisville\"",null,12,"Louisville",null,"LOUISVILLE    KY","KY",1288,4514,"Louisville","KY","KYLOUISV.txt"]
[null,"403","\"Kentucky\"","KY","\"Lexington\"",null,11,"Lexington",null,"LEXINGTON    KY","KY",1140,4783,"Lexington","KY","KYLEXING.txt"]
[null,"404","\"Kentucky\"","KY","\"Lexington\"",null,11,"Lexington",null,"LEXINGTON    KY","KY",1140,4783,"Lexington","KY","KYLEXING.txt"]
[null,"405","\"Kentucky\"","KY","\"Lexington\"",null,11,"Lexington",null,"LEXINGTON    KY","KY",1140,4783,"Lexington","KY","KYLEXING.txt"]
[null,"406","\"Kentucky\"","KY","\"Frankfort\"",null,11,"Frankfort",null,"LEXINGTON    KY","KY",1140,4783,"Lexington","KY","KYLEXING.txt"]
[null,"407","\"Kentucky\"","KY","\"Corbin\"",null,8,"Corbin",null,"KNOXVILLE    TN","TN",1266,3937,"Knoxville","TN","TNKNOXVI.txt"]
[null,"408","\"Kentucky\"","KY","\"Baxter\"",null,8,"Baxter",null,"BRISTOL-JHNSN CTY-KNGSPRT    TN","TN",972,4406,"Knoxville","TN","TNKNOXVI.txt"]
[null,"409","\"Kentucky\"","KY","\"Middlesboro\"",null,13,"Middlesboro",null,"BRISTOL-JHNSN CTY-KNGSPRT    TN","TN",972,4406,"Knoxville","TN","TNKNOXVI.txt"]
[null,"410","\"Kentucky\"","KY","\"Newport\"",null,9,"Newport",null,"GREATER CINCINNATI AP KY","KY",996,5248,"Cincinnati","OH","OHCINCIN.txt"]
[null,"411","\"Kentucky\"","KY","\"Ashland\"",null,9,"Ashland",null,"LEXINGTON    KY","KY",1140,4783,"Lexington","KY","KYLEXING.txt"]
[null,"412","\"Kentucky\"","KY","\"Ashland\"",null,9,"Ashland",null,"HUNTINGTON    WV","WV",1005,4665,"Charleston","WV","WVCHARLE.txt"]
[null,"413","\"Kentucky\"","KY","\"Campton\"",null,9,"Campton",null,"JACKSON    KY","KY",1033,4393,"Lexington","KY","KYLEXING.txt"]
[null,"414","\"Kentucky\"","KY","\"Campton\"",null,9,"Campton",null,"LEXINGTON    KY","KY",1140,4783,"Lexington","KY","KYLEXING.txt"]
[null,"415","\"Kentucky\"","KY","\"Pikeville\"",null,11,"Pikeville",null,"CHARLESTON    WV","WV",1031,4646,"Charleston","WV","WVCHARLE.txt"]
[null,"416","\"Kentucky\"","KY","\"Pikeville\"",null,11,"Pikeville",null,"HUNTINGTON    WV","WV",1005,4665,"Charleston","WV","WVCHARLE.txt"]
[null,"417","\"Kentucky\"","KY","\"Hazard\"",null,{"$f":"LEN(E394)","v":8},{"$f":"MID(E394,2,G394-2)","v":"Hazard"},null,"HUNTINGTON    WV","WV",1005,4665,"Charleston","WV","WVCHARLE.txt"]
[null,"418","\"Kentucky\"","KY","\"Hazard\"",null,8,"Hazard",null,"HUNTINGTON    WV","WV",1005,4665,"Charleston","WV","WVCHARLE.txt"]
[null,"420","\"Kentucky\"","KY","\"Paducah\"",null,9,"Paducah",null,"PADUCAH   KY ","KY",1475,4279,"Paducah","KY","KYPADUCA.txt"]
[null,"421","\"Kentucky\"","KY","\"Bowling Green\"",null,15,"Bowling Green",null,"LOUISVILLE    KY","KY",1288,4514,"Louisville","KY","KYLOUISV.txt"]
[null,"422","\"Kentucky\"","KY","\"Russellville\"",null,14,"Russellville",null,"LOUISVILLE    KY","KY",1288,4514,"Louisville","KY","KYLOUISV.txt"]
[null,"423","\"Kentucky\"","KY","\"Owensboro\"",null,11,"Owensboro",null,"NASHVILLE    TN","TN",1616,3729,"Nashville","TN","TNNASHVI.txt"]
[null,"424","\"Kentucky\"","KY","\"Henderson\"",null,11,"Henderson",null,"EVANSVILLE    IN","IN",1376,4708,"Evansville","IN","INEVANSV.txt"]
[null,"425","\"Kentucky\"","KY","\"Somerset\"",null,10,"Somerset",null,"LEXINGTON    KY","KY",1140,4783,"Lexington","KY","KYLEXING.txt"]
[null,"426","\"Kentucky\"","KY","\"Somerset\"",null,10,"Somerset",null,"LEXINGTON    KY","KY",1140,4783,"Lexington","KY","KYLEXING.txt"]
[null,"427","\"Kentucky\"","KY","\"Elizabethtown\"",null,15,"Elizabethtown",null,"NASHVILLE    TN","TN",1616,3729,"Nashville","TN","TNNASHVI.txt"]
[null,"430","\"Ohio\"","OH","\"Columbus\"",null,10,"Columbus",null,"COLUMBUS    OH","OH",797,5708,"Columbus","OH","OHCOLMBS.txt"]
[null,"431","\"Ohio\"","OH","\"Columbus\"",null,10,"Columbus",null,"COLUMBUS    OH","OH",797,5708,"Columbus","OH","OHCOLMBS.txt"]
[null,"432","\"Ohio\"","OH","\"Columbus\"",null,10,"Columbus",null,"COLUMBUS    OH","OH",797,5708,"Columbus","OH","OHCOLMBS.txt"]
[null,"433","\"Ohio\"","OH","\"Marion\"",null,8,"Marion",null,"DAYTON    OH","OH",886,5708,"Dayton","OH","OHDAYTON.txt"]
[null,"434","\"Ohio\"","OH","\"Bowling Green\"",null,15,"Bowling Green",null,"TOLEDO    OH","OH",610,6579,"Toledo","OH","OHTOLEDO.txt"]
[null,"435","\"Ohio\"","OH","\"Napoleon\"",null,10,"Napoleon",null,"FORT WAYNE    IN","IN",824,6273,"Fort Wayne","IN","INFTWAYN.txt"]
[null,"436","\"Ohio\"","OH","\"Toledo\"",null,8,"Toledo",null,"TOLEDO    OH","OH",610,6579,"Toledo","OH","OHTOLEDO.txt"]
[null,"437","\"Ohio\"","OH","\"Zanesville\"",null,12,"Zanesville",null,"PITTSBURGH    PA","PA",654,5968,"Pittsburgh","PA","PAPITTSB.txt"]
[null,"438","\"Ohio\"","OH","\"Zanesville\"",null,12,"Zanesville",null,"COLUMBUS    OH","OH",797,5708,"Columbus","OH","OHCOLMBS.txt"]
[null,"439","\"Ohio\"","OH","\"Stuebenville\"",null,14,"Stuebenville",null,"PITTSBURGH    PA","PA",654,5968,"Pittsburgh","PA","PAPITTSB.txt"]
[null,"440","\"Ohio\"","OH","\"Cleveland\"",null,11,"Cleveland",null,"CLEVELAND    OH","OH",621,6201,"Cleveland","OH","OHCLEVEL.txt"]
[null,"441","\"Ohio\"","OH","\"Cleveland\"",null,11,"Cleveland",null,"CLEVELAND    OH","OH",621,6201,"Cleveland","OH","OHCLEVEL.txt"]
[null,"442","\"Ohio\"","OH","\"Akron\"",null,7,"Akron",null,"AKRON    OH","OH",625,6160,"Akron Canton","OH","OHAKRON.txt"]
[null,"443","\"Ohio\"","OH","\"Akron\"",null,7,"Akron",null,"AKRON    OH","OH",625,6160,"Akron Canton","OH","OHAKRON.txt"]
[null,"444","\"Ohio\"","OH","\"Youngstown\"",null,12,"Youngstown",null,"YOUNGSTOWN    OH","OH",497,6544,"Youngstown","OH","OHYOUNGS.txt"]
[null,"445","\"Ohio\"","OH","\"Youngstown\"",null,12,"Youngstown",null,"YOUNGSTOWN    OH","OH",497,6544,"Youngstown","OH","OHYOUNGS.txt"]
[null,"446","\"Ohio\"","OH","\"Canton\"",null,8,"Canton",null,"AKRON    OH","OH",625,6160,"Akron Canton","OH","OHAKRON.txt"]
[null,"447","\"Ohio\"","OH","\"Canton\"",null,8,"Canton",null,"AKRON    OH","OH",625,6160,"Akron Canton","OH","OHAKRON.txt"]
[null,"448","\"Ohio\"","OH","\"Mansfield\"",null,11,"Mansfield",null,"MANSFIELD    OH","OH",666,6258,"Akron Canton","OH","OHAKRON.txt"]
[null,"449","\"Ohio\"","OH","\"Mansfield\"",null,11,"Mansfield",null,"MANSFIELD    OH","OH",666,6258,"Akron Canton","OH","OHAKRON.txt"]
[null,"450","\"Ohio\"","OH","\"Cincinnati\"",null,12,"Cincinnati",null,"GREATER CINCINNATI AP KY","KY",996,5248,"Cincinnati","OH","OHCINCIN.txt"]
[null,"451","\"Ohio\"","OH","\"Cincinnati\"",null,12,"Cincinnati",null,"GREATER CINCINNATI AP KY","KY",996,5248,"Cincinnati","OH","OHCINCIN.txt"]
[null,"452","\"Ohio\"","OH","\"Cincinnati\"",null,12,"Cincinnati",null,"GREATER CINCINNATI AP KY","KY",996,5248,"Cincinnati","OH","OHCINCIN.txt"]
[null,"453","\"Ohio\"","OH","\"Dayton\"",null,8,"Dayton",null,"COLUMBUS    OH","OH",797,5708,"Dayton","OH","OHDAYTON.txt"]
[null,"454","\"Ohio\"","OH","\"Dayton\"",null,8,"Dayton",null,"DAYTON    OH","OH",886,5708,"Dayton","OH","OHDAYTON.txt"]
[null,"455","\"Ohio\"","OH","\"Springfield\"",null,13,"Springfield",null,"DAYTON    OH","OH",886,5708,"Dayton","OH","OHDAYTON.txt"]
[null,"456","\"Ohio\"","OH","\"Chillicothe\"",null,13,"Chillicothe",null,"GREATER CINCINNATI AP KY","KY",996,5248,"Cincinnati","OH","OHCINCIN.txt"]
[null,"457","\"Ohio\"","OH","\"Athens\"",null,8,"Athens",null,"COLUMBUS    OH","OH",797,5708,"Columbus","OH","OHCOLMBS.txt"]
[null,"458","\"Ohio\"","OH","\"Lima\"",null,6,"Lima",null,"DAYTON    OH","OH",886,5708,"Dayton","OH","OHDAYTON.txt"]
[null,"460","\"Indiana\"","IN","\"Indianapolis\"",null,14,"Indianapolis",null,"INDIANAPOLIS    IN","IN",1014,5615,"Indianapolis","IN","ININDIAN.txt"]
[null,"461","\"Indiana\"","IN","\"Indianapolis\"",null,14,"Indianapolis",null,"INDIANAPOLIS    IN","IN",1014,5615,"Indianapolis","IN","ININDIAN.txt"]
[null,"462","\"Indiana\"","IN","\"Indianapolis\"",null,14,"Indianapolis",null,"INDIANAPOLIS    IN","IN",1014,5615,"Indianapolis","IN","ININDIAN.txt"]
[null,"463","\"Indiana\"","IN","\"Gary\"",null,6,"Gary",null,"SOUTH BEND    IN","IN",728,6331,"South Bend","IN","INSOBEND.txt"]
[null,"464","\"Indiana\"","IN","\"Gary\"",null,6,"Gary",null,"CHICAGO    IL","IL",752,6536,"Chicago","IL","ILCHICAG.txt"]
[null,"465","\"Indiana\"","IN","\"South Bend\"",null,12,"South Bend",null,"FORT WAYNE    IN","IN",824,6273,"South Bend","IN","INSOBEND.txt"]
[null,"466","\"Indiana\"","IN","\"South Bend\"",null,12,"South Bend",null,"SOUTH BEND    IN","IN",728,6331,"South Bend","IN","INSOBEND.txt"]
[null,"467","\"Indiana\"","IN","\"Fort Wayne\"",null,12,"Fort Wayne",null,"SOUTH BEND    IN","IN",728,6331,"Fort Wayne","IN","INFTWAYN.txt"]
[null,"468","\"Indiana\"","IN","\"Fort Wayne\"",null,12,"Fort Wayne",null,"FORT WAYNE    IN","IN",824,6273,"Fort Wayne","IN","INFTWAYN.txt"]
[null,"469","\"Indiana\"","IN","\"Kokomo\"",null,8,"Kokomo",null,"SOUTH BEND    IN","IN",728,6331,"South Bend","IN","INSOBEND.txt"]
[null,"470","\"Indiana\"","IN","\"Lawrenceburg\"",null,14,"Lawrenceburg",null,"GREATER CINCINNATI AP KY","KY",996,5248,"Cincinnati","OH","OHCINCIN.txt"]
[null,"471","\"Indiana\"","IN","\"New Albany\"",null,12,"New Albany",null,"LOUISVILLE    KY","KY",1288,4514,"Louisville","KY","KYLOUISV.txt"]
[null,"472","\"Indiana\"","IN","\"Columbus\"",null,10,"Columbus",null,"INDIANAPOLIS    IN","IN",1014,5615,"Indianapolis","IN","ININDIAN.txt"]
[null,"473","\"Indiana\"","IN","\"Muncie\"",null,8,"Muncie",null,"DAYTON    OH","OH",886,5708,"Dayton","OH","OHDAYTON.txt"]
[null,"474","\"Indiana\"","IN","\"Bloomington\"",null,13,"Bloomington",null,"INDIANAPOLIS    IN","IN",1014,5615,"Indianapolis","IN","ININDIAN.txt"]
[null,"475","\"Indiana\"","IN","\"Washington\"",null,12,"Washington",null,"EVANSVILLE    IN","IN",1376,4708,"Evansville","IN","INEVANSV.txt"]
[null,"476","\"Indiana\"","IN","\"Evansville\"",null,12,"Evansville",null,"EVANSVILLE    IN","IN",1376,4708,"Evansville","IN","INEVANSV.txt"]
[null,"477","\"Indiana\"","IN","\"Evansville\"",null,12,"Evansville",null,"EVANSVILLE    IN","IN",1376,4708,"Evansville","IN","INEVANSV.txt"]
[null,"478","\"Indiana\"","IN","\"Terre Haute\"",null,13,"Terre Haute",null,"INDIANAPOLIS    IN","IN",1014,5615,"Indianapolis","IN","ININDIAN.txt"]
[null,"479","\"Indiana\"","IN","\"Lafayette\"",null,11,"Lafayette",null,"SOUTH BEND    IN","IN",728,6331,"South Bend","IN","INSOBEND.txt"]
[null,"480","\"Michigan\"","MI","\"Royal Oak\"",null,11,"Royal Oak",null,"DETROIT    MI","MI",626,6569,"Detroit","MI","MIDETROI.txt"]
[null,"481","\"Michigan\"","MI","\"Ann Arbor\"",null,11,"Ann Arbor",null,"DETROIT    MI","MI",626,6569,"Detroit","MI","MIDETROI.txt"]
[null,"482","\"Michigan\"","MI","\"Detroit\"",null,9,"Detroit",null,"DETROIT    MI","MI",626,6569,"Detroit","MI","MIDETROI.txt"]
[null,"483","\"Michigan\"","MI","\"Detroit\"",null,9,"Detroit",null,"DETROIT    MI","MI",626,6569,"Detroit","MI","MIDETROI.txt"]
[null,"484","\"Michigan\"","MI","\"Flint\"",null,7,"Flint",null,"LANSING    MI","MI",490,7101,"Flint","MI","MIFLINT.txt"]
[null,"485","\"Michigan\"","MI","\"Flint\"",null,{"$f":"LEN(E458)","v":7},{"$f":"MID(E458,2,G458-2)","v":"Flint"},null,"FLINT    MI","MI",483,6979,"Flint","MI","MIFLINT.txt"]
[null,"486","\"Michigan\"","MI","\"Saginaw\"",null,9,"Saginaw",null,"LANSING    MI","MI",490,7101,"Lansing","MI","MILANSIN.txt"]
[null,"487","\"Michigan\"","MI","\"Saginaw\"",null,9,"Saginaw",null,"FLINT    MI","MI",483,6979,"Flint","MI","MIFLINT.txt"]
[null,"488","\"Michigan\"","MI","\"Lansing\"",null,9,"Lansing",null,"FLINT    MI","MI",483,6979,"Lansing","MI","MILANSIN.txt"]
[null,"489","\"Michigan\"","MI","\"Lansing\"",null,9,"Lansing",null,"LANSING    MI","MI",490,7101,"Lansing","MI","MILANSIN.txt"]
[null,"490","\"Michigan\"","MI","\"Kalamazoo\"",null,11,"Kalamazoo",null,"SOUTH BEND    IN","IN",728,6331,"South Bend","IN","INSOBEND.txt"]
[null,"491","\"Michigan\"","MI","\"Kalamazoo\"",null,11,"Kalamazoo",null,"SOUTH BEND    IN","IN",728,6331,"South Bend","IN","INSOBEND.txt"]
[null,"492","\"Michigan\"","MI","\"Jackson\"",null,9,"Jackson",null,"TOLEDO    OH","OH",610,6579,"Toledo","OH","OHTOLEDO.txt"]
[null,"493","\"Michigan\"","MI","\"Grand Rapids\"",null,14,"Grand Rapids",null,"MUSKEGON    MI","MI",431,6924,"Grand Rapids","MI","MIGRNDRA.txt"]
[null,"494","\"Michigan\"","MI","\"Muskegon\"",null,10,"Muskegon",null,"MUSKEGON    MI","MI",431,6924,"Grand Rapids","MI","MIGRNDRA.txt"]
[null,"495","\"Michigan\"","MI","\"Grand Rapids\"",null,14,"Grand Rapids",null,"GRAND RAPIDS    MI","MI",534,6973,"Grand Rapids","MI","MIGRNDRA.txt"]
[null,"496","\"Michigan\"","MI","\"Traverse City\"",null,15,"Traverse City",null,"ALPENA    MI","MI",231,8284,"Sault Ste Marie","MI","MISTEMAR.txt"]
[null,"497","\"Michigan\"","MI","\"Mackinaw City\"",null,15,"Mackinaw City",null,"SAULT STE. MARIE    MI","MI",131,9316,"Sault Ste Marie","MI","MISTEMAR.txt"]
[null,"498","\"Michigan\"","MI","\"Iron Mountain\"",null,15,"Iron Mountain",null,"MARQUETTE    MI","MI",155,9567,"Sault Ste Marie","MI","MISTEMAR.txt"]
[null,"499","\"Michigan\"","MI","\"Houghton\"",null,10,"Houghton",null,"HOUGHTON LAKE    MI","MI",256,8218,"Sault Ste Marie","MI","MISTEMAR.txt"]
[null,"500","\"Iowa\"","IA","\"Des Moines\"",null,12,"Des Moines",null,"DES MOINES    IA","IA",1036,6497,"Des Moines","IA","IADESMOI.txt"]
[null,"501","\"Iowa\"","IA","\"Des Moines\"",null,12,"Des Moines",null,"DES MOINES    IA","IA",1036,6497,"Des Moines","IA","IADESMOI.txt"]
[null,"502","\"Iowa\"","IA","\"Des Moines\"",null,12,"Des Moines",null,"DES MOINES    IA","IA",1036,6497,"Des Moines","IA","IADESMOI.txt"]
[null,"503","\"Iowa\"","IA","\"Des Moines\"",null,12,"Des Moines",null,"DES MOINES    IA","IA",1036,6497,"Des Moines","IA","IADESMOI.txt"]
[null,"504","\"Iowa\"","IA","\"Mason City\"",null,12,"Mason City",null,"WATERLOO    IA","IA",702,7406,"Des Moines","IA","IADESMOI.txt"]
[null,"505","\"Iowa\"","IA","\"Fort Dodge\"",null,12,"Fort Dodge",null,"SIOUX CITY    IA","IA",907,6893,"Sioux City","IA","IASIOCTY.txt"]
[null,"506","\"Iowa\"","IA","\"Waterloo\"",null,10,"Waterloo",null,"WATERLOO    IA","IA",702,7406,"Des Moines","IA","IADESMOI.txt"]
[null,"507","\"Iowa\"","IA","\"Waterloo\"",null,10,"Waterloo",null,"WATERLOO    IA","IA",702,7406,"Des Moines","IA","IADESMOI.txt"]
[null,"508","\"Iowa\"","IA","\"Creston\"",null,9,"Creston",null,"DES MOINES    IA","IA",1036,6497,"Des Moines","IA","IADESMOI.txt"]
[null,"510","\"Iowa\"","IA","\"Sioux City\"",null,12,"Sioux City",null,"SIOUX CITY    IA","IA",907,6893,"Sioux City","IA","IASIOCTY.txt"]
[null,"511","\"Iowa\"","IA","\"Sioux City\"",null,12,"Sioux City",null,"SIOUX CITY    IA","IA",907,6893,"Sioux City","IA","IASIOCTY.txt"]
[null,"512","\"Iowa\"","IA","\"Sheldon\"",null,9,"Sheldon",null,"SIOUX FALLS    SD","SD",744,7809,"Sioux Falls","SD","SDSIOFAL.txt"]
[null,"513","\"Iowa\"","IA","\"Spencer\"",null,9,"Spencer",null,"SIOUX FALLS    SD","SD",744,7809,"Sioux Falls","SD","SDSIOFAL.txt"]
[null,"514","\"Iowa\"","IA","\"Carroll\"",null,9,"Carroll",null,"SIOUX CITY    IA","IA",907,6893,"Sioux City","IA","IASIOCTY.txt"]
[null,"515","\"Iowa\"","IA","\"Council Bluffs\"",null,16,"Council Bluffs",null,"OMAHA (NORTH)    NE","NE",1037,6413,"Omaha","NE","NEOMAHA.txt"]
[null,"516","\"Iowa\"","IA","\"Shenandoah\"",null,12,"Shenandoah",null,"OMAHA (NORTH)    NE","NE",1037,6413,"Omaha","NE","NEOMAHA.txt"]
[null,"520","\"Iowa\"","IA","\"Dubuque\"",null,9,"Dubuque",null,"DUBUQUE    IA","IA",593,7327,"Des Moines","IA","IADESMOI.txt"]
[null,"521","\"Iowa\"","IA","\"Decorah\"",null,9,"Decorah",null,"LA CROSSE    WI","WI",692,7491,"Des Moines","IA","IADESMOI.txt"]
[null,"522","\"Iowa\"","IA","\"Cedar Rapids\"",null,14,"Cedar Rapids",null,"DES MOINES    IA","IA",1036,6497,"Des Moines","IA","IADESMOI.txt"]
[null,"523","\"Iowa\"","IA","\"Cedar Rapids\"",null,14,"Cedar Rapids",null,"DES MOINES    IA","IA",1036,6497,"Des Moines","IA","IADESMOI.txt"]
[null,"524","\"Iowa\"","IA","\"Cedar Rapids\"",null,14,"Cedar Rapids",null,"WATERLOO    IA","IA",702,7406,"Des Moines","IA","IADESMOI.txt"]
[null,"525","\"Iowa\"","IA","\"Ottumwa\"",null,9,"Ottumwa",null,"MOLINE    IL","IL",911,6474,"Des Moines","IA","IADESMOI.txt"]
[null,"526","\"Iowa\"","IA","\"Burlington\"",null,12,"Burlington",null,"MOLINE    IL","IL",911,6474,"Des Moines","IA","IADESMOI.txt"]
[null,"527","\"Iowa\"","IA","\"Davenport\"",null,11,"Davenport",null,"MOLINE    IL","IL",911,6474,"Des Moines","IA","IADESMOI.txt"]
[null,"528","\"Iowa\"","IA","\"Davenport\"",null,11,"Davenport",null,"MOLINE    IL","IL",911,6474,"Des Moines","IA","IADESMOI.txt"]
[null,"530","\"Wisconsin\"","WI","\"Milwaukee\"",null,11,"Milwaukee",null,"MADISON    WI","WI",485,7673,"Milwaukee","WI","WIMILWAU.txt"]
[null,"531","\"Wisconsin\"","WI","\"Milwaukee\"",null,11,"Milwaukee",null,"MADISON    WI","WI",485,7673,"Milwaukee","WI","WIMILWAU.txt"]
[null,"532","\"Wisconsin\"","WI","\"Milwaukee\"",null,11,"Milwaukee",null,"MILWAUKEE    WI","WI",479,7324,"Milwaukee","WI","WIMILWAU.txt"]
[null,"533","\"Wisconsin\"","WI","\"Milwaukee\"",null,11,"Milwaukee",null,"MILWAUKEE    WI","WI",479,7324,"Milwaukee","WI","WIMILWAU.txt"]
[null,"534","\"Wisconsin\"","WI","\"Racine\"",null,8,"Racine",null,"MILWAUKEE    WI","WI",479,7324,"Milwaukee","WI","WIMILWAU.txt"]
[null,"535","\"Wisconsin\"","WI","\"Madison\"",null,9,"Madison",null,"LA CROSSE    WI","WI",692,7491,"Madison","WI","WIMADISO.txt"]
[null,"536","\"Wisconsin\"","WI","\"Madison\"",null,9,"Madison",null,"LA CROSSE    WI","WI",692,7491,"Madison","WI","WIMADISO.txt"]
[null,"537","\"Wisconsin\"","WI","\"Madison\"",null,9,"Madison",null,"MADISON    WI","WI",485,7673,"Madison","WI","WIMADISO.txt"]
[null,"538","\"Wisconsin\"","WI","\"Platteville\"",null,13,"Platteville",null,"WATERLOO    IA","IA",702,7406,"Madison","WI","WIMADISO.txt"]
[null,"539","\"Wisconsin\"","WI","\"Portage\"",null,9,"Portage",null,"MADISON    WI","WI",485,7673,"Madison","WI","WIMADISO.txt"]
[null,"540","\"Wisconsin\"","WI","\"River Falls\"",null,13,"River Falls",null,"MINNEAPOLIS-ST.PAUL    MN","MN",682,7981,"Minneapolis St. Paul","MN","MNMINPLS.txt"]
[null,"541","\"Wisconsin\"","WI","\"Green Bay\"",null,11,"Green Bay",null,"GREEN BAY    WI","WI",381,8089,"Green Bay","WI","WIGREBAY.txt"]
[null,"542","\"Wisconsin\"","WI","\"Green Bay\"",null,11,"Green Bay",null,"GREEN BAY    WI","WI",381,8089,"Green Bay","WI","WIGREBAY.txt"]
[null,"543","\"Wisconsin\"","WI","\"Green Bay\"",null,11,"Green Bay",null,"GREEN BAY    WI","WI",381,8089,"Green Bay","WI","WIGREBAY.txt"]
[null,"544","\"Wisconsin\"","WI","\"Wausau\"",null,8,"Wausau",null,"GREEN BAY    WI","WI",381,8089,"Green Bay","WI","WIGREBAY.txt"]
[null,"545","\"Wisconsin\"","WI","\"Rhinelander\"",null,13,"Rhinelander",null,"HOUGHTON LAKE    MI","MI",256,8218,"Green Bay","WI","WIGREBAY.txt"]
[null,"546","\"Wisconsin\"","WI","\"La Crosse\"",null,11,"La Crosse",null,"MADISON    WI","WI",485,7673,"Madison","WI","WIMADISO.txt"]
[null,"547","\"Wisconsin\"","WI","\"Eau Claire\"",null,12,"Eau Claire",null,"MINNEAPOLIS-ST.PAUL    MN","MN",682,7981,"Minneapolis St. Paul","MN","MNMINPLS.txt"]
[null,"548","\"Wisconsin\"","WI","\"Spooner\"",null,9,"Spooner",null,"SAINT CLOUD    MN","MN",415,8928,"Madison","WI","WIMADISO.txt"]
[null,"549","\"Wisconsin\"","WI","\"Oshkosh\"",null,9,"Oshkosh",null,"LA CROSSE    WI","WI",692,7491,"Madison","WI","WIMADISO.txt"]
[null,"550","\"Minnesota\"","MN","\"Saint Paul\"",null,12,"Saint Paul",null,"MINNEAPOLIS-ST.PAUL    MN","MN",682,7981,"Minneapolis St. Paul","MN","MNMINPLS.txt"]
[null,"551","\"Minnesota\"","MN","\"Saint Paul\"",null,12,"Saint Paul",null,"MINNEAPOLIS-ST.PAUL    MN","MN",682,7981,"Minneapolis St. Paul","MN","MNMINPLS.txt"]
[null,"553","\"Minnesota\"","MN","\"Minneapolis\"",null,13,"Minneapolis",null,"MINNEAPOLIS-ST.PAUL    MN","MN",682,7981,"Minneapolis St. Paul","MN","MNMINPLS.txt"]
[null,"554","\"Minnesota\"","MN","\"Minneapolis\"",null,13,"Minneapolis",null,"MINNEAPOLIS-ST.PAUL    MN","MN",682,7981,"Minneapolis St. Paul","MN","MNMINPLS.txt"]
[null,"556","\"Minnesota\"","MN","\"Duluth\"",null,{"$f":"LEN(E522)","v":8},{"$f":"MID(E522,2,G522-2)","v":"Duluth"},null,"DULUTH    MN","MN",180,9818,"Duluth","MN","MNDULUTH.txt"]
[null,"557","\"Minnesota\"","MN","\"Duluth\"",null,8,"Duluth",null,"DULUTH    MN","MN",180,9818,"Duluth","MN","MNDULUTH.txt"]
[null,"558","\"Minnesota\"","MN","\"Duluth\"",null,8,"Duluth",null,"DULUTH    MN","MN",180,9818,"Duluth","MN","MNDULUTH.txt"]
[null,"559","\"Minnesota\"","MN","\"Rochester\"",null,11,"Rochester",null,"ROCHESTER    MN","MN",472,8250,"Minneapolis St. Paul","MN","MNMINPLS.txt"]
[null,"560","\"Minnesota\"","MN","\"Mankato\"",null,9,"Mankato",null,"ROCHESTER    MN","MN",472,8250,"Minneapolis St. Paul","MN","MNMINPLS.txt"]
[null,"561","\"Minnesota\"","MN","\"Windom\"",null,8,"Windom",null,"SIOUX FALLS    SD","SD",744,7809,"Sioux Falls","SD","SDSIOFAL.txt"]
[null,"562","\"Minnesota\"","MN","\"Willmar\"",null,9,"Willmar",null,"HURON    SD","SD",743,7923,"Minneapolis St. Paul","MN","MNMINPLS.txt"]
[null,"563","\"Minnesota\"","MN","\"Saint Cloud\"",null,13,"Saint Cloud",null,"SAINT CLOUD    MN","MN",415,8928,"Minneapolis St. Paul","MN","MNMINPLS.txt"]
[null,"564","\"Minnesota\"","MN","\"Brainerd\"",null,10,"Brainerd",null,"SAINT CLOUD    MN","MN",415,8928,"Minneapolis St. Paul","MN","MNMINPLS.txt"]
[null,"565","\"Minnesota\"","MN","\"Detroit Lakes\"",null,15,"Detroit Lakes",null,"FARGO    ND","ND",537,9254,"Fargo","ND","NDFARGO.txt"]
[null,"566","\"Minnesota\"","MN","\"Bemidji\"",null,9,"Bemidji",null,"INTERNATIONAL FALLS    MN","MN",249,10487,"Duluth","MN","MNDULUTH.txt"]
[null,"567","\"Minnesota\"","MN","\"Thief River Falls\"",null,19,"Thief River Falls",null,"FARGO    ND","ND",537,9254,"Fargo","ND","NDFARGO.txt"]
[null,"570","\"South_Dakota\"","SD","\"Sioux Falls\"",null,13,"Sioux Falls",null,"SIOUX FALLS    SD","SD",744,7809,"Sioux Falls","SD","SDSIOFAL.txt"]
[null,"571","\"South_Dakota\"","SD","\"Sioux Falls\"",null,13,"Sioux Falls",null,"SIOUX FALLS    SD","SD",744,7809,"Sioux Falls","SD","SDSIOFAL.txt"]
[null,"572","\"South_Dakota\"","SD","\"Watertown\"",null,11,"Watertown",null,"FARGO    ND","ND",537,9254,"Fargo","ND","NDFARGO.txt"]
[null,"573","\"South_Dakota\"","SD","\"Mitchell\"",null,10,"Mitchell",null,"RAPID CITY    SD","SD",611,7301,"Rapid City","SD","SDRAPCTY.txt"]
[null,"574","\"South_Dakota\"","SD","\"Aberdeen\"",null,10,"Aberdeen",null,"ABERDEEN    SD","SD",633,8446,"Fargo","ND","NDFARGO.txt"]
[null,"575","\"South_Dakota\"","SD","\"Pierre\"",null,8,"Pierre",null,"RAPID CITY    SD","SD",611,7301,"Rapid City","SD","SDRAPCTY.txt"]
[null,"576","\"South_Dakota\"","SD","\"Mobridge\"",null,10,"Mobridge",null,"BISMARCK    ND","ND",488,8968,"Bismarck","ND","NDBISMAR.txt"]
[null,"577","\"South_Dakota\"","SD","\"Rapid City\"",null,12,"Rapid City",null,"RAPID CITY    SD","SD",611,7301,"Rapid City","SD","SDRAPCTY.txt"]
[null,"580","\"North_Dakota\"","ND","\"Fargo\"",null,7,"Fargo",null,"FARGO    ND","ND",537,9254,"Fargo","ND","NDFARGO.txt"]
[null,"581","\"North_Dakota\"","ND","\"Fargo\"",null,7,"Fargo",null,"FARGO    ND","ND",537,9254,"Fargo","ND","NDFARGO.txt"]
[null,"582","\"North_Dakota\"","ND","\"Grand Forks\"",null,13,"Grand Forks",null,"FARGO    ND","ND",537,9254,"Fargo","ND","NDFARGO.txt"]
[null,"583","\"North_Dakota\"","ND","\"Devils Lake\"",null,13,"Devils Lake",null,"FARGO    ND","ND",537,9254,"Fargo","ND","NDFARGO.txt"]
[null,"584","\"North_Dakota\"","ND","\"Jamestown\"",null,11,"Jamestown",null,"BISMARCK    ND","ND",488,8968,"Bismarck","ND","NDBISMAR.txt"]
[null,"585","\"North_Dakota\"","ND","\"Bismarck\"",null,10,"Bismarck",null,"BISMARCK    ND","ND",488,8968,"Bismarck","ND","NDBISMAR.txt"]
[null,"586","\"North_Dakota\"","ND","\"Dickinson\"",null,11,"Dickinson",null,"BISMARCK    ND","ND",488,8968,"Bismarck","ND","NDBISMAR.txt"]
[null,"587","\"North_Dakota\"","ND","\"Minot\"",null,7,"Minot",null,"WILLISTON    ND","ND",548,9090,"Bismarck","ND","NDBISMAR.txt"]
[null,"588","\"North_Dakota\"","ND","\"Williston\"",null,11,"Williston",null,"WILLISTON    ND","ND",548,9090,"Bismarck","ND","NDBISMAR.txt"]
[null,"590","\"Montana\"","MT","\"Billings\"",null,10,"Billings",null,"BILLINGS    MT","MT",652,7164,"Billings","MT","MTBILLIN.txt"]
[null,"591","\"Montana\"","MT","\"Billings\"",null,10,"Billings",null,"BILLINGS    MT","MT",652,7164,"Billings","MT","MTBILLIN.txt"]
[null,"592","\"Montana\"","MT","\"Wolf Point\"",null,12,"Wolf Point",null,"GLASGOW    MT","MT",558,8745,"Great Falls","MT","MTGRFALL.txt"]
[null,"593","\"Montana\"","MT","\"Miles City\"",null,12,"Miles City",null,"GLASGOW    MT","MT",558,8745,"Great Falls","MT","MTGRFALL.txt"]
[null,"594","\"Montana\"","MT","\"Great Falls\"",null,13,"Great Falls",null,"GREAT FALLS    MT","MT",388,7741,"Great Falls","MT","MTGRFALL.txt"]
[null,"595","\"Montana\"","MT","\"Havre\"",null,7,"Havre",null,"GREAT FALLS    MT","MT",388,7741,"Great Falls","MT","MTGRFALL.txt"]
[null,"596","\"Montana\"","MT","\"Helena\"",null,8,"Helena",null,"HELENA    MT","MT",386,8031,"Helena","MT","MTHELENA.txt"]
[null,"597","\"Montana\"","MT","\"Butte\"",null,7,"Butte",null,"MISSOULA    MT","MT",280,7792,"Helena","MT","MTHELENA.txt"]
[null,"598","\"Montana\"","MT","\"Missoula\"",null,10,"Missoula",null,"MISSOULA    MT","MT",280,7792,"Helena","MT","MTHELENA.txt"]
[null,"599","\"Montana\"","MT","\"Kalispell\"",null,11,"Kalispell",null,"KALISPELL    MT","MT",149,8378,"Great Falls","MT","MTGRFALL.txt"]
[null,"600","\"Illinois\"","IL","\"North Chicago Sub.\"",null,20,"North Chicago Sub.",null,"ROCKFORD    IL","IL",702,6969,"Rockford","IL","ILROCKFO.txt"]
[null,"601","\"Illinois\"","IL","\"North Chicago Sub.\"",null,20,"North Chicago Sub.",null,"ROCKFORD    IL","IL",702,6969,"Rockford","IL","ILROCKFO.txt"]
[null,"602","\"Illinois\"","IL","\"Evanston\"",null,10,"Evanston",null,"CHICAGO    IL","IL",752,6536,"Chicago","IL","ILCHICAG.txt"]
[null,"603","\"Illinois\"","IL","\"Oak Park\"",null,10,"Oak Park",null,"CHICAGO    IL","IL",752,6536,"Chicago","IL","ILCHICAG.txt"]
[null,"604","\"Illinois\"","IL","\"South Chicago Sub.\"",null,20,"South Chicago Sub.",null,"CHICAGO    IL","IL",752,6536,"Chicago","IL","ILCHICAG.txt"]
[null,"605","\"Illinois\"","IL","\"South Chicago Sub.\"",null,20,"South Chicago Sub.",null,"CHICAGO    IL","IL",752,6536,"Chicago","IL","ILCHICAG.txt"]
[null,"606","\"Illinois\"","IL","\"Chicago\"",null,9,"Chicago",null,"CHICAGO    IL","IL",752,6536,"Chicago","IL","ILCHICAG.txt"]
[null,"607","\"Illinois\"","IL","\"Chicago\"",null,9,"Chicago",null,"CHICAGO    IL","IL",752,6536,"Chicago","IL","ILCHICAG.txt"]
[null,"609","\"Illinois\"","IL","\"Kankakee\"",null,10,"Kankakee",null,"PEORIA    IL","IL",982,6148,"Peoria","IL","ILPEORIA.txt"]
[null,"610","\"Illinois\"","IL","\"Rockford\"",null,10,"Rockford",null,"ROCKFORD    IL","IL",702,6969,"Rockford","IL","ILROCKFO.txt"]
[null,"611","\"Illinois\"","IL","\"Rockford\"",null,10,"Rockford",null,"ROCKFORD    IL","IL",702,6969,"Rockford","IL","ILROCKFO.txt"]
[null,"612","\"Illinois\"","IL","\"Rock Island\"",null,13,"Rock Island",null,"MOLINE    IL","IL",911,6474,"Peoria","IL","ILPEORIA.txt"]
[null,"613","\"Illinois\"","IL","\"La Salle\"",null,10,"La Salle",null,"MOLINE    IL","IL",911,6474,"Peoria","IL","ILPEORIA.txt"]
[null,"614","\"Illinois\"","IL","\"Galesburg\"",null,11,"Galesburg",null,"MOLINE    IL","IL",911,6474,"Peoria","IL","ILPEORIA.txt"]
[null,"615","\"Illinois\"","IL","\"Peoria\"",null,8,"Peoria",null,"PEORIA    IL","IL",982,6148,"Peoria","IL","ILPEORIA.txt"]
[null,"616","\"Illinois\"","IL","\"Peoria\"",null,8,"Peoria",null,"PEORIA    IL","IL",982,6148,"Peoria","IL","ILPEORIA.txt"]
[null,"617","\"Illinois\"","IL","\"Bloomington\"",null,13,"Bloomington",null,"SPRINGFIELD    IL","IL",1141,5688,"Springfield","IL","ILSPRING.txt"]
[null,"618","\"Illinois\"","IL","\"Champaign/Urbana\"",null,18,"Champaign/Urbana",null,"SPRINGFIELD    IL","IL",1141,5688,"Springfield","IL","ILSPRING.txt"]
[null,"619","\"Illinois\"","IL","\"Champaign/Urbana\"",null,18,"Champaign/Urbana",null,"SPRINGFIELD    IL","IL",1141,5688,"Springfield","IL","ILSPRING.txt"]
[null,"620","\"Illinois\"","IL","\"East Saint Louis\"",null,18,"East Saint Louis",null,"ST. LOUIS    MO","MO",1534,4758,"St Louis","MO","MOSTLOUI.txt"]
[null,"622","\"Illinois\"","IL","\"East Saint Louis\"",null,18,"East Saint Louis",null,"ST. LOUIS    MO","MO",1534,4758,"St Louis","MO","MOSTLOUI.txt"]
[null,"623","\"Illinois\"","IL","\"Quincy\"",null,8,"Quincy",null,"SPRINGFIELD    IL","IL",1141,5688,"Springfield","IL","ILSPRING.txt"]
[null,"624","\"Illinois\"","IL","\"Effingham\"",null,11,"Effingham",null,"ST. LOUIS    MO","MO",1534,4758,"St Louis","MO","MOSTLOUI.txt"]
[null,"625","\"Illinois\"","IL","\"Springfield\"",null,13,"Springfield",null,"SPRINGFIELD    IL","IL",1141,5688,"Springfield","IL","ILSPRING.txt"]
[null,"626","\"Illinois\"","IL","\"Springfield\"",null,13,"Springfield",null,"SPRINGFIELD    IL","IL",1141,5688,"Springfield","IL","ILSPRING.txt"]
[null,"627","\"Illinois\"","IL","\"Springfield\"",null,{"$f":"LEN(E586)","v":13},{"$f":"MID(E586,2,G586-2)","v":"Springfield"},null,"SPRINGFIELD    IL","IL",1141,5688,"Springfield","IL","ILSPRING.txt"]
[null,"628","\"Illinois\"","IL","\"Centralia\"",null,11,"Centralia",null,"EVANSVILLE    IN","IN",1376,4708,"Evansville","IN","INEVANSV.txt"]
[null,"629","\"Illinois\"","IL","\"Carbondale\"",null,12,"Carbondale",null,"EVANSVILLE    IN","IN",1376,4708,"Evansville","IN","INEVANSV.txt"]
[null,"630","\"Missouri\"","MO","\"Saint Louis\"",null,13,"Saint Louis",null,"ST. LOUIS    MO","MO",1534,4758,"St Louis","MO","MOSTLOUI.txt"]
[null,"631","\"Missouri\"","MO","\"Saint Louis\"",null,13,"Saint Louis",null,"ST. LOUIS    MO","MO",1534,4758,"St Louis","MO","MOSTLOUI.txt"]
[null,"632","\"Missouri\"","MO","\"Saint Louis\"",null,13,"Saint Louis",null,"ST. LOUIS    MO","MO",1534,4758,"St Louis","MO","MOSTLOUI.txt"]
[null,"633","\"Missouri\"","MO","\"Saint Charles\"",null,15,"Saint Charles",null,"ST. LOUIS    MO","MO",1534,4758,"St Louis","MO","MOSTLOUI.txt"]
[null,"634","\"Missouri\"","MO","\"Hannibal\"",null,10,"Hannibal",null,"COLUMBIA    MO","MO",1189,5212,"St Louis","MO","MOSTLOUI.txt"]
[null,"635","\"Missouri\"","MO","\"Kirksville\"",null,12,"Kirksville",null,"MOLINE    IL","IL",911,6474,"Peoria","IL","ILPEORIA.txt"]
[null,"636","\"Missouri\"","MO","\"Flat River\"",null,12,"Flat River",null,"ST. LOUIS    MO","MO",1534,4758,"St Louis","MO","MOSTLOUI.txt"]
[null,"637","\"Missouri\"","MO","\"Cape Girardeau\"",null,16,"Cape Girardeau",null,"ST. LOUIS    MO","MO",1534,4758,"St Louis","MO","MOSTLOUI.txt"]
[null,"638","\"Missouri\"","MO","\"Sikeston\"",null,10,"Sikeston",null,"EVANSVILLE    IN","IN",1376,4708,"Evansville","IN","INEVANSV.txt"]
[null,"639","\"Missouri\"","MO","\"Poplar Bluff\"",null,14,"Poplar Bluff",null,"SPRINGFIELD    MO","MO",1320,4638,"Springfield","MO","MOSPRING.txt"]
[null,"640","\"Missouri\"","MO","\"Kansas City\"",null,13,"Kansas City",null,"KANSAS CITY    MO","MO",1288,5393,"Kansas City","MO","MOKANCTY.txt"]
[null,"641","\"Missouri\"","MO","\"Kansas City\"",null,13,"Kansas City",null,"KANSAS CITY    MO","MO",1288,5393,"Kansas City","MO","MOKANCTY.txt"]
[null,"644","\"Missouri\"","MO","\"Saint Joseph\"",null,14,"Saint Joseph",null,"TOPEKA    KS","KS",1304,5265,"Topeka","KS","KSTOPEKA.txt"]
[null,"645","\"Missouri\"","MO","\"Saint Joseph\"",null,14,"Saint Joseph",null,"KANSAS CITY    MO","MO",1288,5393,"Kansas City","MO","MOKANCTY.txt"]
[null,"646","\"Missouri\"","MO","\"Chillicothe\"",null,13,"Chillicothe",null,"KANSAS CITY    MO","MO",1288,5393,"Kansas City","MO","MOKANCTY.txt"]
[null,"647","\"Missouri\"","MO","\"Harrisonville\"",null,15,"Harrisonville",null,"SPRINGFIELD    MO","MO",1320,4638,"Springfield","MO","MOSPRING.txt"]
[null,"648","\"Missouri\"","MO","\"Joplin\"",null,8,"Joplin",null,"SPRINGFIELD    MO","MO",1320,4638,"Springfield","MO","MOSPRING.txt"]
[null,"650","\"Missouri\"","MO","\"Jefferson_City\"",null,16,"Jefferson_City",null,"ST. LOUIS    MO","MO",1534,4758,"St Louis","MO","MOSTLOUI.txt"]
[null,"651","\"Missouri\"","MO","\"Jefferson_City\"",null,16,"Jefferson_City",null,"COLUMBIA    MO","MO",1189,5212,"St Louis","MO","MOSTLOUI.txt"]
[null,"652","\"Missouri\"","MO","\"Columbia\"",null,10,"Columbia",null,"COLUMBIA    MO","MO",1189,5212,"St Louis","MO","MOSTLOUI.txt"]
[null,"653","\"Missouri\"","MO","\"Sedalia\"",null,9,"Sedalia",null,"COLUMBIA    MO","MO",1189,5212,"St Louis","MO","MOSTLOUI.txt"]
[null,"654","\"Missouri\"","MO","\"Rolla\"",null,7,"Rolla",null,"SPRINGFIELD    MO","MO",1320,4638,"Springfield","MO","MOSPRING.txt"]
[null,"655","\"Missouri\"","MO","\"Rolla\"",null,7,"Rolla",null,"SPRINGFIELD    MO","MO",1320,4638,"Springfield","MO","MOSPRING.txt"]
[null,"656","\"Missouri\"","MO","\"Springfield\"",null,13,"Springfield",null,"SPRINGFIELD    MO","MO",1320,4638,"Springfield","MO","MOSPRING.txt"]
[null,"657","\"Missouri\"","MO","\"Springfield\"",null,13,"Springfield",null,"SPRINGFIELD    MO","MO",1320,4638,"Springfield","MO","MOSPRING.txt"]
[null,"658","\"Missouri\"","MO","\"Springfield\"",null,13,"Springfield",null,"SPRINGFIELD    MO","MO",1320,4638,"Springfield","MO","MOSPRING.txt"]
[null,"660","\"Kansas\"","KS","\"Kansas City\"",null,13,"Kansas City",null,"TOPEKA    KS","KS",1304,5265,"Kansas City","MO","MOKANCTY.txt"]
[null,"661","\"Kansas\"","KS","\"Kansas City\"",null,13,"Kansas City",null,"KANSAS CITY    MO","MO",1288,5393,"Kansas City","MO","MOKANCTY.txt"]
[null,"662","\"Kansas\"","KS","\"Shawnee/Mission\"",null,17,"Shawnee/Mission",null,"KANSAS CITY    MO","MO",1288,5393,"Kansas City","MO","MOKANCTY.txt"]
[null,"664","\"Kansas\"","KS","\"Topeka\"",null,8,"Topeka",null,"TOPEKA    KS","KS",1304,5265,"Topeka","KS","KSTOPEKA.txt"]
[null,"665","\"Kansas\"","KS","\"Topeka\"",null,8,"Topeka",null,"TOPEKA    KS","KS",1304,5265,"Topeka","KS","KSTOPEKA.txt"]
[null,"666","\"Kansas\"","KS","\"Topeka\"",null,8,"Topeka",null,"TOPEKA    KS","KS",1304,5265,"Topeka","KS","KSTOPEKA.txt"]
[null,"667","\"Kansas\"","KS","\"Fort Scott\"",null,12,"Fort Scott",null,"SPRINGFIELD    MO","MO",1320,4638,"Springfield","MO","MOSPRING.txt"]
[null,"668","\"Kansas\"","KS","\"Emporia\"",null,9,"Emporia",null,"WICHITA    KS","KS",1628,4791,"Wichita","KS","KSWICHIT.txt"]
[null,"669","\"Kansas\"","KS","\"Concordia\"",null,11,"Concordia",null,"CONCORDIA    KS","KS",1317,5574,"Topeka","KS","KSTOPEKA.txt"]
[null,"670","\"Kansas\"","KS","\"Wichita\"",null,9,"Wichita",null,"WICHITA    KS","KS",1628,4791,"Wichita","KS","KSWICHIT.txt"]
[null,"671","\"Kansas\"","KS","\"Wichita\"",null,9,"Wichita",null,"WICHITA    KS","KS",1628,4791,"Wichita","KS","KSWICHIT.txt"]
[null,"672","\"Kansas\"","KS","\"Wichita\"",null,9,"Wichita",null,"WICHITA    KS","KS",1628,4791,"Wichita","KS","KSWICHIT.txt"]
[null,"673","\"Kansas\"","KS","\"Independence\"",null,14,"Independence",null,"SPRINGFIELD    MO","MO",1320,4638,"Springfield","MO","MOSPRING.txt"]
[null,"674","\"Kansas\"","KS","\"Salina\"",null,8,"Salina",null,"TOPEKA    KS","KS",1304,5265,"Topeka","KS","KSTOPEKA.txt"]
[null,"675","\"Kansas\"","KS","\"Hutchinson\"",null,12,"Hutchinson",null,"WICHITA    KS","KS",1628,4791,"Wichita","KS","KSWICHIT.txt"]
[null,"676","\"Kansas\"","KS","\"Hays\"",null,6,"Hays",null,"DODGE CITY    KS","KS",1465,5001,"Wichita","KS","KSWICHIT.txt"]
[null,"677","\"Kansas\"","KS","\"Colby\"",null,7,"Colby",null,"GOODLAND    KS","KS",859,5974,"Goodland","KS","KSGOODLA.txt"]
[null,"678","\"Kansas\"","KS","\"Dodge City\"",null,12,"Dodge City",null,"DODGE CITY    KS","KS",1465,5001,"Wichita","KS","KSWICHIT.txt"]
[null,"679","\"Kansas\"","KS","\"Liberal\"",null,9,"Liberal",null,"DODGE CITY    KS","KS",1465,5001,"Wichita","KS","KSWICHIT.txt"]
[null,"680","\"Nebraska\"","NE","\"Omaha\"",null,7,"Omaha",null,"OMAHA EPPLEY AP    NE","NE",1072,6300,"Omaha","NE","NEOMAHA.txt"]
[null,"681","\"Nebraska\"","NE","\"Omaha\"",null,7,"Omaha",null,"OMAHA EPPLEY AP    NE","NE",1072,6300,"Omaha","NE","NEOMAHA.txt"]
[null,"683","\"Nebraska\"","NE","\"Lincoln\"",null,9,"Lincoln",null,"LINCOLN    NE","NE",1134,6278,"Lincoln","NE","NELINCOL.txt"]
[null,"684","\"Nebraska\"","NE","\"Lincoln\"",null,9,"Lincoln",null,"LINCOLN    NE","NE",1134,6278,"Lincoln","NE","NELINCOL.txt"]
[null,"685","\"Nebraska\"","NE","\"Lincoln\"",null,9,"Lincoln",null,"LINCOLN    NE","NE",1134,6278,"Lincoln","NE","NELINCOL.txt"]
[null,"686","\"Nebraska\"","NE","\"Columbus\"",null,10,"Columbus",null,"GRAND ISLAND    NE","NE",997,6421,"Lincoln","NE","NELINCOL.txt"]
[null,"687","\"Nebraska\"","NE","\"Norfolk\"",null,9,"Norfolk",null,"NORFOLK    NE","NE",877,6873,"Sioux City","IA","IASIOCTY.txt"]
[null,"688","\"Nebraska\"","NE","\"Grand Island\"",null,14,"Grand Island",null,"GRAND ISLAND    NE","NE",997,6421,"Lincoln","NE","NELINCOL.txt"]
[null,"689","\"Nebraska\"","NE","\"Hastings\"",null,10,"Hastings",null,"GRAND ISLAND    NE","NE",997,6421,"Lincoln","NE","NELINCOL.txt"]
[null,"690","\"Nebraska\"","NE","\"McCook\"",null,8,"McCook",null,"GOODLAND    KS","KS",859,5974,"Goodland","KS","KSGOODLA.txt"]
[null,"691","\"Nebraska\"","NE","\"North_Platte\"",null,14,"North_Platte",null,"NORTH PLATTE    NE","NE",713,6859,"North Platte","NE","NENPLATT.txt"]
[null,"692","\"Nebraska\"","NE","\"Valentine\"",null,11,"Valentine",null,"VALENTINE    NE","NE",752,7282,"North Platte","NE","NENPLATT.txt"]
[null,"693","\"Nebraska\"","NE","\"Alliance\"",null,10,"Alliance",null,"RAPID CITY    SD","SD",611,7301,"Rapid City","SD","SDRAPCTY.txt"]
[null,"700","\"Louisiana\"","LA","\"New Orleans\"",null,13,"New Orleans",null,"NEW ORLEANS    LA","LA",2655,1513,"New Orleans","LA","LANEWORL.txt"]
[null,"701","\"Louisiana\"","LA","\"New Orleans\"",null,13,"New Orleans",null,"NEW ORLEANS    LA","LA",2655,1513,"New Orleans","LA","LANEWORL.txt"]
[null,"703","\"Louisiana\"","LA","\"Thibodaux\"",null,11,"Thibodaux",null,"NEW ORLEANS    LA","LA",2655,1513,"New Orleans","LA","LANEWORL.txt"]
[null,"704","\"Louisiana\"","LA","\"Hammond\"",null,{"$f":"LEN(E650)","v":9},{"$f":"MID(E650,2,G650-2)","v":"Hammond"},null,"BATON ROUGE    LA","LA",2690,1669,"Baton Rouge","LA","LABATONR.txt"]
[null,"705","\"Louisiana\"","LA","\"Lafayette\"",null,11,"Lafayette",null,"BATON ROUGE    LA","LA",2690,1669,"Baton Rouge","LA","LABATONR.txt"]
[null,"706","\"Louisiana\"","LA","\"Lake Charles\"",null,14,"Lake Charles",null,"LAKE CHARLES    LA","LA",2650,1616,"Lake Charles","LA","LALAKECH.txt"]
[null,"707","\"Louisiana\"","LA","\"Baton Rouge\"",null,13,"Baton Rouge",null,"BATON ROUGE    LA","LA",2690,1669,"Baton Rouge","LA","LABATONR.txt"]
[null,"708","\"Louisiana\"","LA","\"Baton Rouge\"",null,13,"Baton Rouge",null,"BATON ROUGE    LA","LA",2690,1669,"Baton Rouge","LA","LABATONR.txt"]
[null,"710","\"Louisiana\"","LA","\"Shreveport\"",null,12,"Shreveport",null,"SHREVEPORT    LA","LA",2368,2264,"Shreveport","LA","LASHREVE.txt"]
[null,"711","\"Louisiana\"","LA","\"Shreveport\"",null,12,"Shreveport",null,"SHREVEPORT    LA","LA",2368,2264,"Shreveport","LA","LASHREVE.txt"]
[null,"712","\"Louisiana\"","LA","\"Monroe\"",null,8,"Monroe",null,"JACKSON    MS","MS",2215,2467,"Jackson","MS","MSJACKSO.txt"]
[null,"713","\"Louisiana\"","LA","\"Alexandria\"",null,12,"Alexandria",null,"SHREVEPORT    LA","LA",2368,2264,"Shreveport","LA","LASHREVE.txt"]
[null,"714","\"Louisiana\"","LA","\"Aimwell\"",null,9,"Aimwell",null,"SHREVEPORT    LA","LA",2368,2264,"Shreveport","LA","LASHREVE.txt"]
[null,"716","\"Arkansas\"","AR","\"Pine Bluff\"",null,12,"Pine Bluff",null,"JACKSON    MS","MS",2215,2467,"Jackson","MS","MSJACKSO.txt"]
[null,"717","\"Arkansas\"","AR","\"Camden\"",null,8,"Camden",null,"LITTLE ROCK    AR","AR",2005,3155,"Little Rock","AR","ARLIROCK.txt"]
[null,"718","\"Arkansas\"","AR","\"Hope\"",null,6,"Hope",null,"LITTLE ROCK    AR","AR",2005,3155,"Little Rock","AR","ARLIROCK.txt"]
[null,"719","\"Arkansas\"","AR","\"Hot Springs\"",null,13,"Hot Springs",null,"LITTLE ROCK    AR","AR",2005,3155,"Little Rock","AR","ARLIROCK.txt"]
[null,"720","\"Arkansas\"","AR","\"Little Rock\"",null,13,"Little Rock",null,"LITTLE ROCK    AR","AR",2005,3155,"Little Rock","AR","ARLIROCK.txt"]
[null,"721","\"Arkansas\"","AR","\"Little Rock\"",null,13,"Little Rock",null,"LITTLE ROCK    AR","AR",2005,3155,"Little Rock","AR","ARLIROCK.txt"]
[null,"722","\"Arkansas\"","AR","\"Little Rock\"",null,13,"Little Rock",null,"LITTLE ROCK    AR","AR",2005,3155,"Little Rock","AR","ARLIROCK.txt"]
[null,"723","\"Arkansas\"","AR","\"West Memphis\"",null,14,"West Memphis",null,"NORTH LITTLE ROCK    AR","AR",1916,3228,"Little Rock","AR","ARLIROCK.txt"]
[null,"724","\"Arkansas\"","AR","\"Jonesboro\"",null,11,"Jonesboro",null,"NORTH LITTLE ROCK    AR","AR",1916,3228,"Little Rock","AR","ARLIROCK.txt"]
[null,"725","\"Arkansas\"","AR","\"Batesville\"",null,12,"Batesville",null,"NORTH LITTLE ROCK    AR","AR",1916,3228,"Little Rock","AR","ARLIROCK.txt"]
[null,"726","\"Arkansas\"","AR","\"Harrison\"",null,10,"Harrison",null,"FORT SMITH    AR","AR",1894,3478,"Fort Smith","AR","ARFTSMIT.txt"]
[null,"727","\"Arkansas\"","AR","\"Fayetteville\"",null,14,"Fayetteville",null,"SPRINGFIELD    MO","MO",1320,4638,"Springfield","MO","MOSPRING.txt"]
[null,"728","\"Arkansas\"","AR","\"Russellville\"",null,14,"Russellville",null,"FORT SMITH    AR","AR",1894,3478,"Fort Smith","AR","ARFTSMIT.txt"]
[null,"729","\"Arkansas\"","AR","\"Fort Smith\"",null,12,"Fort Smith",null,"FORT SMITH    AR","AR",1894,3478,"Fort Smith","AR","ARFTSMIT.txt"]
[null,"730","\"Oklahoma\"","OK","\"Oklahoma City\"",null,15,"Oklahoma City",null,"OKLAHOMA CITY    OK","OK",1859,3659,"Oklahoma City","OK","OKOKLCTY.txt"]
[null,"731","\"Oklahoma\"","OK","\"Oklahoma City\"",null,15,"Oklahoma City",null,"OKLAHOMA CITY    OK","OK",1859,3659,"Oklahoma City","OK","OKOKLCTY.txt"]
[null,"734","\"Oklahoma\"","OK","\"Ardmore\"",null,9,"Ardmore",null,"DALLAS-FORT WORTH    TX","TX",2603,2407,"Dallas Ft Worth","TX","TXDALLAS.txt"]
[null,"735","\"Oklahoma\"","OK","\"Lawton\"",null,8,"Lawton",null,"WICHITA FALLS    TX","TX",2340,3042,"Wichita Falls","TX","TXWICHFA.txt"]
[null,"736","\"Oklahoma\"","OK","\"Clinton\"",null,9,"Clinton",null,"OKLAHOMA CITY    OK","OK",1859,3659,"Oklahoma City","OK","OKOKLCTY.txt"]
[null,"737","\"Oklahoma\"","OK","\"Enid\"",null,6,"Enid",null,"OKLAHOMA CITY    OK","OK",1859,3659,"Oklahoma City","OK","OKOKLCTY.txt"]
[null,"738","\"Oklahoma\"","OK","\"Woodward\"",null,10,"Woodward",null,"AMARILLO    TX","TX",1354,4258,"Amarillo","TX","TXAMARIL.txt"]
[null,"739","\"Oklahoma\"","OK","\"Guymon\"",null,8,"Guymon",null,"AMARILLO    TX","TX",1354,4258,"Oklahoma City","OK","OKOKLCTY.txt"]
[null,"740","\"Oklahoma\"","OK","\"Tulsa\"",null,7,"Tulsa",null,"OKLAHOMA CITY    OK","OK",1859,3659,"Tulsa","OK","OKTULSA.txt"]
[null,"741","\"Oklahoma\"","OK","\"Tulsa\"",null,7,"Tulsa",null,"TULSA    OK","OK",2017,3691,"Tulsa","OK","OKTULSA.txt"]
[null,"743","\"Oklahoma\"","OK","\"Vinita\"",null,8,"Vinita",null,"TULSA    OK","OK",2017,3691,"Tulsa","OK","OKTULSA.txt"]
[null,"744","\"Oklahoma\"","OK","\"Muskogee\"",null,10,"Muskogee",null,"FORT SMITH    AR","AR",1894,3478,"Fort Smith","AR","ARFTSMIT.txt"]
[null,"745","\"Oklahoma\"","OK","\"McAlester\"",null,11,"McAlester",null,"FORT SMITH    AR","AR",1894,3478,"Fort Smith","AR","ARFTSMIT.txt"]
[null,"746","\"Oklahoma\"","OK","\"Ponca City\"",null,12,"Ponca City",null,"TULSA    OK","OK",2017,3691,"Tulsa","OK","OKTULSA.txt"]
[null,"747","\"Oklahoma\"","OK","\"Durant\"",null,8,"Durant",null,"DALLAS-FORT WORTH    TX","TX",2603,2407,"Dallas Ft Worth","TX","TXDALLAS.txt"]
[null,"748","\"Oklahoma\"","OK","\"Shawnee\"",null,9,"Shawnee",null,"WICHITA FALLS    TX","TX",2340,3042,"Wichita Falls","TX","TXWICHFA.txt"]
[null,"749","\"Oklahoma\"","OK","\"Poteau\"",null,8,"Poteau",null,"FORT SMITH    AR","AR",1894,3478,"Fort Smith","AR","ARFTSMIT.txt"]
[null,"750","\"Texas\"","TX","\"Dallas\"",null,8,"Dallas",null,"DALLAS-FORT WORTH    TX","TX",2603,2407,"Dallas Ft Worth","TX","TXDALLAS.txt"]
[null,"751","\"Texas\"","TX","\"Dallas\"",null,8,"Dallas",null,"DALLAS-FORT WORTH    TX","TX",2603,2407,"Dallas Ft Worth","TX","TXDALLAS.txt"]
[null,"752","\"Texas\"","TX","\"Dallas\"",null,8,"Dallas",null,"DALLAS-FORT WORTH    TX","TX",2603,2407,"Dallas Ft Worth","TX","TXDALLAS.txt"]
[null,"753","\"Texas\"","TX","\"Dallas\"",null,8,"Dallas",null,"DALLAS-FORT WORTH    TX","TX",2603,2407,"Dallas Ft Worth","TX","TXDALLAS.txt"]
[null,"754","\"Texas\"","TX","\"Greenville\"",null,12,"Greenville",null,"DALLAS-FORT WORTH    TX","TX",2603,2407,"Dallas Ft Worth","TX","TXDALLAS.txt"]
[null,"755","\"Texas\"","TX","\"Texarkana\"",null,11,"Texarkana",null,"SHREVEPORT    LA","LA",2368,2264,"Shreveport","LA","LASHREVE.txt"]
[null,"756","\"Texas\"","TX","\"Longview\"",null,10,"Longview",null,"SHREVEPORT    LA","LA",2368,2264,"Shreveport","LA","LASHREVE.txt"]
[null,"757","\"Texas\"","TX","\"Tyler\"",null,7,"Tyler",null,"DALLAS-FORT WORTH    TX","TX",2603,2407,"Dallas Ft Worth","TX","TXDALLAS.txt"]
[null,"758","\"Texas\"","TX","\"Palestine\"",null,11,"Palestine",null,"WACO    TX","TX",2816,2179,"Waco","TX","TXWACO.txt"]
[null,"759","\"Texas\"","TX","\"Lufkin\"",null,8,"Lufkin",null,"WACO    TX","TX",2816,2179,"Waco","TX","TXWACO.txt"]
[null,"760","\"Texas\"","TX","\"Fort Worth\"",null,12,"Fort Worth",null,"DALLAS-FORT WORTH    TX","TX",2603,2407,"Dallas Ft Worth","TX","TXDALLAS.txt"]
[null,"761","\"Texas\"","TX","\"Fort Worth\"",null,12,"Fort Worth",null,"DALLAS-FORT WORTH    TX","TX",2603,2407,"Dallas Ft Worth","TX","TXDALLAS.txt"]
[null,"762","\"Texas\"","TX","\"Denton\"",null,8,"Denton",null,"DALLAS-FORT WORTH    TX","TX",2603,2407,"Dallas Ft Worth","TX","TXDALLAS.txt"]
[null,"763","\"Texas\"","TX","\"Wichita Falls\"",null,15,"Wichita Falls",null,"WICHITA FALLS    TX","TX",2340,3042,"Wichita Falls","TX","TXWICHFA.txt"]
[null,"764","\"Texas\"","TX","\"Stephenville\"",null,14,"Stephenville",null,"ABILENE    TX","TX",2451,2584,"Abilene","TX","TXABILEN.txt"]
[null,"765","\"Texas\"","TX","\"Temple\"",null,8,"Temple",null,"WACO    TX","TX",2816,2179,"Waco","TX","TXWACO.txt"]
[null,"766","\"Texas\"","TX","\"Waco\"",null,6,"Waco",null,"WACO    TX","TX",2816,2179,"Waco","TX","TXWACO.txt"]
[null,"767","\"Texas\"","TX","\"Waco\"",null,6,"Waco",null,"WACO    TX","TX",2816,2179,"Waco","TX","TXWACO.txt"]
[null,"768","\"Texas\"","TX","\"Brownwood\"",null,11,"Brownwood",null,"ABILENE    TX","TX",2451,2584,"Abilene","TX","TXABILEN.txt"]
[null,"769","\"Texas\"","TX","\"San Angelo\"",null,12,"San Angelo",null,"SAN ANGELO    TX","TX",2400,2414,"San Angelo","TX","TXSANANG.txt"]
[null,"770","\"Texas\"","TX","\"Houston\"",null,9,"Houston",null,"HOUSTON    TX","TX",2700,1599,"Houston","TX","TXHOUSTO.txt"]
[null,"771","\"Texas\"","TX","\"Houston\"",null,9,"Houston",null,"HOUSTON    TX","TX",2700,1599,"Houston","TX","TXHOUSTO.txt"]
[null,"772","\"Texas\"","TX","\"Houston\"",null,9,"Houston",null,"HOUSTON    TX","TX",2700,1599,"Houston","TX","TXHOUSTO.txt"]
[null,"773","\"Texas\"","TX","\"Conroe\"",null,{"$f":"LEN(E714)","v":8},{"$f":"MID(E714,2,G714-2)","v":"Conroe"},null,"HOUSTON    TX","TX",2700,1599,"Houston","TX","TXHOUSTO.txt"]
[null,"774","\"Texas\"","TX","\"Houston\"",null,9,"Houston",null,"HOUSTON    TX","TX",2700,1599,"Houston","TX","TXHOUSTO.txt"]
[null,"775","\"Texas\"","TX","\"Galveston\"",null,11,"Galveston",null,"GALVESTON    TX","TX",2994,1263,"Houston","TX","TXHOUSTO.txt"]
[null,"776","\"Texas\"","TX","\"Beaumont\"",null,10,"Beaumont",null,"PORT ARTHUR    TX","TX",2764,1499,"Houston","TX","TXHOUSTO.txt"]
[null,"777","\"Texas\"","TX","\"Beaumont\"",null,10,"Beaumont",null,"PORT ARTHUR    TX","TX",2764,1499,"Houston","TX","TXHOUSTO.txt"]
[null,"778","\"Texas\"","TX","\"Bryan\"",null,7,"Bryan",null,"AUSTIN    TX","TX",3016,1688,"Austin","TX","TXAUSTIN.txt"]
[null,"779","\"Texas\"","TX","\"Victoria\"",null,10,"Victoria",null,"VICTORIA    TX","TX",3118,1296,"Corpus Christi","TX","TXCORPUS.txt"]
[null,"780","\"Texas\"","TX","\"Laredo/Pearsall\"",null,17,"Laredo/Pearsall",null,"VICTORIA    TX","TX",3118,1296,"San Antonio","TX","TXSANANT.txt"]
[null,"781","\"Texas\"","TX","\"San Antonio\"",null,13,"San Antonio",null,"AUSTIN    TX","TX",3016,1688,"San Antonio","TX","TXSANANT.txt"]
[null,"782","\"Texas\"","TX","\"San Antonio\"",null,13,"San Antonio",null,"SAN ANTONIO    TX","TX",2996,1644,"San Antonio","TX","TXSANANT.txt"]
[null,"783","\"Texas\"","TX","\"Corpus Christi\"",null,16,"Corpus Christi",null,"CORPUS CHRISTI    TX","TX",3439,1016,"Corpus Christi","TX","TXCORPUS.txt"]
[null,"784","\"Texas\"","TX","\"Corpus Christi\"",null,16,"Corpus Christi",null,"CORPUS CHRISTI    TX","TX",3439,1016,"Corpus Christi","TX","TXCORPUS.txt"]
[null,"785","\"Texas\"","TX","\"Brownsville\"",null,13,"Brownsville",null,"BROWNSVILLE    TX","TX",3888,635,"Brownsville","TX","TXBROWNS.txt"]
[null,"786","\"Texas\"","TX","\"Austin\"",null,8,"Austin",null,"SAN ANTONIO    TX","TX",2996,1644,"Austin","TX","TXAUSTIN.txt"]
[null,"787","\"Texas\"","TX","\"Austin\"",null,8,"Austin",null,"AUSTIN    TX","TX",3016,1688,"Austin","TX","TXAUSTIN.txt"]
[null,"788","\"Texas\"","TX","\"Uvalde\"",null,8,"Uvalde",null,"DEL RIO    TX","TX",3142,1506,"San Antonio","TX","TXSANANT.txt"]
[null,"789","\"Texas\"","TX","\"Giddings\"",null,10,"Giddings",null,"AUSTIN    TX","TX",3016,1688,"Austin","TX","TXAUSTIN.txt"]
[null,"790","\"Texas\"","TX","\"Adrian\"",null,8,"Adrian",null,"AMARILLO    TX","TX",1354,4258,"Amarillo","TX","TXAMARIL.txt"]
[null,"791","\"Texas\"","TX","\"Amarillo\"",null,10,"Amarillo",null,"AMARILLO    TX","TX",1354,4258,"Amarillo","TX","TXAMARIL.txt"]
[null,"792","\"Texas\"","TX","\"Childress\"",null,11,"Childress",null,"LUBBOCK    TX","TX",1689,3431,"Lubbock","TX","TXLUBBOC.txt"]
[null,"793","\"Texas\"","TX","\"Lubbock\"",null,9,"Lubbock",null,"LUBBOCK    TX","TX",1689,3431,"Lubbock","TX","TXLUBBOC.txt"]
[null,"794","\"Texas\"","TX","\"Lubbock\"",null,9,"Lubbock",null,"LUBBOCK    TX","TX",1689,3431,"Lubbock","TX","TXLUBBOC.txt"]
[null,"795","\"Texas\"","TX","\"Abilene\"",null,9,"Abilene",null,"ABILENE    TX","TX",2451,2584,"Abilene","TX","TXABILEN.txt"]
[null,"796","\"Texas\"","TX","\"Abilene\"",null,9,"Abilene",null,"ABILENE    TX","TX",2451,2584,"Abilene","TX","TXABILEN.txt"]
[null,"797","\"Texas\"","TX","\"Midland\"",null,9,"Midland",null,"EL PASO    TX","TX",2094,2708,"Midland Odessa","TX","TXMIDLAN.txt"]
[null,"798","\"Texas\"","TX","\"El Paso\"",null,9,"El Paso",null,"MIDLAND-ODESSA    TX","TX",2163,2751,"El Paso","TX","TXELPASO.txt"]
[null,"799","\"Texas\"","TX","\"El Paso\"",null,9,"El Paso",null,"EL PASO    TX","TX",2094,2708,"El Paso","TX","TXELPASO.txt"]
[null,"800","\"Colorado\"","CO","\"Denver\"",null,8,"Denver",null,"DENVER    CO","CO",679,6020,"Denver","CO","CODENVER.txt"]
[null,"801","\"Colorado\"","CO","\"Denver\"",null,8,"Denver",null,"DENVER    CO","CO",679,6020,"Denver","CO","CODENVER.txt"]
[null,"802","\"Colorado\"","CO","\"Denver\"",null,8,"Denver",null,"DENVER    CO","CO",679,6020,"Denver","CO","CODENVER.txt"]
[null,"803","\"Colorado\"","CO","\"Boulder\"",null,9,"Boulder",null,"DENVER    CO","CO",679,6020,"Denver","CO","CODENVER.txt"]
[null,"804","\"Colorado\"","CO","\"Golden/Dillon\"",null,15,"Golden/Dillon",null,"DENVER    CO","CO",679,6020,"Denver","CO","CODENVER.txt"]
[null,"805","\"Colorado\"","CO","\"Longmont\"",null,10,"Longmont",null,"DENVER    CO","CO",679,6020,"Denver","CO","CODENVER.txt"]
[null,"806","\"Colorado\"","CO","\"Greeley\"",null,9,"Greeley",null,"DENVER    CO","CO",679,6020,"Denver","CO","CODENVER.txt"]
[null,"807","\"Colorado\"","CO","\"Fort Morgan\"",null,13,"Fort Morgan",null,"COLORADO SPRINGS    CO","CO",419,6415,"Colorado Springs","CO","COCOSPGS.txt"]
[null,"808","\"Colorado\"","CO","\"Colorado Springs\"",null,18,"Colorado Springs",null,"COLORADO SPRINGS    CO","CO",419,6415,"Colorado Springs","CO","COCOSPGS.txt"]
[null,"809","\"Colorado\"","CO","\"Colorado Springs\"",null,18,"Colorado Springs",null,"COLORADO SPRINGS    CO","CO",419,6415,"Colorado Springs","CO","COCOSPGS.txt"]
[null,"810","\"Colorado\"","CO","\"Pueblo\"",null,8,"Pueblo",null,"PUEBLO    CO","CO",973,5413,"Pueblo","CO","COPUEBLO.txt"]
[null,"811","\"Colorado\"","CO","\"Alamosa\"",null,9,"Alamosa",null,"ALAMOSA    CO","CO",62,8749,"Colorado Springs","CO","COCOSPGS.txt"]
[null,"812","\"Colorado\"","CO","\"Salida\"",null,8,"Salida",null,"ALAMOSA    CO","CO",62,8749,"Pueblo","CO","COPUEBLO.txt"]
[null,"813","\"Colorado\"","CO","\"Durango\"",null,9,"Durango",null,"GRAND JUNCTION    CO","CO",1183,5548,"Grand Junction","CO","COGRNDJU.txt"]
[null,"814","\"Colorado\"","CO","\"Montrose\"",null,10,"Montrose",null,"GRAND JUNCTION    CO","CO",1183,5548,"Grand Junction","CO","COGRNDJU.txt"]
[null,"815","\"Colorado\"","CO","\"Grand Junction\"",null,16,"Grand Junction",null,"GRAND JUNCTION    CO","CO",1183,5548,"Grand Junction","CO","COGRNDJU.txt"]
[null,"816","\"Colorado\"","CO","\"Glenwood Springs\"",null,18,"Glenwood Springs",null,"GRAND JUNCTION    CO","CO",1183,5548,"Grand Junction","CO","COGRNDJU.txt"]
[null,"820","\"Wyoming\"","WY","\"Cheyenne\"",null,10,"Cheyenne",null,"CHEYENNE    WY","WY",285,7326,"Cheyenne","WY","WYCHEYEN.txt"]
[null,"821","\"Wyoming\"","WY","\"Yellowstone Nat Pk\"",null,20,"Yellowstone Nat Pk",null,"HELENA    MT","MT",386,8031,"Helena","MT","MTHELENA.txt"]
[null,"822","\"Wyoming\"","WY","\"Wheatland\"",null,11,"Wheatland",null,"SCOTTSBLUFF    NE","NE",713,6729,"Cheyenne","WY","WYCHEYEN.txt"]
[null,"823","\"Wyoming\"","WY","\"Rawlins\"",null,9,"Rawlins",null,"CHEYENNE    WY","WY",285,7326,"Cheyenne","WY","WYCHEYEN.txt"]
[null,"824","\"Wyoming\"","WY","\"Worland\"",null,9,"Worland",null,"LANDER    WY","WY",479,7889,"Casper","WY","WYCASPER.txt "]
[null,"825","\"Wyoming\"","WY","\"Riverton\"",null,10,"Riverton",null,"LANDER    WY","WY",479,7889,"Casper","WY","WYCASPER.txt "]
[null,"826","\"Wyoming\"","WY","\"Casper\"",null,8,"Casper",null,"SHERIDAN    WY","WY",439,7804,"Casper","WY","WYCASPER.txt "]
[null,"827","\"Wyoming\"","WY","\"Gillette\"",null,10,"Gillette",null,"CASPER    WY","WY",445,7682,"Casper","WY","WYCASPER.txt "]
[null,"828","\"Wyoming\"","WY","\"Sheridan\"",null,10,"Sheridan",null,"SHERIDAN    WY","WY",439,7804,"Casper","WY","WYCASPER.txt "]
[null,"829","\"Wyoming\"","WY","\"Rock Springs\"",null,14,"Rock Springs",null,"LANDER    WY","WY",479,7889,"Casper","WY","WYCASPER.txt "]
[null,"830","\"Wyoming\"","WY","\"Jackson\"",null,9,"Jackson",null,"LANDER    WY","WY",479,7889,"Casper","WY","WYCASPER.txt "]
[null,"831","\"Wyoming\"","WY","\"Kemmerer\"",null,10,"Kemmerer",null,"LANDER    WY","WY",479,7889,"Casper","WY","WYCASPER.txt "]
[null,"832","\"Idaho\"","ID","\"Pocatello\"",null,11,"Pocatello",null,"POCATELLO    ID","ID",421,7180,"Pocatello","ID","IDPOCATE.txt"]
[null,"833","\"Idaho\"","ID","\"Twin Falls\"",null,12,"Twin Falls",null,"POCATELLO    ID","ID",421,7180,"Pocatello","ID","IDPOCATE.txt"]
[null,"834","\"Idaho\"","ID","\"Idaho Falls\"",null,13,"Idaho Falls",null,"POCATELLO    ID","ID",421,7180,"Pocatello","ID","IDPOCATE.txt"]
[null,"835","\"Idaho\"","ID","\"Lewiston\"",null,10,"Lewiston",null,"LEWISTON    ID","ID",814,5270,"Spokane","WA","WASPOKAN.txt"]
[null,"836","\"Idaho\"","ID","\"Boise\"",null,7,"Boise",null,"BOISE    ID","ID",754,5861,"Boise","ID","IDBOISE.txt"]
[null,"837","\"Idaho\"","ID","\"Boise\"",null,7,"Boise",null,"BOISE    ID","ID",754,5861,"Boise","ID","IDBOISE.txt"]
[null,"838","\"Idaho\"","ID","\"Coeur D'Alene\"",null,15,"Coeur D'Alene",null,"SPOKANE    WA","WA",398,6842,"Spokane","WA","WASPOKAN.txt"]
[null,"840","\"Utah\"","UT","\"Salt Lake City/Heber City\"",null,27,"Salt Lake City/Heber City",null,"SALT LAKE CITY    UT","UT",1047,5765,"Salt Lake City","UT","UTSALTLK.txt"]
[null,"841","\"Utah\"","UT","\"Salt Lake City\"",null,{"$f":"LEN(E778)","v":16},{"$f":"MID(E778,2,G778-2)","v":"Salt Lake City"},null,"SALT LAKE CITY    UT","UT",1047,5765,"Salt Lake City","UT","UTSALTLK.txt"]
[null,"843","\"Utah\"","UT","\"Ogden/Logan\"",null,13,"Ogden/Logan",null,"SALT LAKE CITY    UT","UT",1047,5765,"Salt Lake City","UT","UTSALTLK.txt"]
[null,"844","\"Utah\"","UT","\"Ogden\"",null,7,"Ogden",null,"SALT LAKE CITY    UT","UT",1047,5765,"Salt Lake City","UT","UTSALTLK.txt"]
[null,"845","\"Utah\"","UT","\"Southeast Utah/Green River\"",null,28,"Southeast Utah/Green River",null,"GRAND JUNCTION    CO","CO",1183,5548,"Grand Junction","CO","COGRNDJU.txt"]
[null,"846","\"Utah\"","UT","\"Provo\"",null,7,"Provo",null,"SALT LAKE CITY    UT","UT",1047,5765,"Salt Lake City","UT","UTSALTLK.txt"]
[null,"847","\"Utah\"","UT","\"Southwest Utah/Cedar City\"",null,27,"Southwest Utah/Cedar City",null,"MILFORD    UT","UT",647,6511,"Grand Junction","CO","COGRNDJU.txt"]
[null,"850","\"Arizona\"","AZ","\"Phoenix\"",null,9,"Phoenix",null,"PHOENIX    AZ","AZ",4162,1350,"Phoenix","AZ","AZPHOENI.txt"]
[null,"851","\"Arizona\"","AZ","\"Phoenix\"",null,9,"Phoenix",null,"PHOENIX    AZ","AZ",4162,1350,"Phoenix","AZ","AZPHOENI.txt"]
[null,"852","\"Arizona\"","AZ","\"Casa Grande\"",null,13,"Casa Grande",null,"TUCSON    AZ","AZ",2954,1678,"Tucson","AZ","AZTUCSON.txt"]
[null,"853","\"Arizona\"","AZ","\"Buckeye/Yuma\"",null,14,"Buckeye/Yuma",null,"YUMA    AZ","AZ",4305,927,"Yuma","AZ","AZYUMA.txt"]
[null,"855","\"Arizona\"","AZ","\"Globe\"",null,7,"Globe",null,"TUCSON    AZ","AZ",2954,1678,"Tucson","AZ","AZTUCSON.txt"]
[null,"856","\"Arizona\"","AZ","\"Sierra Vista/Nogales\"",null,22,"Sierra Vista/Nogales",null,"TUCSON    AZ","AZ",2954,1678,"Tucson","AZ","AZTUCSON.txt"]
[null,"857","\"Arizona\"","AZ","\"Tucson\"",null,8,"Tucson",null,"TUCSON    AZ","AZ",2954,1678,"Tucson","AZ","AZTUCSON.txt"]
[null,"859","\"Arizona\"","AZ","\"Show Low\"",null,10,"Show Low",null,"ALBUQUERQUE    NM","NM",1244,4425,"Albuquerque","NM","NMALBUQU.txt"]
[null,"860","\"Arizona\"","AZ","\"Flagstaff\"",null,11,"Flagstaff",null,"FLAGSTAFF    AZ","AZ",145,7131,"Flagstaff","AZ","AZFLAGST.txt"]
[null,"863","\"Arizona\"","AZ","\"Prescott\"",null,10,"Prescott",null,"FLAGSTAFF    AZ","AZ",145,7131,"Flagstaff","AZ","AZFLAGST.txt"]
[null,"864","\"Arizona\"","AZ","\"Kingman\"",null,9,"Kingman",null,"LAS VEGAS    NV","NV",3201,2407,"Las Vegas","NV","NVLASVEG.txt"]
[null,"865","\"Arizona\"","AZ","\"Window Rock\"",null,13,"Window Rock",null,"FLAGSTAFF    AZ","AZ",145,7131,"Flagstaff","AZ","AZFLAGST.txt"]
[null,"870","\"New_Mexico\"","NM","\"Bernalillo\"",null,12,"Bernalillo",null,"ALBUQUERQUE    NM","NM",1244,4425,"Albuquerque","NM","NMALBUQU.txt"]
[null,"871","\"New_Mexico\"","NM","\"Albuquerque\"",null,13,"Albuquerque",null,"ALBUQUERQUE    NM","NM",1244,4425,"Albuquerque","NM","NMALBUQU.txt"]
[null,"872","\"New_Mexico\"","NM","\"Albuquerque\"",null,13,"Albuquerque",null,"ALBUQUERQUE    NM","NM",1244,4425,"Albuquerque","NM","NMALBUQU.txt"]
[null,"873","\"New_Mexico\"","NM","\"Gallup\"",null,8,"Gallup",null,"ALBUQUERQUE    NM","NM",1244,4425,"Albuquerque","NM","NMALBUQU.txt"]
[null,"874","\"New_Mexico\"","NM","\"Farmington\"",null,12,"Farmington",null,"GRAND JUNCTION    CO","CO",1183,5548,"Grand Junction","CO","COGRNDJU.txt"]
[null,"875","\"New_Mexico\"","NM","\"Santa Fe\"",null,10,"Santa Fe",null,"ALBUQUERQUE    NM","NM",1244,4425,"Santa Fe","NM","NMSANTAF.txt"]
[null,"877","\"New_Mexico\"","NM","\"Las Vegas\"",null,11,"Las Vegas",null,"PUEBLO    CO","CO",973,5413,"Pueblo","CO","COPUEBLO.txt"]
[null,"878","\"New_Mexico\"","NM","\"Socorro\"",null,9,"Socorro",null,"ALBUQUERQUE    NM","NM",1244,4425,"Albuquerque","NM","NMALBUQU.txt"]
[null,"879","\"New_Mexico\"","NM","\"Truth or Conseq.\"",null,18,"Truth or Conseq.",null,"EL PASO    TX","TX",2094,2708,"El Paso","TX","TXELPASO.txt"]
[null,"880","\"New_Mexico\"","NM","\"Las Cruces\"",null,12,"Las Cruces",null,"EL PASO    TX","TX",2094,2708,"El Paso","TX","TXELPASO.txt"]
[null,"881","\"New_Mexico\"","NM","\"Clovis\"",null,8,"Clovis",null,"CLAYTON    NM","NM",772,5064,"Amarillo","TX","TXAMARIL.txt"]
[null,"882","\"New_Mexico\"","NM","\"Roswell\"",null,9,"Roswell",null,"ROSWELL    NM","NM",1776,3267,"Lubbock","TX","TXLUBBOC.txt"]
[null,"883","\"New_Mexico\"","NM","\"Carrizozo\"",null,11,"Carrizozo",null,"ALBUQUERQUE    NM","NM",1244,4425,"Albuquerque","NM","NMALBUQU.txt"]
[null,"884","\"New_Mexico\"","NM","\"Tucumcari\"",null,11,"Tucumcari",null,"CLAYTON    NM","NM",772,5064,"Amarillo","TX","TXAMARIL.txt"]
[null,"890","\"Nevada\"","NV","\"Tonopah\"",null,9,"Tonopah",null,"MILFORD    UT","UT",647,6511,"Las Vegas","NV","NVLASVEG.txt"]
[null,"891","\"Nevada\"","NV","\"Las Vegas\"",null,11,"Las Vegas",null,"LAS VEGAS    NV","NV",3201,2407,"Las Vegas","NV","NVLASVEG.txt"]
[null,"893","\"Nevada\"","NV","\"Ely\"",null,5,"Ely",null,"ELY    NV","NV",208,7621,"Reno","NV","NVRENO.txt"]
[null,"894","\"Nevada\"","NV","\"Reno\"",null,6,"Reno",null,"RENO    NV","NV",508,5674,"Reno","NV","NVRENO.txt"]
[null,"895","\"Nevada\"","NV","\"Reno\"",null,6,"Reno",null,"RENO    NV","NV",508,5674,"Reno","NV","NVRENO.txt"]
[null,"896","\"Nevada\"","NV","\"Reno\"",null,6,"Reno",null,"RENO    NV","NV",508,5674,"Reno","NV","NVRENO.txt"]
[null,"897","\"Nevada\"","NV","\"Carson City\"",null,13,"Carson City",null,"RENO    NV","NV",508,5674,"Reno","NV","NVRENO.txt"]
[null,"898","\"Nevada\"","NV","\"Elko\"",null,6,"Elko",null,"ELKO    NV","NV",457,7077,"Reno","NV","NVRENO.txt"]
[null,"900","\"California\"","CA","\"Los Angeles\"",null,13,"Los Angeles",null,"LOS ANGELES AP    CA","CA",727,1458,"Los Angeles","CA","CALOSANG.txt"]
[null,"901","\"California\"","CA","\"Los Angeles\"",null,13,"Los Angeles",null,"LOS ANGELES AP    CA","CA",727,1458,"Los Angeles","CA","CALOSANG.txt"]
[null,"902","\"California\"","CA","\"Los Angeles\"",null,13,"Los Angeles",null,"LOS ANGELES AP    CA","CA",727,1458,"Los Angeles","CA","CALOSANG.txt"]
[null,"903","\"California\"","CA","\"Inglewood\"",null,11,"Inglewood",null,"LOS ANGELES AP    CA","CA",727,1458,"Los Angeles","CA","CALOSANG.txt"]
[null,"904","\"California\"","CA","\"Santa Monica\"",null,14,"Santa Monica",null,"LOS ANGELES AP    CA","CA",727,1458,"Los Angeles","CA","CALOSANG.txt"]
[null,"905","\"California\"","CA","\"Torrance\"",null,10,"Torrance",null,"LONG BEACH    CA","CA",1201,1430,"Los Angeles","CA","CALOSANG.txt"]
[null,"906","\"California\"","CA","\"Whittier\"",null,10,"Whittier",null,"LONG BEACH    CA","CA",1201,1430,"Los Angeles","CA","CALOSANG.txt"]
[null,"907","\"California\"","CA","\"San Pedro\"",null,11,"San Pedro",null,"LONG BEACH    CA","CA",1201,1430,"Los Angeles","CA","CALOSANG.txt"]
[null,"908","\"California\"","CA","\"Long Beach\"",null,12,"Long Beach",null,"LONG BEACH    CA","CA",1201,1430,"Los Angeles","CA","CALOSANG.txt"]
[null,"910","\"California\"","CA","\"Pasadena\"",null,10,"Pasadena",null,"LOS ANGELES C.O.    CA","CA",1537,1154,"Los Angeles","CA","CALOSANG.txt"]
[null,"911","\"California\"","CA","\"Pasadena\"",null,10,"Pasadena",null,"LOS ANGELES C.O.    CA","CA",1537,1154,"Los Angeles","CA","CALOSANG.txt"]
[null,"912","\"California\"","CA","\"Glendale\"",null,10,"Glendale",null,"LOS ANGELES C.O.    CA","CA",1537,1154,"Los Angeles","CA","CALOSANG.txt"]
[null,"913","\"California\"","CA","\"Van Nuys\"",null,10,"Van Nuys",null,"BAKERSFIELD    CA","CA",2365,2182,"Los Angeles","CA","CALOSANG.txt"]
[null,"914","\"California\"","CA","\"Van Nuys\"",null,10,"Van Nuys",null,"LOS ANGELES C.O.    CA","CA",1537,1154,"Los Angeles","CA","CALOSANG.txt"]
[null,"915","\"California\"","CA","\"Burbank\"",null,9,"Burbank",null,"LOS ANGELES C.O.    CA","CA",1537,1154,"Los Angeles","CA","CALOSANG.txt"]
[null,"916","\"California\"","CA","\"North Hollywood\"",null,17,"North Hollywood",null,"LOS ANGELES C.O.    CA","CA",1537,1154,"Los Angeles","CA","CALOSANG.txt"]
[null,"917","\"California\"","CA","\"Covina\"",null,8,"Covina",null,"LONG BEACH    CA","CA",1201,1430,"Los Angeles","CA","CALOSANG.txt"]
[null,"918","\"California\"","CA","\"Alhambra\"",null,10,"Alhambra",null,"LOS ANGELES C.O.    CA","CA",1537,1154,"Los Angeles","CA","CALOSANG.txt"]
[null,"919","\"California\"","CA","\"San Diego\"",null,11,"San Diego",null,"SAN DIEGO    CA","CA",984,1256,"San Diego","CA","CASANDIE.txt"]
[null,"920","\"California\"","CA","\"San Diego\"",null,11,"San Diego",null,"LONG BEACH    CA","CA",1201,1430,"San Diego","CA","CASANDIE.txt"]
[null,"921","\"California\"","CA","\"San Diego\"",null,11,"San Diego",null,"SAN DIEGO    CA","CA",984,1256,"San Diego","CA","CASANDIE.txt"]
[null,"922","\"California\"","CA","\"Palm Springs\"",null,14,"Palm Springs",null,"SAN DIEGO    CA","CA",984,1256,"San Diego","CA","CASANDIE.txt"]
[null,"923","\"California\"","CA","\"San Bern./Victorville/Redlands\"",null,32,"San Bern./Victorville/Redlands",null,"LAS VEGAS    NV","NV",3201,2407,"Las Vegas","NV","NVLASVEG.txt"]
[null,"924","\"California\"","CA","\"San Bernardino\"",null,16,"San Bernardino",null,"LOS ANGELES C.O.    CA","CA",1537,1154,"Los Angeles","CA","CALOSANG.txt"]
[null,"925","\"California\"","CA","\"Riverside\"",null,{"$f":"LEN(E842)","v":11},{"$f":"MID(E842,2,G842-2)","v":"Riverside"},null,"LOS ANGELES C.O.    CA","CA",1537,1154,"Los Angeles","CA","CALOSANG.txt"]
[null,"926","\"California\"","CA","\"Santa Ana\"",null,11,"Santa Ana",null,"LONG BEACH    CA","CA",1201,1430,"Los Angeles","CA","CALOSANG.txt"]
[null,"927","\"California\"","CA","\"Santa Ana\"",null,11,"Santa Ana",null,"LONG BEACH    CA","CA",1201,1430,"Los Angeles","CA","CALOSANG.txt"]
[null,"928","\"California\"","CA","\"Anaheim\"",null,9,"Anaheim",null,"LONG BEACH    CA","CA",1201,1430,"Los Angeles","CA","CALOSANG.txt"]
[null,"930","\"California\"","CA","\"Ventura/Oxnard\"",null,16,"Ventura/Oxnard",null,"BAKERSFIELD    CA","CA",2365,2182,"Los Angeles","CA","CALOSANG.txt"]
[null,"931","\"California\"","CA","\"Santa Barbara\"",null,15,"Santa Barbara",null,"SANTA BARBARA    CA","CA",289,2438,"Los Angeles","CA","CALOSANG.txt"]
[null,"932","\"California\"","CA","\"Bakersfield/Visalia\"",null,21,"Bakersfield/Visalia",null,"FRESNO    CA","CA",1967,2556,"Fresno","CA","CAFRESNO.txt"]
[null,"933","\"California\"","CA","\"Bakersfield\"",null,13,"Bakersfield",null,"BAKERSFIELD    CA","CA",2365,2182,"Fresno","CA","CAFRESNO.txt"]
[null,"934","\"California\"","CA","\"San Luis Obispo\"",null,17,"San Luis Obispo",null,"SANTA MARIA    CA","CA",169,2984,"Fresno","CA","CAFRESNO.txt"]
[null,"935","\"California\"","CA","\"Lancaster\"",null,11,"Lancaster",null,"BISHOP    CA","CA",1039,4310,"Reno","NV","NVRENO.txt"]
[null,"936","\"California\"","CA","\"Fresno\"",null,8,"Fresno",null,"FRESNO    CA","CA",1967,2556,"Fresno","CA","CAFRESNO.txt"]
[null,"937","\"California\"","CA","\"Fresno\"",null,8,"Fresno",null,"FRESNO    CA","CA",1967,2556,"Fresno","CA","CAFRESNO.txt"]
[null,"939","\"California\"","CA","\"Monterey\"",null,10,"Monterey",null,"SAN FRANCISCO C.O.    CA","CA",65,3005,"San Francisco","CA","CASANFRA.txt"]
[null,"940","\"California\"","CA","\"So. San Francisco\"",null,19,"So. San Francisco",null,"SAN FRANCISCO C.O.    CA","CA",65,3005,"San Francisco","CA","CASANFRA.txt"]
[null,"941","\"California\"","CA","\"San Francisco\"",null,15,"San Francisco",null,"SAN FRANCISCO C.O.    CA","CA",65,3005,"San Francisco","CA","CASANFRA.txt"]
[null,"942","\"California\"","CA","\"Sacramento/Placerville\"",null,24,"Sacramento/Placerville",null,"SAN FRANCISCO AP    CA","CA",145,3016,"Sacramento","CA","CASACRAM.txt"]
[null,"943","\"California\"","CA","\"Palo Alto\"",null,11,"Palo Alto",null,"SAN FRANCISCO AP    CA","CA",145,3016,"San Jose","CA","CASANJOS.txt"]
[null,"944","\"California\"","CA","\"San Mateo\"",null,11,"San Mateo",null,"SAN FRANCISCO AP    CA","CA",145,3016,"San Jose","CA","CASANJOS.txt"]
[null,"945","\"California\"","CA","\"Concord\"",null,9,"Concord",null,"SACRAMENTO    CA","CA",1237,2749,"Sacramento","CA","CASACRAM.txt"]
[null,"946","\"California\"","CA","\"Oakland\"",null,9,"Oakland",null,"SAN FRANCISCO AP    CA","CA",145,3016,"San Jose","CA","CASANJOS.txt"]
[null,"947","\"California\"","CA","\"Berkeley\"",null,10,"Berkeley",null,"SAN FRANCISCO AP    CA","CA",145,3016,"San Jose","CA","CASANJOS.txt"]
[null,"948","\"California\"","CA","\"Richmond\"",null,10,"Richmond",null,"SAN FRANCISCO AP    CA","CA",145,3016,"San Jose","CA","CASANJOS.txt"]
[null,"949","\"California\"","CA","\"San Rafael\"",null,12,"San Rafael",null,"SAN FRANCISCO AP    CA","CA",145,3016,"San Jose","CA","CASANJOS.txt"]
[null,"950","\"California\"","CA","\"Gilroy\"",null,8,"Gilroy",null,"SAN FRANCISCO AP    CA","CA",145,3016,"San Jose","CA","CASANJOS.txt"]
[null,"951","\"California\"","CA","\"San Jose\"",null,10,"San Jose",null,"SAN FRANCISCO AP    CA","CA",145,3016,"San Jose","CA","CASANJOS.txt"]
[null,"952","\"California\"","CA","\"Stockton\"",null,10,"Stockton",null,"STOCKTON    CA","CA",1470,2707,"Sacramento","CA","CASACRAM.txt"]
[null,"953","\"California\"","CA","\"Merced\"",null,8,"Merced",null,"SACRAMENTO    CA","CA",1237,2749,"Sacramento","CA","CASACRAM.txt"]
[null,"954","\"California\"","CA","\"Santa Rosa\"",null,12,"Santa Rosa",null,"SACRAMENTO    CA","CA",1237,2749,"Sacramento","CA","CASACRAM.txt"]
[null,"955","\"California\"","CA","\"Eureka\"",null,8,"Eureka",null,"EUREKA    CA","CA",725,4496,"Medford","OR","ORMEDFOR.txt"]
[null,"956","\"California\"","CA","\"Sacramento/Placerville\"",null,24,"Sacramento/Placerville",null,"SACRAMENTO    CA","CA",1237,2749,"Sacramento","CA","CASACRAM.txt"]
[null,"957","\"California\"","CA","\"Pollock Pines\"",null,15,"Pollock Pines",null,"RENO    NV","NV",508,5674,"Reno","NV","NVRENO.txt"]
[null,"958","\"California\"","CA","\"Sacramento\"",null,12,"Sacramento",null,"SACRAMENTO    CA","CA",1237,2749,"Sacramento","CA","CASACRAM.txt"]
[null,"959","\"California\"","CA","\"Marysville\"",null,12,"Marysville",null,"SACRAMENTO    CA","CA",1237,2749,"Sacramento","CA","CASACRAM.txt"]
[null,"960","\"California\"","CA","\"Redding\"",null,9,"Redding",null,"REDDING    CA","CA",1797,2855,"Sacramento","CA","CASACRAM.txt"]
[null,"961","\"California\"","CA","\"Susanville\"",null,12,"Susanville",null,"WINNEMUCCA    NV","NV",538,6315,"Sacramento","CA","CASACRAM.txt"]
[null,"967","\"Hawaii\"","HI","\"Honolulu\"",null,10,"Honolulu",null,"HILO    HI","HI",3284,0,"Honolulu","HI","HIHONOLU.txt"]
[null,"968","\"Hawaii\"","HI","\"Honolulu\"",null,10,"Honolulu",null,"HONOLULU    HI","HI",4474,0,"Honolulu","HI","HIHONOLU.txt"]
[null,969,"\"Guam\"","GU","\"Mangilao\"",null,10,"Mangilao",null,"GUAM    PC","PC",5034,0,"Honolulu","HI","HIHONOLU.txt"]
[null,"970","\"Oregon\"","OR","\"Hood River\"",null,12,"Hood River",null,"SALEM    OR","OR",247,4927,"Salem","OR","ORSALEM.txt"]
[null,"971","\"Oregon\"","OR","\"Portland\"",null,10,"Portland",null,"PORTLAND    OR","OR",371,4522,"Portland","OR","ORPORTLA.txt"]
[null,"972","\"Oregon\"","OR","\"Portland\"",null,10,"Portland",null,"PORTLAND    OR","OR",371,4522,"Portland","OR","ORPORTLA.txt"]
[null,"973","\"Oregon\"","OR","\"Salem\"",null,7,"Salem",null,"SALEM    OR","OR",247,4927,"Salem","OR","ORSALEM.txt"]
[null,"974","\"Oregon\"","OR","\"Eugene\"",null,8,"Eugene",null,"EUGENE    OR","OR",300,4546,"Eugene","OR","OREUGENE.txt"]
[null,"975","\"Oregon\"","OR","\"Medford\"",null,9,"Medford",null,"MEDFORD    OR","OR",725,4611,"Medford","OR","ORMEDFOR.txt"]
[null,"976","\"Oregon\"","OR","\"Klamath Falls\"",null,15,"Klamath Falls",null,"MEDFORD    OR","OR",725,4611,"Medford","OR","ORMEDFOR.txt"]
[null,"977","\"Oregon\"","OR","\"Bend\"",null,6,"Bend",null,"BURNS    OR","OR",202,7785,"Yakima","WA","WAYAKIMA.txt"]
[null,"978","\"Oregon\"","OR","\"Pendleton\"",null,11,"Pendleton",null,"PENDLETON    OR","OR",701,5294,"Yakima","WA","WAYAKIMA.txt"]
[null,"979","\"Oregon\"","OR","\"Ontario\"",null,9,"Ontario",null,"BOISE    ID","ID",754,5861,"Boise","ID","IDBOISE.txt"]
[null,"980","\"Washington\"","WA","\"Seattle\"",null,9,"Seattle",null,"SEATTLE C.O.    WA","WA",167,4611,"Seattle","WA","WASEATTL.txt"]
[null,"981","\"Washington\"","WA","\"Seattle\"",null,9,"Seattle",null,"SEATTLE C.O.    WA","WA",167,4611,"Seattle","WA","WASEATTL.txt"]
[null,"982","\"Washington\"","WA","\"Everett\"",null,9,"Everett",null,"QUILLAYUTE    WA","WA",6,5858,"Seattle","WA","WASEATTL.txt"]
[null,"983","\"Washington\"","WA","\"Tacoma\"",null,8,"Tacoma",null,"SEATTLE SEA-TAC AP    WA","WA",190,4908,"Seattle","WA","WASEATTL.txt"]
[null,"984","\"Washington\"","WA","\"Tacoma\"",null,8,"Tacoma",null,"SEATTLE SEA-TAC AP    WA","WA",190,4908,"Seattle","WA","WASEATTL.txt"]
[null,"985","\"Washington\"","WA","\"Olympia\"",null,9,"Olympia",null,"OLYMPIA    WA","WA",101,5655,"Seattle","WA","WASEATTL.txt"]
[null,"986","\"Washington\"","WA","\"Vancouver\"",null,11,"Vancouver",null,"PORTLAND    OR","OR",371,4522,"Portland","OR","ORPORTLA.txt"]
[null,"988","\"Washington\"","WA","\"Wenatchee\"",null,11,"Wenatchee",null,"YAKIMA    WA","WA",458,5967,"Yakima","WA","WAYAKIMA.txt"]
[null,"989","\"Washington\"","WA","\"Yakima\"",null,8,"Yakima",null,"YAKIMA    WA","WA",458,5967,"Yakima","WA","WAYAKIMA.txt"]
[null,"990","\"Washington\"","WA","\"Spokane\"",null,9,"Spokane",null,"SPOKANE    WA","WA",398,6842,"Spokane","WA","WASPOKAN.txt"]
[null,"991","\"Washington\"","WA","\"Spokane\"",null,9,"Spokane",null,"SPOKANE    WA","WA",398,6842,"Spokane","WA","WASPOKAN.txt"]
[null,"992","\"Washington\"","WA","\"Spokane\"",null,9,"Spokane",null,"SPOKANE    WA","WA",398,6842,"Spokane","WA","WASPOKAN.txt"]
[null,"993","\"Washington\"","WA","\"Richland\"",null,10,"Richland",null,"PENDLETON    OR","OR",701,5294,"Yakima","WA","WAYAKIMA.txt"]
[null,"994","\"Washington\"","WA","\"Clarkston\"",null,11,"Clarkston",null,"PENDLETON    OR","OR",701,5294,"Yakima","WA","WAYAKIMA.txt"]
[null,"995","\"Alaska\"","AK","\"Anchorage\"",null,11,"Anchorage",null,"ANCHORAGE    AK","AK",0,10570,"Anchorage","AK","AKANCHOR.txt"]
[null,"996","\"Alaska\"","AK","\"Anchorage\"",null,11,"Anchorage",null,"ANCHORAGE    AK","AK",0,10570,"Anchorage","AK","AKANCHOR.txt"]
[null,"997","\"Alaska\"","AK","\"Fairbanks\"",null,{"$f":"LEN(E906)","v":11},{"$f":"MID(E906,2,G906-2)","v":"Fairbanks"},null,"FAIRBANKS    AK","AK",84,13940,"Fairbanks","AK","AKFAIRBA.txt "]
[null,"998","\"Alaska\"","AK","\"Juneau\"",null,{"$f":"LEN(E907)","v":8},{"$f":"MID(E907,2,G907-2)","v":"Juneau"},null,"JUNEAU    AK","AK",0,8897,"Juneau","AK","AKJUNEAU.txt"]
[null,"999","\"Alaska\"","AK","\"Ketchikan\"",null,{"$f":"LEN(E908)","v":11},{"$f":"MID(E908,2,G908-2)","v":"Ketchikan"},null,"KING SALMON    AK","AK",0,11456,"Juneau","AK","AKJUNEAU.txt"]
[]
[]
[]
[null,"901 Unique Zip Codes",null,null,null,null,null,null,null,"242 Unique Climates",null,null,null,"159 IWIN - NCDC Sites"]

{"sheet":"DropDowns","index":18,"n_rows":105,"n_cols":78,"rows_kept":105,"cut":false,"hidden":true,"merged":[[5,8,5,9],[7,6,13,6]]}
[]
[null,"DropDowns"]
[]
[null,"General Project Info"]
[]
[null,"Range Name:",null,null,null,null,null,null,"Electric AC"]
[null,"Title:","HVACType","ElectricAC","HeatingType","WaterFuel",null,null,"Yes","No","LocalLaw87"]
[null,null,"Electric Heat - AC","Yes","Electric Resistance","Electric","Heating Type","Electric Resistance","Electric Heat - AC","Electric Heat - No AC","Yes"]
[null,null,"Electric Heat - No AC","No","Heat Pumps","Gas",null,"Heat Pumps","Heat Pump","Heat Pump","No"]
[null,null,"Gas Heat - AC","Partial","Gas","Oil",null,"Gas","Gas Heat - AC","Gas Heat - No AC","N/A - Project >50 Units"]
[null,null,"Gas Heat - No AC","Other","Oil","Propane",null,"Oil","Oil Heat - AC","Oil Heat - No AC"]
[null,null,"Oil Heat - AC",null,"Propane","Steam",null,"Propane","Propane Heat - AC","Propane Heat - No AC"]
[null,null,"Oil Heat - No AC",null,"Steam","Other",null,"Steam","District Steam Heat - AC","District Steam Heat - No AC"]
[null,null,"District Steam Heat - AC",null,"Dual Fuel",null,null,"Other","Other Heat - AC","Other Heat - No AC"]
[null,null,"District Steam Heat - No AC",null,"Other"]
[null,null,"Propane Heat - AC"]
[null,null,"Propane Heat - No AC"]
[null,null,"Other Heat - AC"]
[null,null,"Other Heat - No AC"]
[null,null,"Heat Pump"]
[]
[]
[null,"Existing Conditions"]
[]
[null,"Section:","Envelope","Windows","Windows","Windows","Windows","Windows","Windows","Windows","Exterior Doors","Exterior Doors","Exterior Doors","Air Infiltration","Motors Pumps Fans","Motors Pumps Fans","Motors Pumps Fans","Motors Pumps Fans","Motors Pumps Fans","Motors Pumps Fans","Heating Components","Heating Components","Heating Components","Heating Components","Heating Components","Heating Components","Heating Components","Heating Components","Heating Components","Heating Components","Heating Components","Heating Components","Heating Components","Heating Components","Heating Components","Cooling Components","Cooling Components","Cooling Components","Cooling Components","Cooling Components","Cooling Components","Cooling Components","DHW","DHW","DHW","DHW","DHW","DHW","DHW","DHW","DHW","DHW","DHW","DHW","DHW","DHW","Distribution","Distribution","Ventilation","Ventilation","Ventilation","Ventilation","Ventilation","Ventilation","Appliance","Appliance","Appliance","Appliance","Laundry","Laundry","Laundry","Laundry","Laundry","Elevators","Elevators","Elevators","Elevators","Heating/Cooling"]
[null,"Subsection:",{"$f":"COLUMN()","v":3},null,null,null,null,null,null,null,null,null,null,null,null,null,null,null,null,null,"Heating System","Heating System","Heating System","Heating System","Heating System","Heating System","Heating System","Heating System","Heating System","Heating System","Heating System","Heating System","Burner","End Use","End Use",null,null,null,null,null,null,null,null,null,null,null,null,null,null,null,null,null,null,null,null,null,null,null,null,null,null,null,null,null,null,null,null,null,null,null,null,null,null,null,null,null,null,"Temperature Measurements"]
[null,"Range Name:","DD_Envelope_VerificationMethod","DD_Windows_OperationType","DD_Windows_FramingMaterial","DD_Windows_ThermalBreak","DD_Windows_NumOfPanes","DD_Windows_GlassCoating","DD_Windows_GasFilled","DD_Windows_WeatherStripping","DD_ExteriorDoors_Material","DD_ExteriorDoors_GlazingType","DD_ExteriorDoors_WeatherStripping","DD_AirInfiltration_Tightness","DD_MotorsPumpsFans_EquipmentType","DD_MotorsPumpsFans_Type","DD_MotorsPumpsFans_Controls","DD_MotorsPumpsFans_CarDamper","DD_MotorsPumpsFans_CFMDataSource","DD_MotorsPumpsFans_NEMAPremium","DD_HeatingComponents_EquipmentType","DD_HeatingComponents_SpacesServed","DD_HeatingComponents_EStar","DD_HeatingComponents_FuelSource","DD_HeatingComponents_RatedEfficiencyUnits","DD_HeatingComponents_VentingType","DD_HeatingComponents_HeatTimer","DD_HeatingComponents_EnergyMgtSystem","DD_HeatingComponents_OutdoorAirReset","DD_HeatingComponents_NightSetback","DD_HeatingComponents_SequencingControls","DD_HeatingComponents_Aquastat","DD_HeatingComponents_Burner_EquipmentType","DD_HeatingComponents_EndUse_EquipmentType","DD_HeatingComponents_EndUse_Controls","DD_CoolingComponents_EquipmentType","DD_CoolingComponents_SpacesServed","DD_CoolingComponents_EStar","DD_CoolingComponents_FuelSource","DD_CoolingComponents_RatedEfficiencyUnit","DD_CoolingComponents_Controls","DD_CoolingComponents_Ownership","DD_DHW_DHWfromSpaceHeatingBoiler","DD_DHW_ExternalHeatExchanger","DD_DHW_TanklessCoil","DD_DHW_MixingValve","DD_DHW_RecirculationPump","DD_DHW_StorageTank","DD_DHW_HeatingElementonStorageTank","DD_DHW_StorageTankInsulated","DD_DHW_SpacesServed","DD_DHW_EStar","DD_DHW_FuelSource","DD_DHW_RatedEfficiencyUnits","DD_DHW_VentingType","DD_DHW_Controls","DD_Distribution_CentralDistributionTypeHeat","DD_Distribution_CentralDistributionTypeCooling","DD_Ventilation_SystemType","DD_Ventilation_LocationofEquipment","DD_Ventilation_Estar","DD_Ventilation_ConditionedSupply","DD_Ventilation_DuctLeakiness","DD_Ventilation_SystemOperational","DD_Appliance_LocationofEquipment","DD_Appliance_EStar","DD_Appliance_EStarNA","DD_Appliance_FuelSource","DD_Laundry_Style","DD_Laundry_EStar","DD_Laundry_FuelSource","DD_Laundry_CommonAreaLaundryOwnership","DD_Laundry_ApartmentLaundryOwnership","DD_Elevators_ElevatorType","DD_Elevators_MotorType","DD_Elevators_ControlType","DD_Elevators_MERCooling","DD_HeatCool_TempMeas"]
[null,"Title:","Verification Method","Operation Type","Framing Material","Thermal Break","# of Panes","Glass Coating","Gas Filled","Weather-stripping","Material","Glazing Type","Weather-stripping","Tightness","Equipment Type","Type","Controls","Car Damper?","CFM Data Source","NEMA Premium?","Equipment Type","Spaces Served","EStar","Fuel Source","Rated Efficiency (units)","Venting Type","Heat Timer","Energy Mgt. System (EMS)","Outdoor Air Reset","Night Setback","Sequencing Controls","Aquastat/Pressuretrol","Equipment Type","Equipment Type","Controls","Equipment Type","Spaces Served","EStar","Fuel Source","Rated Efficiency Unit","Controls","Ownership","DHW from Space Heating Boiler?","External Heat Exchanger?","Tankless Coil?","Mixing Valve","Recirculation Pump","Storage Tank?","Heating Element on Storage Tank?","Storage Tank Insulated?","Spaces Served","EStar","Fuel Source","Rated Efficiency (Units)","Venting Type","Controls","Central Distribution Type - Heat","Central Distribution Type - Cooling","System Type","Location of Equipment","EStar?","Conditioned Supply?","Duct Leakiness","System Operational?","Location of Equipment","EStar","Estar N/A","Fuel Source","Style","EStar","Fuel Source","Common Area Laundry Ownership","Apartment Laundry Ownership","Elevator Type","Motor Type","Control Type","MER Cooling","System Operational?"]
[null,null,"Estimated","Awning","Aluminum","Yes","Single","Heat Absorbing Tints","Yes","Excellent","Solid Wood","Single Pane","Excellent","Low leakage","Motor","Single Speed","Demand Control","Yes","Tested","Yes","Hot Water Boiler","Entire Building","Yes","Natural Gas","AFUE","Condensing","Yes","Yes","Yes","Yes","Yes","Yes","Full Modulation - Set to Manual","Baseboard","TRV","Absorption Chiller - 1 Stage","Entire Building","Yes","Natural Gas","SEER","Thermostat","Resident Owned","Yes - Year Round","Yes","Yes","Yes - Thermostatic","Yes","Yes","Yes","Yes","Whole Building","Yes","Natural Gas","AFUE","Condensing","N/A","Electric","Chilled Water","Centralized","Rooftop","Yes","Yes - MAU","Extremely Leaky","Yes","Commercial Kitchen","Yes","Yes","Natural Gas","Front-loading","Yes","Natural Gas","Building Owned","Resident Owned","Hydraulic","AC","Electronic","Fixed Louvers","Heating"]
[null,null,"Reported by Site Staff","Casement","Wood","No","Single w/ Storms","Reflective Coating","No","Good","Solid Metal","Double Pane","Fair","Some Leakage","Pump","Variable Speed","Timer","No","Mfr. Calcs.","No","Steam Boiler","Common Spaces","No","Oil ","Et","Near-Condensing","No","No","No","No","No","No","Full Modulation - Set to Modulate","Radiator","Thermostat","Absorption Chiller - 2 Stage","Common Spaces","No","Oil ","EER","Programmable Thermostat","Building Owned","Yes - Heating Season Only","No","No","Yes - Motorized","No","No","No","No","Apartments Only","No","Oil ","Et","Near Condensing","Timer","Forced Air","Forced Air","Individual","In-unit","No ","Yes - ERV/HRV","Moderately Leaky","No","Common Area Kitchen","No","No","Electric","Top-Loading","No","Electric","Leased","Building Owned","Traction","AC w/ VVVF","Mechanical","Mechanical Louvers","Cooling"]
[null,null,"From Drawings","Fixed","Fiberglass",null,"Double","Low-E Coating",null,"Poor","Hollow Wood","Other","Poor","Very Leaky","Fan","ECM","In-Unit Switch","N/A","Drawings","N/A","Electric Resistance ","Apartments","N/A","Dual Fuel","HSPF","Forced Draft","N/A","N/A","N/A","N/A","N/A","N/A","Hi-Lo Operation","Fan Coil","Programmable Thermostat","Gas Engine Chiller","Apartments","N/A","Dual Fuel","COP","Energy Management System (EMS)","Other","No","N/A","N/A","No","N/A","N/A","N/A","N/A","Common Area Only","N/A","Dual Fuel","Energy Factor","Forced Draft","Demand","Hydronic","N/A",null,"Basement","N/A","Yes - Economizer","Minimally Leaky","Yes, but not used","Common Area, Other","Unknown","Unknown","Propane","N/A","Unknown","Propane",null,"Leased",null,"DC w/ MG Set (no timer)",null,"Window AC","Neither"]
[null,null,"Confirmed","Hopper","Vinyl",null,"Triple","None",null,"None","Hollow Metal","N/A","None","N/A",null,"Other","Aquastat",null,"Other",null,"Air Source Heat Pump","Other",null,"District Steam","COP","Atmospheric",null,null,null,null,null,null,"On/Off","Duct","On/Off Valve","Electric Chiller","Other",null,"District Steam",null,"Chilled Water Temperature Sensor",null,null,null,null,"N/A",null,null,null,null,"Laundry Only",null,"District Steam","N/A","Atmospheric","Aquastat","1-pipe Steam",null,null,"Other",null,"No","N/A",null,null,null,"N/A",null,null,null,null,null,null,null,"DC w/ MG set (w/ timer)",null,"Other"]
[null,null,null,"Single Hung","Other",null,null,"Unknown",null,null,"Wood, Insulated Core",null,"N/A",null,null,null,"Temperature Modulation",null,null,null,"Ground Source Heat Pump",null,null,"Electric",null,"N/A",null,null,null,null,null,null,"N/A","Radiant Floor","Fan Speed Control","Window A/C",null,null,"Electric",null,null,null,null,null,null,null,null,null,null,null,"Apartments & Laundry",null,"Electric",null,"N/A","None","2-pipe Steam",null,null,null,null,null,null,null,null,null,null,null,null,null,null,null,null,null,"DC w/SCR Drive"]
[null,null,null,"Double Hung",null,null,null,"Other",null,null,"Metal, Insulated Core",null,null,null,null,null,"VFD",null,null,null,"Water Source Heat Pump",null,null,"Propane",null,null,null,null,null,null,null,null,null,"PTAC","None","Through Wall A/C",null,null,"Propane",null,null,null,null,null,null,null,null,null,null,null,"Common Area & Laundry",null,"Propane",null,null,null,"Vacuum Steam"]
[null,null,null,"Single Sliding",null,null,null,null,null,null,"Glass",null,null,null,null,null,"VAV",null,null,null,"Furnace",null,null,"Other",null,null,null,null,null,null,null,null,null,"Other",null,"PTAC",null,null,"Other",null,null,null,null,null,null,null,null,null,null,null,null,null,"Other"]
[null,null,null,"Double Sliding",null,null,null,null,null,null,"Glass Slider",null,null,null,null,null,"Other",null,null,null,"Combined Heat and Power",null,null,null,null,null,null,null,null,null,null,null,null,null,null,"Ductless Mini Split System",null,null,null,null,null,null,null,null,null,null,null,null,null,null,null,null,"N/A"]
[null,null,null,"Other",null,null,null,null,null,null,"Other",null,null,null,null,null,"None",null,null,null,"Other",null,null,null,null,null,null,null,null,null,null,null,null,null,null,"Split System Central Air"]
[null,null,null,null,null,null,null,null,null,null,null,null,null,null,null,null,null,null,null,null,null,null,null,null,null,null,null,null,null,null,null,null,null,null,null,"Other"]
[]
[]
[]
[]
[null,null,"FuelType","YN","HousingType","ReqMeasures","EEPSFunding","NonEEPSFunding","MeasureSplit","FurnaceTypes","ChillerTypes","ACTypes","BallastType","LightingControls","UnitTypes","UtilResp","MeterType","SavingsAccrue","MeasureCategory","Appliance","DHW","Envelope","Heating_Cooling","Lighting","Motors","Ventilation","Renewables","Other","County"]
[null,null,"Natural Gas","Yes","<Select One>","Evaluated & Recommended","MPPMREINC","RGGIMPP","<Select One>","<Select One>","<Select One>","<Select One>","Magnetic","None","Studio","Owner","Individual","Building","Appliance","Dishwasher, Install Energy Star","Controls","Air Sealing","Boiler, Replace (Central)","Exterior Lighting, Upgrade","Elevator Motors and Controls, Upgrade","Constant Air Regulators, Install","CHP","Other","Albany"]
[null,null,"Fuel Oil","No","Market-Rate Housing","Evaluated & Not Recommended","MPPLIEINC","RGGIMPPLI","Measure Cost","90 AFUE","Air Cooled, Reciprocal/Screw","SEER 14","Electronic","Switch","1-Bedroom","Resident","Master","Tenants","DHW","Gas-fired Dryers, Replace Electric","Low-flow Devices","Exterior Doors, Replace","Boiler, Replace (In-Unit)","High Efficiency Fluorescent, Apt, Install","Exhaust Fans, Replace","Duct Sealing","Photovoltaic System","Submetering","Allegany"]
[null,null,"Steam",null,"Affordable Housing","Not Evaluated","MPPMRGINC","Owner - Gas","Measure Savings","92 AFUE","Water Cooled Recriprocal","SEER 15","N/A","Occ Sensor","2-Bedroom",null,null,null,"Envelope","Other Appliances, Install Energy Star","Other DHW Measure","Insulation, Above Grade Walls","Boiler/Burner Clean and Tune","High Efficiency Fluorescent, CA, Install","Motors, Install NEMA Premium Efficiency","Exhaust Fan Demand Control","Solar Hot Water",null,"Bronx"]
[null,null,"Propane",null,null,null,"MPPLIGINC","Owner - Electric",null,"94 AFUE","Water Cooled Screw, <150 ton","SEER 16",null,"Vac Sensor","3-Bedroom",null,null,null,"Heating/Cooling","Refrigerators, install Energy Star","Piping, DHW, Insulate","Insulation, Below Grade Walls","Burner, Replace","LED Exit Signs","Other Motor Measure","Fan/Air Handlers, Upgrade","Wind Turbine",null,"Broome"]
[null,null,{"$f":"'Utility Info'!$B$19","v":"Select Other Fuel Type…"},null,null,null,null,"Other",null,"96 AFUE","Water Cooled Screw, 150-300 ton","SEER 17",null,"Photocell","4+ Bedroom",null,null,null,"Lighting","Washing Machines, Install Energy Star","Replace DHW Heater (Central)","Insulation, Other Shell","Central AC/HP","LED Fixtures & Screw-Ins","Pumps, Upgrade","Heat/Energy Recovery",null,null,"Cattaraugus"]
[null,null,null,null,null,null,null,null,null,null,"Water Cooled Screw, >300 ton","SEER 18",null,"Timer",null,null,null,null,"Motors",null,"Replace DHW Heater (In-Unit)","Insulation, Roof Deck or Attic","Chiller, Replace","Other Lighting Measure","Var. Speed Drive","Other Ventilation Measure",null,null,"Cayuga"]
[null,null,null,null,null,null,null,null,null,null,"Water Cooled Centrifugal, <150 ton",null,null,"Other",null,null,null,null,"Renewables",null,"Replace DHW Indirect-fired Heater","Insulation, Slab","Distribution System, Upgrade","Timers/Sensors, Install",null,"Ventilation Central Controls",null,null,"Chautauqua"]
[null,null,null,null,null,null,null,null,null,null,"Water Cooled Centrifugal, 150-300 ton",null,null,null,null,null,null,null,"Ventilation",null,null,"Smoke-Driven Louver, Install","Economizer, Install",null,null,null,null,null,"Chemung"]
[null,null,null,null,null,null,null,null,null,null,"Water Cooled Centrifugal, >300 ton",null,null,null,null,null,null,null,"Other",null,null,"Vertical Shafts, Seal","Energy Management System (EMS), Install",null,null,null,null,null,"Chenango"]
[null,null,null,null,null,null,null,null,null,null,null,null,null,null,null,null,null,null,null,null,null,"Windows, Replace","Furnace, Replace",null,null,null,null,null,"Clinton"]
[null,null,null,null,null,null,null,null,null,null,null,null,null,null,null,null,null,null,null,null,null,"Windows, Weatherstrip or Airseal","Geothermal Heat Pump",null,null,null,null,null,"Columbia"]
[null,null,null,null,null,null,null,null,null,null,null,null,null,null,null,null,null,null,null,null,null,null,"Other Cooling Measure",null,null,null,null,null,"Cortland"]
[null,null,null,null,null,null,null,null,null,null,null,null,null,null,null,null,null,null,null,null,null,null,"Other Heating Measure",null,null,null,null,null,"Delaware"]
[null,null,null,null,null,null,null,null,null,null,null,null,null,null,null,null,null,null,null,null,null,null,"Outdoor Reset Control, Install",null,null,null,null,null,"Dutchess"]
[null,null,null,null,null,null,null,null,null,null,null,null,null,null,null,null,null,null,null,null,null,null,"Piping, Heating, Insulate",null,null,null,null,null,"Erie"]
[null,null,null,null,null,null,null,null,null,null,null,null,null,null,null,null,null,null,null,null,null,null,"Programmable Thermostats, Common Area",null,null,null,null,null,"Essex"]
[null,null,null,null,null,null,null,null,null,null,null,null,null,null,null,null,null,null,null,null,null,null,"Split System AC/HP",null,null,null,null,null,"Franklin"]
[null,null,null,null,null,null,null,null,null,null,null,null,null,null,null,null,null,null,null,null,null,null,"Steam Traps, Replace",null,null,null,null,null,"Fulton"]
[null,null,null,null,null,null,null,null,null,null,null,null,null,null,null,null,null,null,null,null,null,null,"Thermostatic Radiator Valves, install",null,null,null,null,null,"Genesee"]
[null,null,null,null,null,null,null,null,null,null,null,null,null,null,null,null,null,null,null,null,null,null,"Water Source AC/HP",null,null,null,null,null,"Greene"]
[null,null,null,null,null,null,null,null,null,null,null,null,null,null,null,null,null,null,null,null,null,null,"Window Air Conditioners, Install",null,null,null,null,null,"Hamilton"]
[null,null,null,null,null,null,null,null,null,null,null,null,null,null,null,null,null,null,null,null,null,null,null,null,null,null,null,null,"Herkimer"]
[null,null,null,null,null,null,null,null,null,null,null,null,null,null,null,null,null,null,null,null,null,null,null,null,null,null,null,null,"Jefferson"]
[null,null,null,null,null,null,null,null,null,null,null,null,null,null,null,null,null,null,null,null,null,null,null,null,null,null,null,null,"Kings"]
[null,null,null,null,null,null,null,null,null,null,null,null,null,null,null,null,null,null,null,null,null,null,null,null,null,null,null,null,"Lewis"]
[null,null,null,null,null,null,null,null,null,null,null,null,null,null,null,null,null,null,null,null,null,null,null,null,null,null,null,null,"Livingston"]
[null,null,null,null,null,null,null,null,null,null,null,null,null,null,null,null,null,null,null,null,null,null,null,null,null,null,null,null,"Madison"]
[null,null,null,null,null,null,null,null,null,null,null,null,null,null,null,null,null,null,null,null,null,null,null,null,null,null,null,null,"Monroe"]
[null,null,null,null,null,null,null,null,null,null,null,null,null,null,null,null,null,null,null,null,null,null,null,null,null,null,null,null,"Montgomery"]
[null,null,null,null,null,null,null,null,null,null,null,null,null,null,null,null,null,null,null,null,null,null,null,null,null,null,null,null,"Nassau"]
[null,null,null,null,null,null,null,null,null,null,null,null,null,null,null,null,null,null,null,null,null,null,null,null,null,null,null,null,"New York"]
[null,null,null,null,null,null,null,null,null,null,null,null,null,null,null,null,null,null,null,null,null,null,null,null,null,null,null,null,"Niagara"]
[null,null,null,null,null,null,null,null,null,null,null,null,null,null,null,null,null,null,null,null,null,null,null,null,null,null,null,null,"Oneida"]
[null,null,null,null,null,null,null,null,null,null,null,null,null,null,null,null,null,null,null,null,null,null,null,null,null,null,null,null,"Onondaga"]
[null,null,null,null,null,null,null,null,null,null,null,null,null,null,null,null,null,null,null,null,null,null,null,null,null,null,null,null,"Ontario"]
[null,null,null,null,null,null,null,null,null,null,null,null,null,null,null,null,null,null,null,null,null,null,null,null,null,null,null,null,"Orange"]
[null,null,null,null,null,null,null,null,null,null,null,null,null,null,null,null,null,null,null,null,null,null,null,null,null,null,null,null,"Orleans"]
[null,null,null,null,null,null,null,null,null,null,null,null,null,null,null,null,null,null,null,null,null,null,null,null,null,null,null,null,"Oswego"]
[null,null,null,null,null,null,null,null,null,null,null,null,null,null,null,null,null,null,null,null,null,null,null,null,null,null,null,null,"Otsego"]
[null,null,null,null,null,null,null,null,null,null,null,null,null,null,null,null,null,null,null,null,null,null,null,null,null,null,null,null,"Putnam"]
[null,null,null,null,null,null,null,null,null,null,null,null,null,null,null,null,null,null,null,null,null,null,null,null,null,null,null,null,"Queens"]
[null,null,null,null,null,null,null,null,null,null,null,null,null,null,null,null,null,null,null,null,null,null,null,null,null,null,null,null,"Rensselaer"]
[null,null,null,null,null,null,null,null,null,null,null,null,null,null,null,null,null,null,null,null,null,null,null,null,null,null,null,null,"Richmond"]
[null,null,null,null,null,null,null,null,null,null,null,null,null,null,null,null,null,null,null,null,null,null,null,null,null,null,null,null,"Rockland"]
[null,null,null,null,null,null,null,null,null,null,null,null,null,null,null,null,null,null,null,null,null,null,null,null,null,null,null,null,"Saratoga"]
[null,null,null,null,null,null,null,null,null,null,null,null,null,null,null,null,null,null,null,null,null,null,null,null,null,null,null,null,"Schenectady"]
[null,null,null,null,null,null,null,null,null,null,null,null,null,null,null,null,null,null,null,null,null,null,null,null,null,null,null,null,"Schoharie"]
[null,null,null,null,null,null,null,null,null,null,null,null,null,null,null,null,null,null,null,null,null,null,null,null,null,null,null,null,"Schuyler"]
[null,null,null,null,null,null,null,null,null,null,null,null,null,null,null,null,null,null,null,null,null,null,null,null,null,null,null,null,"Seneca"]
[null,null,null,null,null,null,null,null,null,null,null,null,null,null,null,null,null,null,null,null,null,null,null,null,null,null,null,null,"St. Lawrence"]
[null,null,null,null,null,null,null,null,null,null,null,null,null,null,null,null,null,null,null,null,null,null,null,null,null,null,null,null,"Steuben"]
[null,null,null,null,null,null,null,null,null,null,null,null,null,null,null,null,null,null,null,null,null,null,null,null,null,null,null,null,"Suffolk"]
[null,null,null,null,null,null,null,null,null,null,null,null,null,null,null,null,null,null,null,null,null,null,null,null,null,null,null,null,"Sullivan"]
[null,null,null,null,null,null,null,null,null,null,null,null,null,null,null,null,null,null,null,null,null,null,null,null,null,null,null,null,"Tioga"]
[null,null,null,null,null,null,null,null,null,null,null,null,null,null,null,null,null,null,null,null,null,null,null,null,null,null,null,null,"Tompkins"]
[null,null,null,null,null,null,null,null,null,null,null,null,null,null,null,null,null,null,null,null,null,null,null,null,null,null,null,null,"Ulster"]
[null,null,null,null,null,null,null,null,null,null,null,null,null,null,null,null,null,null,null,null,null,null,null,null,null,null,null,null,"Warren"]
[null,null,null,null,null,null,null,null,null,null,null,null,null,null,null,null,null,null,null,null,null,null,null,null,null,null,null,null,"Washington"]
[null,null,null,null,null,null,null,null,null,null,null,null,null,null,null,null,null,null,null,null,null,null,null,null,null,null,null,null,"Wayne"]
[null,null,null,null,null,null,null,null,null,null,null,null,null,null,null,null,null,null,null,null,null,null,null,null,null,null,null,null,"Westchester"]
[null,null,null,null,null,null,null,null,null,null,null,null,null,null,null,null,null,null,null,null,null,null,null,null,null,null,null,null,"Wyoming"]
[null,null,null,null,null,null,null,null,null,null,null,null,null,null,null,null,null,null,null,null,null,null,null,null,null,null,null,null,"Yates"]

{"sheet":"Incentives","index":19,"n_rows":40,"n_cols":6,"rows_kept":40,"cut":false,"hidden":true,"merged":[[12,1,13,5],[25,1,26,5],[15,2,15,5],[2,2,2,5]]}
[null,"Program Incentives for MPP Existing Buildings - Comprehensive Approach"]
[]
[null,null,"Table 4-2: Incentive Payment Schedule (50 Units or Fewer)"]
[null,null,"Stage 1","Stage 2","Stage 3","Stage 4"]
[null,null,"Analysis","Construction Management","Construction Complete","Performance Payment"]
[null,null,"(per unit)","(per unit)","(per unit)","(per unit)"]
["Lookup Value %","Source Energy Savings %"]
[0,"0%-19%",0,0,0,0]
[0.19500000000000001,"20%-24%",100,200,300,100]
[0.245,"25%-29%",100,250,350,100]
[0.29499999999999998,"30%-34%",100,300,400,200]
[0.34499999999999997,"35%+",100,400,500,500]
[null,"TABLE 4-2: INCENTIVE PAYMENT SCHEDULE FOR PROJECTS WITH 50 UNITS OR LESS AND NOT SUBJECT TO LOCAL LAW 84 IN NEW YORK CITY"]
[]
[]
[null,null,"Table 4-3: Incentive Payment Schedule (More Than 50 Units)"]
[null,null,"Stage 1","Stage 2","Stage 3","Stage 4"]
[null,null,"Analysis","Construction Management","Construction Complete","Performance Payment"]
[null,null,"(per unit)","(per unit)","(per unit)","(per unit)"]
["Lookup Value %","Source Energy Savings %"]
[0,"0%-19%",0,0,0,0]
[0.19500000000000001,"20%-24%",0,300,300,100]
[0.245,"25%-29%",0,350,350,100]
[0.29499999999999998,"30%-34%",0,400,400,200]
[0.34499999999999997,"35%+",0,500,500,500]
[null,"TABLE 4-3: INCENTIVE PAYMENT SCHEDULE FOR PROJECTS WITH MORE THAN 50 UNITS OR SUBJECT TO LOCAL LAW 84 IN NEW YORK CITY"]
[]
[]
[null,"Project Data"]
[null,"# of Units",{"$f":"'General Project Info'!C40","v":0}]
[null,"Projected Savings",{"$f":"IFERROR(IF('Measure Summary'!U41=0,0,'Measure Summary'!U41),0)","v":0}]
[]
[null,"Incentive Calculations"]
[null,null,"Total"]
[null,"Maximum Incentive"]
[null,"Analysis",{"$f":"IF(C$31<0,0,$C$30*VLOOKUP($C$31,IF(OR(C30>50,'General Project Info'!$C$24=\"Yes\")=TRUE,IncentiveTable43,IncentiveTable42),3,TRUE))","v":0}]
[null,"Construction Management",{"$f":"IF(C$31<0,0,$C$30*VLOOKUP($C$31,IF(OR(C30>50,'General Project Info'!$C$24=\"Yes\")=TRUE,IncentiveTable43,IncentiveTable42),4,TRUE))","v":0}]
[null,"Construction Complete",{"$f":"IF(C$31<0,0,$C$30*VLOOKUP($C$31,IF(OR(C30>50,'General Project Info'!$C$24=\"Yes\")=TRUE,IncentiveTable43,IncentiveTable42),5,TRUE))","v":0}]
[null,"Performance",{"$f":"IF(C$31<0,0,$C$30*VLOOKUP($C$31,IF(OR(C30>50,'General Project Info'!$C$24=\"Yes\")=TRUE,IncentiveTable43,IncentiveTable42),6,TRUE))","v":0}]
[null,"Total",{"$f":"SUM(C36:C39)","v":0}]

{"sheet":"Version Tracking","index":20,"n_rows":6,"n_cols":4,"rows_kept":6,"cut":false,"hidden":true,"merged":[]}
[]
[]
[]
[null,"Version Number","Release Date","Notes"]
[null,"V 7.0","2016-05-16","1. Original release."]
[null,"V 8.0","2017-08-24","1. Updated Incentive Schedules\n2. Added Analysis Payment\n3. Updated measure QC flags"]