{"text_format":"1","workbook":"xlsx","n_sheets":6,"sheets":["INSTRUCTIONS","CSC Certification Requirements","Community Summary","Tracking Checklist","Submittal Form","1.2 Example Submittal Form"],"not_rendered":{"charts":0,"images":13,"macros":1,"external_links":0,"defined_names":8,"comments":0,"pivot_tables":0},"unopened":[],"bounds":{"document_bytes":16777216,"sheet_cells":100000,"rows_first":2000,"rows_last":500,"rows_between":2000,"halvings":0,"cell_chars":16384,"cell_head_chars":4096},"cells_cut":0,"cells_raw":0,"read":"whole","date_system":"1900"}

{"sheet":"INSTRUCTIONS","index":0,"n_rows":52,"n_cols":6,"rows_kept":52,"cut":false,"hidden":false,"merged":[[45,1,45,12],[46,1,46,10],[48,0,48,12],[51,0,51,12],[30,2,30,10],[31,2,31,10],[32,2,32,10],[35,0,35,12],[40,0,40,12],[43,0,43,12],[29,2,29,10],[12,5,12,8],[13,5,13,8],[14,5,14,10],[16,5,16,10],[17,5,17,8],[18,5,18,9],[20,0,20,12],[23,0,23,12],[26,2,26,10],[27,2,27,10],[28,2,28,10],[11,5,11,8],[6,5,6,10],[7,5,7,11],[8,5,8,8],[9,5,9,8],[10,5,10,8]]}
[]
["Climate Smart Communities (CSC) Certification Program Overview"]
[]
[]
["CSC Certification Workbook",null,null,null,null,"TABLE OF CONTENTS"]
[]
[null,null,null,null,null,"Summary of CSC Certification Requirements "]
[null,null,null,null,null,"CSC Certification Summary - Anticipated Points by Pledge Element"]
[null,null,null,null,null,"Tracking Checklist"]
[null,null,null,null,null,"Step 1: Self-Assessment"]
[null,null,null,null,null,"Step 2: Collect Documentation"]
[null,null,null,null,null,"Step 3: Estimate Points"]
[null,null,null,null,null,"Submittal Form "]
[null,null,null,null,null,"Example: Action 1.2"]
[null,null,null,null,null,"Instructions for Applying for CSC Certification"]
[]
[null,null,null,null,null,"Additional Resources"]
[null,null,null,null,null,"CSC Certification Manual"]
[null,null,null,null,null,"CSC Certification: First Steps Guide"]
[]
{"$rows_left_out":33}
{"sheet":"CSC Certification Requirements","index":1,"n_rows":15,"n_cols":7,"rows_kept":15,"cut":false,"hidden":false,"merged":[[13,1,13,6],[8,0,8,6]]}
["Climate Smart Community Certification Requirements"]
["Rating Level","Description","Minimum Points","Minimum Pledge Elements","Required Priority Actions","Minimum Additional* Priority Actions","Minimum Performance/ Innovation Points"]
["Registered Climate Smart Community","Local governments are recognized as being registered with the program upon signing the CSC pledge.","N/A","PE1","Action 1.1","N/A",0]
["CERTIFIED","The initial level of certification, for local governments which have demonstrated a commitment toward climate protection and have taken the initial steps in establishing climate smart policies. ","120 points achieved","PE1, PE2, PE3, plus 2 more PEs completed","Actions 1.1, 1.3","4 of 13","0 points"]
["BRONZE","The second level of certification, for local governments that have made a commitment and begun to take action. ","250 points","PE1, PE2, PE3, plus 4 more PEs completed","Actions 1.1, 1.3","6 of 13","5 points"]
["SILVER","The third level of certification, for local governments that have implemented a broad variety of climate protection actions for both government operations and the community. ","350 points","PE1, PE2, PE3, plus 5 more PEs completed","Actions 1.1, 1.3","11 of 13","10 points"]
["GOLD","The highest level of certification, for local governments that have successfully taken action to address all pledge elements and can demonstrate tangible reductions in GHG emissions.  ","450 points","All PEs completed","Actions 1.1, 1.3","11 of 13","20 points"]
[]
["*Additional Priority actions include: 1.2, 1.4, 2.1, 2.2, 2.3, 2.4, 2.5, 2.6, 3.1, 7.1, and 7.3."]
["Definitions"]
["Minimum Points","Applicants must earn at least the specified number of points for the rating level, along with achieving the other criteria listed."]
["Minimum Pledge Elements","Applicants must complete at least one action in each of the specified Pledge Elements."]
["Required Priority Actions","Applicants must complete the required priority actions for each rating level."]
["Minimum Additional Priority Actions","Applicants may select which additional priority actions to complete, and must achieve at least the minimum specified for each rating level. *Additional Priority actions include: 1.2, 1.4, 2.1, 2.2, 2.3, 2.4, 2.5, 2.6, 3.1, 7.1, and 7.3."]
["Minimum Performance/ Innovation Points","Applicants must achieve at least the specified number of performance or innovation points."]

{"sheet":"Community Summary","index":2,"n_rows":26,"n_cols":8,"rows_kept":26,"cut":false,"hidden":false,"merged":[[1,1,1,2]]}
[null,"CSC CERTIFICATION SUMMARY"]
[null,"Choose your achievement level to view requirements è",null,"CERTIFIED"]
[]
[null,"Enter name of your local government here","SUMMARY",{"$f":"D2","v":"CERTIFIED"},"REQUIREMENTS"]
[null,"Total Points Anticipated",{"$f":"F26","v":0},{"$f":"VLOOKUP($D$4,'CSC Certification Requirements'!$A$4:$G$7, 3,)","v":"120 points achieved"}]
[null,"Pledge Elements Completed",{"$f":"COUNTIF(F14:F23,\">0\")","v":0},{"$f":"VLOOKUP($D$4,'CSC Certification Requirements'!$A$4:$G$7, 4,)","v":"PE1, PE2, PE3, plus 2 more PEs completed"}]
[null,"Actions Completed",{"$f":"COUNTIF('Tracking Checklist'!G5:G184,\"Completed\")","v":0},{"$f":"'CSC Certification Requirements'!B12","v":"Applicants must complete at least one action in each of the specified Pledge Elements."}]
[null,"Required Priority Actions Completed",{"$f":"COUNTIFS('Tracking Checklist'!A6:A119,'Tracking Checklist'!A6,'Tracking Checklist'!G6:G119,\"Completed\")","v":0},{"$f":"VLOOKUP($D$4,'CSC Certification Requirements'!$A$4:$G$7, 5,)","v":"Actions 1.1, 1.3"}]
[null,"Performance/Innovation Points Anticipated",{"$f":"SUM(F24:F25)","v":0},{"$f":"VLOOKUP($D$4,'CSC Certification Requirements'!$A$4:$G$7, 7,)","v":"0 points"}]
[]
[null,"Points by Pledge Element"]
[]
[null,"Pledge Element","Possible Points","Percent of Total Points",null,"Anticipated Points",null,"Awarded Points"]
[null,"Pledge Element 1: Pledge to Combat Climate Change by Becoming a Climate Smart Community",{"$f":"'Tracking Checklist'!L5","v":31},{"$f":"C14/$C$26","v":3.5347776510832381E-2},null,{"$f":"'Tracking Checklist'!O5","v":0},null,{"$f":"'Tracking Checklist'!Q5","v":0}]
[null,"Pledge Element 2: Set Goals, Inventory Emissions, Develop a Plan",{"$f":"'Tracking Checklist'!L11","v":40},{"$f":"C15/$C$26","v":4.5610034207525657E-2},null,{"$f":"'Tracking Checklist'!O11","v":0},null,{"$f":"'Tracking Checklist'!Q11","v":0}]
[null,"Pledge Element 3: Decrease Energy Demand from Local Government Operations",{"$f":"'Tracking Checklist'!L21","v":138},{"$f":"C16/$C$26","v":0.15735461801596351},null,{"$f":"'Tracking Checklist'!O21","v":0},null,{"$f":"'Tracking Checklist'!Q21","v":0}]
[null,"Pledge Element 4: Encourage Renewable Energy for Local Government Operations",{"$f":"'Tracking Checklist'!L61","v":62},7.0695553021664762E-2,null,{"$f":"'Tracking Checklist'!O61","v":0},null,{"$f":"'Tracking Checklist'!Q61","v":0}]
[null,"Pledge Element 5: Realize Benefits of Recycling and Other Climate Smart Solid Waste Management Practices",{"$f":"'Tracking Checklist'!L73","v":51},5.8152793614595209E-2,null,{"$f":"'Tracking Checklist'!O73","v":0},null,{"$f":"'Tracking Checklist'!Q73","v":0}]
[null,"Pledge Element 6: Reduce Greenhouse Gas Emissions Through Use of Climate-Smart Land Use Tools",{"$f":"'Tracking Checklist'!L89","v":109},0.12428734321550741,null,{"$f":"'Tracking Checklist'!O89","v":0},null,{"$f":"'Tracking Checklist'!Q89","v":0}]
[null,"Pledge Element 7: Plan for Adaptation to Unavoidable Climate Change",{"$f":"'Tracking Checklist'!L113","v":116},{"$f":"C20/$C$26","v":0.13226909920182439},null,{"$f":"'Tracking Checklist'!O113","v":0},null,{"$f":"'Tracking Checklist'!Q113","v":0}]
{"$rows_left_out":7}
{"sheet":"Tracking Checklist","index":3,"n_rows":204,"n_cols":17,"rows_kept":204,"cut":false,"hidden":false,"merged":[]}
[null,null,null,null,null,{"$f":"'Community Summary'!B4","v":"Enter name of your local government here"}]
[null,null,null,null,null,"CSC Certification Tracking Checklist"]
[]
["Priority\nAction","Action \n#","Action Name","Action Pathway Phase","Currently Reviewable","Eligibility Requirements","STATUS","COMMENTS"," Required Documentation","Key Departments","Documentation Status ","Points\nPossible ","Tiered Points","Point Descriptions","Anticipated Points",null,"Awarded Points"]
[null,"Pledge Element 1: Pledge to be Climate Smart Community",null,null,null,null,null,null,null,null,null,{"$f":"SUM(L6:L10)","v":31},null,null,{"$f":"SUM(O6:O10)","v":0},null,{"$f":"SUM(Q6:Q10)","v":0}]
[4,1.1000000000000001,"Pass a resolution adopting the CSC Pledge","Commit","Yes","Certified resolution must be adopted prior to the application date.",null,null,"Certified copy of the adopted resolution and adoption date","Town Clerk",null,4,"N/A","Full points awarded upon evidence of completion"]
[4,1.2,"Create a community Climate Smart Community task force focused on climate mitigation and adaptation","Build Capacity","Yes","Demonstrate that the task force has met at least twice during the past year. The task force must include representatives from the local gov't and from the community (e.g., from environmental groups, universities, faith-based groups, business organizations, etc.).",null,null,"A copy of the memorandum, resolution or executive order establishing the task force, a list of the task force members and the organizations they represent, and meeting minutes from two of the task force meetings within the past year.","Sustainability Collaborative",null,8,"N/A","Full points awarded upon evidence of completion"]
[4,1.3,"Appoint a Climate Smart Community coordinator","Build Capacity","Yes","Local gov't should appoint a staff member or volunteer to act in the role of CSC coordinator. The position must be currently filled to earn points. ",null,null,"Executive memorandum, resolution, meeting minutes, job description, or an organizational chart demonstrating that a staff member or volunteer has been appointed the local gov't’s CSC coordinator (or similar title) ","Office of the highest elected official",null,8,"N/A","Full points awarded upon evidence of completion"]
[4,1.4,"Create an internal green team focused on climate mitigation and adaptation","Build Capacity","Yes","Local gov't should form a green team with a group of representatives from various local gov't departments to support the development and implementation of climate action strategies. Green team meetings should be held on a regular basis.",null,null,"A list of green team members, agendas, and meeting minutes demonstrating involvement in climate action strategies within the past year. Must have met at least three times within the year prior to the submittal date and submit required documentation for those three meetings.","Representatives from participating departments",null,8,"N/A","Full points awarded upon evidence of completion"]
[null,1.5,"Join a national or regional climate campaign or program","Build Capacity","Yes","Commitment to or join another regional or national campaign with a demonstrated commitment to reduction of greenhouse gas emissions and adaptation to effects of climate change. ",null,null,"A list of campaigns or programs joined with the date joined and demonstration of the local gov't's active engagement within the past year such as membership invoices, summary of services obtained, report on progress of actions, presentations and materials to and from the campaign. Campaign or program must support climate efforts (provide campaign description if necessary).","CSC Coordinator or the green team",null,3,"N/A","Full points awarded upon evidence of completion"]
[null,"Pledge Element 2: Set goals, inventory emissions, plan for climate action",null,null,null,null,null,null,null,null,null,{"$f":"SUM(L12+L15+L18)","v":40},null,null,{"$f":"SUM(O12+O15+O18)","v":0},null,{"$f":"SUM(Q12+Q15+Q18)","v":0}]
[null,"Establish a baseline",null,null,null,null,null,null,null,null,null,{"$f":"SUM(L13:L14)","v":16},null,null,{"$f":"SUM(O13:O14)","v":0},null,{"$f":"SUM(Q13:Q14)","v":0}]
[4,2.1,"Develop a gov't operations GHG emissions inventory ","Assess, Plan, Govern","Yes","Conduct a GHG inventory of gov't operations that follows the Local gov't Operations Protocol and includes all Scope 1 and 2 GHG emissions sources relevant to that local gov't.\nThe inventory must have been completed within five years prior to the application date.",null,null,"A copy of most recent local gov't operations GHG inventory report. ","Office of Sustainability;\nOffice of the highest elected official;\nPlanning or environmental departments",null,8,"N/A","Full points awarded upon evidence of completion"]
[4,2.2000000000000002,"Develop a community GHG emissions inventory ","Assess, Plan, Govern","Yes","Complete a community-wide GHG inventory that follows the U.S. Community Protocol.\nThe inventory must have been completed within five years prior to the application date.",null,null,"A copy of the most recent community GHG inventory report. ","Office of Sustainability;\nOffice of the highest elected official;\nPlanning or environmental departments",null,8,"N/A","Full points awarded upon evidence of completion"]
[null,"Set goals",null,null,null,null,null,null,null,null,null,{"$f":"SUM(L16:L17)","v":8},null,null,{"$f":"SUM(O16:O17)","v":0},null,{"$f":"SUM(Q16:Q17)","v":0}]
[4,2.2999999999999998,"Establish a gov't operations emissions reduction target","Assess, Plan, Govern","Yes","Local gov't must establish a GHG emissions reduction target for gov't operations, ideally including short-, medium-, and long-term reduction goals. Target(s) must be currently valid.",null,null,"A copy of any formal documentation, such as a council resolution, report, adopted plan or memorandum stating the established emissions reduction target(s) for gov't operations.","Office of Sustainability;\nOffice of the highest elected official;\nPlanning or environmental departments",null,4,"N/A","Full points awarded upon evidence of completion"]
[4,2.4,"Establish a community emissions reduction target","Assess, Plan, Govern","Yes","Local gov't must establish a GHG emissions reduction target for the community as a whole, ideally including short-, medium-, and long-term reduction goals. Target(s) must be currently valid.",null,null,"A copy of any formal documentation, such as a council resolution, report, adopted plan or memorandum stating the established emissions reduction target(s) for the community.","Office of Sustainability;\nOffice of the highest elected official;\nPlanning or environmental departments",null,4,"N/A","Full points awarded upon evidence of completion"]
[null,"Plan for climate action",null,null,null,null,null,null,null,null,null,{"$f":"SUM(L19:L20)","v":16},null,null,{"$f":"SUM(O19:O20)","v":0},null,{"$f":"SUM(Q19:Q20)","v":0}]
[4,2.5,"Develop a gov't operations climate action plan","Assess, Plan, Govern","Yes","• Perform public outreach and public review of draft plan.\n• Develop and publicly release a gov't operations climate action plan.\n•  Plan must have been released within five years prior to the application date.",null,null,"A publicly released plan that outlines the steps that the gov't will take to reduce emissions, along with documentation, either in the plan or separately, that demonstrates that the local gov't performed public outreach and/or made the draft plan publicly available for comment. ","Office of Sustainability;\nOffice of the highest elected official;\nPlanning or environmental departments",null,8,"Yes","4 PTS: Perform public outreach and public review of draft plan.\n4 PTS: Develop and publicly release a gov't operations climate action plan."]
[4,2.6,"Develop a community climate action plan","Assess, Plan, Govern","Yes","• Perform public outreach and public review of draft plan.\n• Develop and publicly release a community climate action plan.\n• Plan must have been released within five years prior to the application date.",null,null,"A publicly released plan that outlines the steps that the community will take to reduce emissions, along with documentation, either in the plan or separately, that demonstrates that the local gov't performed public outreach or made the draft plan publicly available for comment. ","Office of Sustainability;\nOffice of the highest elected official;\nPlanning or environmental departments",null,8,"Yes","4 PTS: Perform public outreach and public review of draft plan.\n4 PTS: Develop and publicly release a community climate action plan."]
{"$rows_left_out":185}
{"sheet":"Submittal Form","index":4,"n_rows":186,"n_cols":4,"rows_kept":186,"cut":false,"hidden":false,"merged":[[7,1,7,3],[2,1,2,2],[14,1,14,2],[1,1,1,3],[4,0,4,1],[6,1,6,3],[19,1,19,3],[21,1,21,3],[26,1,26,3],[33,1,33,3],[22,1,22,3],[23,1,23,3],[36,2,36,3],[24,1,24,3],[27,1,27,3],[28,1,28,3],[29,1,29,3],[34,2,34,3],[35,2,35,3]]}
[]
["INSTRUCTIONS:"]
[]
[]
["Enter the CSC Certification Action Number è",null,1.1000000000000001]
[]
[]
[null,"          CSC Certification Action Requirements"]
[]
[null,"Action",{"$f":" C5","v":1.1000000000000001},{"$f":"VLOOKUP($C$10,'Tracking Checklist'!$B:$O,2,FALSE)&IF(VLOOKUP($C$10,'Tracking Checklist'!$B:$O,4,FALSE)=\"No\",\" (currently not reviewable)\",\"\")","v":"Pass a resolution adopting the CSC Pledge"}]
[null,null,"Points Possible:",{"$f":"VLOOKUP($C$10,'Tracking Checklist'!$B:$O,11,FALSE)","v":4}]
[null,null,"Tiered Points?",{"$f":"IF(TRIM(VLOOKUP($C$10,'Tracking Checklist'!$B:$O,12,FALSE))=\"Yes\",\"Yes. See point allocations below:\",\"No, not applicable.\")","v":"No, not applicable."}]
[null,null,"Points Description:",{"$f":"TRIM(VLOOKUP($C$10,'Tracking Checklist'!$B:$O,13,FALSE))","v":"Full points awarded upon evidence of completion"}]
[null,null,"Eligibility Requirements:",{"$f":"VLOOKUP($C$10,'Tracking Checklist'!$B:$O,5,)","v":"Certified resolution must be adopted prior to the application date."}]
[null,"Types of Documentation to Submit:",null,{"$f":"VLOOKUP($C$10,'Tracking Checklist'!$B:$O,8,FALSE)","v":"Certified copy of the adopted resolution and adoption date"}]
[null,null,"Key Department(s): ",{"$f":"VLOOKUP($C$10,'Tracking Checklist'!$B:$O,9,)","v":"Town Clerk"}]
[null,null,"Current Status: ",{"$f":"VLOOKUP($C$10,'Tracking Checklist'!$B:$K,6,)","v":0}]
[null,"Document Submittal Form",null,{"$f":"'Tracking Checklist'!F1","v":"Enter name of your local government here"}]
[null,"INSTRUCTIONS:"]
[null,"This section should be completed by the key department that is most familiar with the associated action. Once completed, this form should be emailed to the project coordinator who is collecting documentation for the local government (refer to the bottom of the page). \nThe coordinator should then submit the information to climatechange@dec.ny.gov. If one document is being used to fulfill the requirements of multiple actions, there is no need to submit the document twice, but please complete a submittal form for every action for which you are requesting points (and refer to a previously submitted document, where applicable). \n"]
{"$rows_left_out":167}
{"sheet":"1.2 Example Submittal Form","index":5,"n_rows":186,"n_cols":4,"rows_kept":186,"cut":false,"hidden":false,"merged":[[26,1,26,3],[1,1,1,3],[2,1,2,2],[4,0,4,1],[6,1,6,3],[7,1,7,3],[14,1,14,2],[19,1,19,3],[21,1,21,3],[22,1,22,3],[23,1,23,3],[24,1,24,3],[36,2,36,3],[27,1,27,3],[28,1,28,3],[29,1,29,3],[33,1,33,3],[34,2,34,3],[35,2,35,3]]}
[]
["INSTRUCTIONS:"]
[]
[]
["Enter the CSC Certification Action Number è",null,1.2]
[]
[]
[null,"          CSC Certification Action Requirements"]
[]
[null,"Action",{"$f":" C5","v":1.2},{"$f":"VLOOKUP($C$10,'Tracking Checklist'!$B:$O,2,FALSE)&IF(VLOOKUP($C$10,'Tracking Checklist'!$B:$O,4,FALSE)=\"No\",\" (currently not reviewable)\",\"\")","v":"Create a community Climate Smart Community task force focused on climate mitigation and adaptation"}]
[null,null,"Points Possible:",{"$f":"VLOOKUP($C$10,'Tracking Checklist'!$B:$O,11,FALSE)","v":8}]
[null,null,"Tiered Points?",{"$f":"IF(TRIM(VLOOKUP($C$10,'Tracking Checklist'!$B:$O,12,FALSE))=\"Yes\",\"Yes. See point allocations below:\",\"No, not applicable.\")","v":"No, not applicable."}]
[null,null,"Points Description:",{"$f":"TRIM(VLOOKUP($C$10,'Tracking Checklist'!$B:$O,13,FALSE))","v":"Full points awarded upon evidence of completion"}]
[null,null,"Eligibility Requirements:",{"$f":"VLOOKUP($C$10,'Tracking Checklist'!$B:$O,5,)","v":"Demonstrate that the task force has met at least twice during the past year. The task force must include representatives from the local gov't and from the community (e.g., from environmental groups, universities, faith-based groups, business organizations, etc.)."}]
[null,"Types of Documentation to Submit:",null,{"$f":"VLOOKUP($C$10,'Tracking Checklist'!$B:$O,8,FALSE)","v":"A copy of the memorandum, resolution or executive order establishing the task force, a list of the task force members and the organizations they represent, and meeting minutes from two of the task force meetings within the past year."}]
[null,null,"Key Department(s): ",{"$f":"VLOOKUP($C$10,'Tracking Checklist'!$B:$O,9,)","v":"Sustainability Collaborative"}]
[null,null,"Current Status: ",{"$f":"VLOOKUP($C$10,'Tracking Checklist'!$B:$K,6,)","v":0}]
[null,"Document Submittal Form",null,"Town of Example"]
[null,"INSTRUCTIONS:"]
[null,"This section should be completed by the key department that is most familiar with the associated action. Please reference the information above when completing this section of the form. Once completed, this form should be emailed to the project coordinator who is collecting documentation for the local government (refer to the bottom of the page). \nThe coordinator should then submit the information to the DEC Office of Climate Change. If one document is being used to fulfill the requirements of multiple actions, there is no need to submit the document twice, but please complete a submittal form for every action for which you are requesting points (and refer to a previously submitted document, if applicable). \n"]
{"$rows_left_out":166}